<svg width="47" height="46" viewBox="0 0 47 46" fill="none" xmlns="http://www.w3.org/2000/svg">
<path d="M20.7187 44.2917L1.46871 25.0417C1.17704 24.75 0.969959 24.434 0.847459 24.0937C0.726903 23.7535 0.666626 23.3889 0.666626 23C0.666626 22.6111 0.726903 22.2465 0.847459 21.9062C0.969959 21.566 1.17704 21.25 1.46871 20.9583L20.7187 1.70832C21.2534 1.1736 21.9213 0.893598 22.7225 0.86832C23.5255 0.844987 24.2187 1.12499 24.802 1.70832C25.3854 2.24304 25.6897 2.91096 25.715 3.71207C25.7383 4.51513 25.4583 5.20832 24.875 5.79165L10.5833 20.0833H43.177C44.0034 20.0833 44.6966 20.3623 45.2566 20.9204C45.8147 21.4804 46.0937 22.1736 46.0937 23C46.0937 23.8264 45.8147 24.5186 45.2566 25.0767C44.6966 25.6367 44.0034 25.9167 43.177 25.9167H10.5833L24.875 40.2083C25.4097 40.743 25.6897 41.4236 25.715 42.25C25.7383 43.0764 25.4583 43.7569 24.875 44.2917C24.3402 44.875 23.6597 45.1667 22.8333 45.1667C22.0069 45.1667 21.302 44.875 20.7187 44.2917Z" fill="#A47A5E"/>
</svg>
