<svg width="579" height="120" viewBox="0 0 579 120" fill="none" xmlns="http://www.w3.org/2000/svg">
<path fill-rule="evenodd" clip-rule="evenodd" d="M49.3026 0.956901C27.3496 4.7729 7.44157 23.6219 1.70257 46.0229C-8.87743 87.3229 31.9706 132.148 65.6496 116.197C72.6816 112.867 83.4556 103.185 84.7826 99.0039C85.5216 96.6759 87.3026 96.2029 87.3026 98.3349C87.3026 99.1019 88.2306 102.735 89.3656 106.408C91.4286 113.088 91.4286 113.088 93.9426 111.44C110.368 100.678 120.054 83.5229 121.048 63.4339C122.982 24.3449 88.3326 -5.8271 49.3026 0.956901ZM95.0996 52.6329C95.7596 37.4969 85.9546 26.0109 69.8286 23.0289C63.2466 21.8129 63.0026 21.8139 55.3026 23.0739C43.9186 24.9379 34.6356 31.7739 31.0326 40.9449C29.1576 45.7189 29.2646 45.7499 34.6816 42.0239C52.1106 30.0319 82.8456 37.0909 92.6026 55.3269L94.8026 59.4399L95.0996 52.6329ZM91.2926 67.9649C95.4506 57.9259 85.2666 44.6219 69.5656 39.5799C53.6006 34.4529 35.0266 39.1759 30.7326 49.4539C26.7896 58.8899 41.1606 75.1189 61.8456 84.5879L67.6766 87.2579L72.9066 84.5199C79.5436 81.0449 89.6396 71.9539 91.2926 67.9649ZM60.2376 85.6809C53.1456 82.1899 44.4026 76.3379 39.6216 71.8809C37.5206 69.9229 34.4206 66.5989 32.7306 64.4929L29.6596 60.6639L28.3896 63.7299C27.6916 65.4159 26.2606 67.5729 25.2116 68.5229C22.6426 70.8469 22.8066 73.3849 25.6446 75.2439C27.4966 76.4579 27.9486 77.5799 27.8046 80.6089C27.7016 82.7649 28.2606 85.1869 29.0806 86.1499C30.0236 87.2539 30.3046 88.7959 29.8756 90.5059C27.5596 99.7329 40.4096 100.226 58.7376 91.6139L65.6726 88.3559L60.2376 85.6809ZM86.8956 89.9399L88.1206 82.7949C88.7946 78.8649 89.2176 75.5219 89.0606 75.3639C88.9036 75.2069 86.5046 76.9599 83.7296 79.2589C80.9556 81.5589 77.0236 84.3299 74.9936 85.4169C72.9636 86.5049 71.3026 87.6859 71.3026 88.0419C71.3026 88.9809 76.8206 89.9399 82.2236 89.9399H86.8956ZM81.9616 91.9399C79.5736 91.9399 75.4116 91.2699 72.7116 90.4509C66.8556 88.6739 67.5416 88.7449 66.8586 89.8499C66.5486 90.3509 62.0406 92.4449 56.8386 94.5029L47.3826 98.2459L49.8426 101.17C52.7036 104.571 53.0916 109.904 50.7966 114.304C48.7116 118.301 48.6906 118.283 54.6586 117.667C64.9796 116.602 77.2636 108.05 83.8336 97.3579C87.0456 92.1289 86.9806 91.9399 81.9616 91.9399Z" fill="#A47A5E"/>
<path d="M152.595 26.1899C152.873 26.8779 156.939 37.3399 161.629 49.4399C171.591 75.1401 173.176 80.0368 175.962 80.8581C176.923 81.1414 178.027 80.9399 179.667 80.9399H185.103L191.14 65.6899C194.461 57.3019 198.74 46.3899 200.649 41.4399C202.558 36.4899 204.843 30.7529 205.725 28.6899L207.33 24.9399H201.968H196.606L190.053 43.1899C186.449 53.2269 182.735 63.8319 181.8 66.7549C179.719 73.2579 179.589 73.1389 175.676 61.1189C169.117 40.9689 164.406 29.4649 161.784 27.1899C158.924 24.7079 151.676 23.9189 152.595 26.1899Z" fill="#72897C"/>
<path fill-rule="evenodd" clip-rule="evenodd" d="M219.058 38.8779C206.534 42.9209 200.582 58.5819 207.076 70.4029C217.734 89.7999 246.582 83.2619 248.067 61.1129C249.083 45.9549 233.688 34.1549 219.058 38.8779ZM219.493 71.9139C233.554 80.4869 246.295 60.0429 233.754 49.0309C223.153 39.7229 208.996 52.6949 214.743 66.4499C215.535 68.3459 217.672 70.8039 219.493 71.9139Z" fill="#72897C"/>
<path d="M250.915 40.1309C251.357 40.8509 254.325 45.1699 257.511 49.7279C260.696 54.2859 263.303 58.2829 263.303 58.6099C263.303 58.9369 260.232 63.5319 256.478 68.8219C252.724 74.1119 249.323 79.0029 248.919 79.6899C248.373 80.6189 249.418 80.9349 252.994 80.9199C254.796 80.912 255.922 80.9071 256.89 80.5122C258.505 79.8533 259.676 78.1084 262.803 73.4519C265.553 69.3559 268.135 65.9899 268.542 65.9719C268.948 65.9549 271.537 69.0419 274.295 72.8339C279.793 80.3929 280.612 80.9399 286.424 80.9399C289.477 80.9399 290.145 80.6539 289.344 79.6899C285.502 75.0629 275.303 60.3009 275.303 59.3669C275.303 58.7399 276.785 56.2499 278.595 53.8339C280.406 51.4169 283.594 47.0779 285.68 44.1899L289.473 38.9399H284.581C279.716 38.9399 279.662 38.9759 274.916 45.4399C272.291 49.0149 269.842 51.9209 269.473 51.8979C269.105 51.8749 266.775 49.0619 264.297 45.6479C259.952 39.6619 259.618 39.4289 254.952 39.1309C251.169 38.8899 250.288 39.1079 250.915 40.1309Z" fill="#72897C"/>
<path fill-rule="evenodd" clip-rule="evenodd" d="M304.673 39.0279C300.405 40.2649 293.566 47.3339 292.329 51.7879C287.411 69.4929 298.199 83.0029 316.225 81.7129C324.863 81.0949 332.946 77.0099 331.367 74.0599C329.171 69.9559 327.478 69.4729 323.373 71.7809C315.848 76.0099 306.018 74.4509 302.303 68.4399C299.243 63.4879 299.955 63.1419 313.975 62.7659C328.704 62.3709 331.303 60.9259 331.303 53.1339C331.303 41.6029 318.742 34.9489 304.673 39.0279ZM321.116 55.5549C323.06 54.3539 322.467 50.4429 319.989 48.1139C317.145 45.4419 308.954 45.0949 305.52 47.5009C303.122 49.1799 299.81 54.7809 300.693 55.6639C301.516 56.4859 319.766 56.3899 321.116 55.5549Z" fill="#72897C"/>
<path fill-rule="evenodd" clip-rule="evenodd" d="M400.303 38.6339C395.896 40.2089 394.757 47.7429 398.526 50.3829C401.354 52.3639 404.697 52.3749 406.329 50.4079C407.435 49.0759 407.289 48.9939 405.202 49.7799C402.017 50.9809 398.303 49.5139 398.303 47.0559C398.303 45.4069 399.01 45.1069 402.886 45.1069C408.175 45.1069 408.708 44.7919 407.875 42.1669C407.4 40.6699 403.066 37.6069 402.006 38.0189C401.894 38.0619 401.128 38.3389 400.303 38.6339ZM446.526 39.4969C445.28 40.3689 444.303 40.5889 444.303 39.9969C444.303 39.4159 443.853 38.9399 443.303 38.9399C442.71 38.9399 442.303 42.6069 442.303 47.9399C442.303 53.2729 442.71 56.9399 443.303 56.9399C443.853 56.9399 444.303 55.3489 444.303 53.4049C444.303 50.1919 444.483 49.9659 446.282 50.9289C449.381 52.5869 453.035 51.1479 454.198 47.8109C455.433 44.2689 454.248 40.5159 451.417 39.0009L451.345 38.9625L451.103 38.8326C450.128 38.3084 449.615 38.0325 449.113 38.0506C448.555 38.0708 448.009 38.454 446.858 39.2632C446.753 39.3375 446.642 39.4154 446.526 39.4969ZM470.553 38.6019C468.171 39.5639 469.317 40.5919 472.286 40.1559C477.756 39.3529 478.834 48.7829 473.434 50.1949C470.071 51.0749 468.056 48.7769 468.12 44.1359C468.151 41.8499 467.755 39.7199 467.24 39.4009C466.683 39.0569 466.303 42.5239 466.303 47.9399C466.303 53.7639 466.664 56.8349 467.303 56.4399C467.853 56.0999 468.303 54.5079 468.303 52.9019C468.303 50.1639 468.456 50.0519 470.762 51.1029C472.731 52.0009 473.727 51.8919 475.762 50.5589C481.79 46.6089 477.143 35.9429 470.553 38.6019ZM484.548 39.6669C478.09 45.2969 485.07 55.6089 491.862 50.4719C494.116 48.7669 493.451 48.5529 489.989 49.8689C487.227 50.9189 483.303 48.8739 483.303 46.3829C483.303 45.3039 484.665 44.9399 488.709 44.9399C493.593 44.9399 494.066 44.7499 493.601 42.9729C492.534 38.8899 487.534 37.0639 484.548 39.6669ZM543.803 38.7229C539.228 39.6059 537.723 46.3599 541.303 49.9399C543.687 52.3239 546.213 52.4889 548.862 50.4339C550.705 49.0049 550.676 48.9729 548.303 49.8069C545.056 50.9469 541.303 49.5149 541.303 47.1339C541.303 45.5989 542.141 45.2329 545.985 45.0869C551.607 44.8749 551.935 44.6229 550.55 41.5829C549.407 39.0729 547.085 38.0889 543.803 38.7229ZM381.303 44.9399V50.9399H386.803C391.636 50.9399 392.303 51.1819 392.303 52.9399C392.303 54.0399 392.753 54.9399 393.303 54.9399C394.716 54.9399 394.552 50.1899 393.123 49.7129C392.401 49.4729 391.98 47.3059 392.038 44.1299C392.09 41.2749 391.721 38.9399 391.218 38.9399C390.715 38.9399 390.303 41.4419 390.303 44.4999V50.0609L386.553 49.7499C384.889 49.6124 383.963 49.5359 383.462 49.0348C382.833 48.4065 382.871 47.1107 382.957 44.1899C383.042 41.3019 382.705 38.9399 382.207 38.9399C381.71 38.9399 381.303 41.6399 381.303 44.9399ZM412.303 44.9399C412.303 48.2729 412.747 50.9399 413.303 50.9399C413.853 50.9399 414.303 49.8659 414.303 48.5529C414.303 46.6649 414.931 46.0749 417.309 45.7259C420.863 45.2039 421.303 45.5219 421.303 48.6069C421.303 49.8899 421.753 50.9399 422.303 50.9399C422.859 50.9399 423.303 48.2729 423.303 44.9399C423.303 41.6069 422.859 38.9399 422.303 38.9399C421.753 38.9399 421.303 40.0649 421.303 41.4399C421.303 43.6299 420.87 43.9399 417.803 43.9399C414.736 43.9399 414.303 43.6299 414.303 41.4399C414.303 40.0649 413.853 38.9399 413.303 38.9399C412.747 38.9399 412.303 41.6069 412.303 44.9399ZM429.303 39.8349C431.499 40.4449 431.814 41.1029 431.893 45.2409C432.021 51.9889 433.303 52.3809 433.303 45.6729C433.303 40.3309 433.43 40.0539 436.053 39.6559C437.565 39.4269 436.103 39.2169 432.803 39.1899C428.901 39.1569 427.677 39.3819 429.303 39.8349ZM498.303 44.9399C498.303 50.9529 499.892 53.3349 500.487 48.2129C500.796 45.5479 501.431 45.2879 506.303 45.8289C506.853 45.8899 507.303 47.0649 507.303 48.4399C507.303 49.8149 507.753 50.9399 508.303 50.9399C508.859 50.9399 509.303 48.2729 509.303 44.9399C509.303 41.6069 508.859 38.9399 508.303 38.9399C507.753 38.9399 507.303 40.0649 507.303 41.4399C507.303 43.6299 506.87 43.9399 503.803 43.9399C500.736 43.9399 500.303 43.6299 500.303 41.4399C500.303 40.0649 499.853 38.9399 499.303 38.9399C498.747 38.9399 498.303 41.6069 498.303 44.9399ZM515.053 39.6459C517.057 40.0319 517.303 40.6729 517.303 45.5099C517.303 48.4959 517.753 50.9399 518.303 50.9399C518.853 50.9399 519.303 48.4949 519.303 45.5059C519.303 40.3469 519.442 40.0519 522.053 39.6559C523.566 39.4269 522.103 39.2339 518.803 39.2259C515.503 39.2189 513.816 39.4069 515.053 39.6459ZM528.466 45.1899L528.629 51.4399L529.216 45.9399C529.787 40.5879 529.897 40.4229 533.303 39.8219C534.974 39.5263 535.847 39.3719 535.841 39.2769C535.834 39.173 534.773 39.1404 532.553 39.0719L528.303 38.9399L528.466 45.1899ZM555.303 44.9399C555.303 48.2729 555.747 50.9399 556.303 50.9399C556.853 50.9399 557.303 49.8629 557.303 48.5469C557.303 45.8639 559.078 44.8069 562.207 45.6249C563.595 45.9879 564.303 46.9779 564.303 48.5569C564.303 49.8669 564.753 50.9399 565.303 50.9399C565.859 50.9399 566.303 48.2729 566.303 44.9399C566.303 41.3699 565.873 38.9399 565.24 38.9399C564.656 38.9399 564.318 39.9529 564.49 41.1899C564.761 43.1359 564.296 43.4819 561.053 43.7499C557.615 44.0349 557.303 43.8479 557.303 41.4999C557.303 40.0919 556.853 38.9399 556.303 38.9399C555.747 38.9399 555.303 41.6069 555.303 44.9399ZM405.103 41.1399C407.17 43.2069 406.438 43.9399 402.303 43.9399C399.519 43.9399 398.303 43.5089 398.303 42.5229C398.303 40.0599 403.056 39.0929 405.103 41.1399ZM452.485 42.4399C454.06 45.8969 452.195 49.9399 449.024 49.9399C445.985 49.9399 444.303 48.1589 444.303 44.9399C444.303 39.6949 450.387 37.8359 452.485 42.4399ZM491.103 41.1399C493.221 43.2579 492.408 43.9399 487.768 43.9399C483.543 43.9399 483.306 43.8029 484.303 41.9399C485.49 39.7219 489.244 39.2809 491.103 41.1399ZM549.118 42.1899C549.39 43.6249 548.715 43.9399 545.376 43.9399C542.529 43.9399 541.303 43.5139 541.303 42.5229C541.303 39.5399 548.557 39.2309 549.118 42.1899ZM572.567 44.6579C574.087 44.8869 576.337 44.8809 577.567 44.6439C578.797 44.4069 577.553 44.2189 574.803 44.2259C572.053 44.2339 571.047 44.4279 572.567 44.6579ZM384.703 68.7049C384.098 69.1089 383.34 71.4489 383.019 73.9049C382.698 76.3609 381.731 78.8849 380.869 79.5149C379.146 80.7759 378.711 84.9399 380.303 84.9399C380.853 84.9399 381.303 84.0399 381.303 82.9399C381.303 81.1819 381.97 80.9399 386.803 80.9399C391.636 80.9399 392.303 81.1819 392.303 82.9399C392.303 84.0399 392.753 84.9399 393.303 84.9399C393.853 84.9399 394.303 83.8149 394.303 82.4399C394.303 81.0649 393.853 79.9399 393.303 79.9399C392.753 79.9399 392.303 77.4649 392.303 74.4399C392.303 71.4149 391.966 68.9029 391.553 68.8579C391.14 68.8129 389.678 68.5939 388.303 68.3729C386.928 68.1509 385.308 68.3009 384.703 68.7049ZM415.303 69.0419C414.109 69.8949 414.282 70.0079 416.149 69.5949C419.38 68.8819 421.303 69.7969 421.303 72.0469C421.303 73.4729 420.581 73.9399 418.374 73.9399C415.703 73.9399 412.281 76.0989 412.318 77.7609C412.362 79.6769 414.365 81.1709 416.689 81.0199C416.882 81.0073 417.071 80.9953 417.253 80.9838L417.718 80.9547C420.727 80.7667 422.12 80.6796 422.763 79.9402C423.316 79.3027 423.312 78.1802 423.305 76.0898V76.0866V76.0832V76.0796C423.304 75.8217 423.303 75.5491 423.303 75.2609C423.303 68.7479 419.67 65.9229 415.303 69.0419ZM431.053 68.7399C428.399 69.0609 428.303 69.2809 428.303 75.0059C428.303 78.2949 428.749 80.9399 429.303 80.9399C429.853 80.9399 430.303 78.4649 430.303 75.4399C430.303 69.9959 430.333 69.9399 433.303 69.9399C434.953 69.9399 436.303 69.5649 436.303 69.1069C436.303 68.2369 435.609 68.1879 431.053 68.7399ZM457.791 69.9529C453.821 74.3409 456.211 80.9399 461.77 80.9399C465.765 80.9399 468.303 78.3089 468.303 74.1679C468.303 68.6479 461.457 65.9019 457.791 69.9529ZM473.477 70.2539C470.824 73.0789 470.671 77.0579 473.132 79.2849C475.024 80.9979 480.801 81.5619 481.691 80.1209C481.97 79.6699 480.867 79.4969 479.241 79.7359C475.487 80.2869 473.303 78.4859 473.303 74.8409C473.303 71.0629 477.207 68.2829 480.236 69.9039C481.379 70.5159 482.303 70.5959 482.303 70.0819C482.303 67.2569 476.181 67.3759 473.477 70.2539ZM486.955 69.1749C486.304 69.5899 486.999 69.9159 488.553 69.9249C491.213 69.9399 491.308 70.1269 491.466 75.6899L491.629 81.4399L492.216 75.9799C492.726 71.2379 493.132 70.4289 495.303 69.8299C496.678 69.4499 497.578 69.0639 497.303 68.9719C495.63 68.4109 487.915 68.5619 486.955 69.1749ZM397.437 75.0679L397.466 81.1969L401.672 77.0679C406.873 71.9639 407.303 71.9539 407.303 76.9399C407.303 79.1399 407.64 80.9399 408.053 80.9399C408.466 80.9409 408.803 78.2409 408.803 74.9419C408.803 67.8449 408.503 67.7149 404.181 72.9399C402.362 75.1399 400.52 76.9399 400.088 76.9399C399.656 76.9399 399.303 75.1399 399.303 72.9399C399.303 70.7399 398.876 68.9399 398.355 68.9399C397.834 68.9399 397.421 71.6979 397.437 75.0679ZM440.303 74.9399C440.303 78.2729 440.747 80.9399 441.303 80.9399C441.853 80.9399 442.303 79.5899 442.303 77.9399C442.303 75.1779 442.581 74.9399 445.803 74.9399C449.025 74.9399 449.303 75.1779 449.303 77.9399C449.303 79.5899 449.753 80.9399 450.303 80.9399C450.859 80.9399 451.303 78.2729 451.303 74.9399C451.303 71.6069 450.859 68.9399 450.303 68.9399C449.753 68.9399 449.303 70.0649 449.303 71.4399C449.303 73.6299 448.87 73.9399 445.803 73.9399C442.736 73.9399 442.303 73.6299 442.303 71.4399C442.303 70.0649 441.853 68.9399 441.303 68.9399C440.747 68.9399 440.303 71.6069 440.303 74.9399ZM464.737 70.2679C468.464 72.9939 466.295 79.9399 461.716 79.9399C457.309 79.9399 455.735 73.1519 459.526 70.4969C462.225 68.6059 462.45 68.5959 464.737 70.2679ZM501.303 75.1479V81.3559L505.591 77.1479C510.798 72.0379 511.213 71.9839 510.857 76.4659C510.703 78.4049 510.966 80.2319 511.44 80.5249C511.915 80.8179 512.303 78.2379 512.303 74.7909V68.5239L507.803 72.9399L503.303 77.3559V73.1479C503.303 70.8339 502.853 68.9399 502.303 68.9399C501.744 68.9399 501.303 71.6759 501.303 75.1479ZM517.303 74.9399C517.303 78.2729 517.747 80.9399 518.303 80.9399C518.853 80.9399 519.303 79.5899 519.303 77.9399C519.303 76.2899 519.557 74.9399 519.868 74.9399C520.178 74.9399 521.568 76.2899 522.956 77.9399C524.345 79.5899 525.975 80.9399 526.579 80.9399C527.183 80.9399 526.468 79.6779 524.99 78.1349C521.775 74.7789 521.74 74.4609 524.292 71.7209C525.387 70.5459 526.068 69.3719 525.806 69.1099C525.545 68.8489 524.392 69.8279 523.244 71.2869C520.63 74.6119 519.303 74.6629 519.303 71.4399C519.303 70.0649 518.853 68.9399 518.303 68.9399C517.747 68.9399 517.303 71.6069 517.303 74.9399ZM532.33 75.1899L532.356 81.4399L536.252 77.1899C541.04 71.9669 541.303 71.9539 541.303 76.9399C541.303 79.1399 541.753 80.9399 542.303 80.9399C542.862 80.9399 543.303 78.2039 543.303 74.7319V68.5239L538.803 72.9399C534.048 77.6069 533.571 77.3709 534.251 70.6899C534.349 69.7269 533.95 68.9399 533.366 68.9399C532.726 68.9399 532.314 71.4269 532.33 75.1899ZM390.303 74.9399C390.303 77.711 390.303 78.9463 389.689 79.497C389.195 79.9399 388.304 79.9399 386.696 79.9399C383.818 79.9399 383.212 79.6199 383.696 78.3579C384.03 77.4879 384.303 75.2379 384.303 73.3579C384.303 70.2269 384.555 69.9399 387.303 69.9399C390.236 69.9399 390.303 70.0509 390.303 74.9399ZM421.936 76.1899C421.563 78.6549 420.146 79.9399 417.803 79.9399C414.856 79.9399 413.736 78.3279 415.339 76.3959C416.831 74.5979 422.203 74.4299 421.936 76.1899Z" fill="black"/>
<path d="M340.303 52.9399V80.9399H345.366H350.43L350.116 55.8559L349.803 30.7729L346.537 27.8559L346.297 27.6422C344.317 25.8724 342.991 24.6871 342.103 24.9548C340.302 25.4978 340.302 32.0177 340.303 51.761V52.9399Z" fill="#72897C"/>
</svg>
