<svg style="cursor: pointer" width="22" height="22" viewBox="0 0 42 43" fill="none" xmlns="http://www.w3.org/2000/svg">
  <path
    d="M21 0.666656C9.50002 0.666656 0.166687 9.99999 0.166687 21.5C0.166687 33 9.50002 42.3333 21 42.3333C32.5 42.3333 41.8334 33 41.8334 21.5C41.8334 9.99999 32.5 0.666656 21 0.666656ZM30.6667 14.8333C30.3542 18.125 29 26.125 28.3125 29.8125C28.0209 31.375 27.4375 31.8958 26.8959 31.9583C25.6875 32.0625 24.7709 31.1667 23.6042 30.3958C21.7709 29.1875 20.7292 28.4375 18.9584 27.2708C16.8959 25.9167 18.2292 25.1667 19.4167 23.9583C19.7292 23.6458 25.0625 18.7917 25.1667 18.3542C25.1812 18.2879 25.1792 18.2191 25.1611 18.1537C25.1429 18.0884 25.1091 18.0285 25.0625 17.9792C24.9375 17.875 24.7709 17.9167 24.625 17.9375C24.4375 17.9792 21.5209 19.9167 15.8334 23.75C15 24.3125 14.25 24.6042 13.5834 24.5833C12.8334 24.5625 11.4167 24.1667 10.3542 23.8125C9.04169 23.3958 8.02085 23.1667 8.10419 22.4375C8.14585 22.0625 8.66669 21.6875 9.64585 21.2917C15.7292 18.6458 19.7709 16.8958 21.7917 16.0625C27.5834 13.6458 28.7709 13.2292 29.5625 13.2292C29.7292 13.2292 30.125 13.2708 30.375 13.4792C30.5834 13.6458 30.6459 13.875 30.6667 14.0417C30.6459 14.1667 30.6875 14.5417 30.6667 14.8333Z"
    fill="#A47A5E"/>
</svg>
