<svg width="171" height="69" viewBox="0 0 171 69" fill="none" xmlns="http://www.w3.org/2000/svg">
<path d="M15.5 1.76813C11.602 3.87213 10.241 5.78113 9.581 10.0691C8.889 14.5661 11.189 25.6011 12.791 25.4691C13.456 25.4141 15.125 25.3021 16.5 25.2191C18.89 25.0761 19 24.7881 19 18.6801C19 13.9431 19.481 11.6971 20.858 9.99613L22.716 7.70213L29.108 9.85113C34.534 11.6751 34.896 11.9291 31.5 11.5321L27.5 11.0641L31.5 13.0961C36.821 15.7991 42.661 15.2391 51.097 11.2151C59.147 7.37613 60.467 7.32613 62.726 10.7741C64.706 13.7961 64.786 19.9651 62.96 28.7631C61.898 33.8781 61.739 34.0691 58.555 34.0691C56.738 34.0691 53.282 33.3561 50.876 32.4851C37.656 27.7011 21.884 25.8951 11.767 28.0071C3.612 29.7091 3.86 30.7921 12.143 29.6471C20.783 28.4531 28.357 29.6461 43.5 34.5851C61.699 40.5201 70.988 39.5121 77.091 30.9411C79.985 26.8781 79.084 26.5051 74.937 30.0491C71.006 33.4101 69.476 33.8471 70.485 31.3191C72.428 26.4501 73.404 11.8221 72.057 7.74113C68.837 -2.01487 56.044 -2.67487 47.5 6.47513C44.16 10.0511 40.689 12.0731 38.027 11.9921C35.985 11.9301 36.268 11.6621 39.5 10.5971C41.7 9.87213 43.163 9.17513 42.75 9.04913C41.261 8.59313 39.977 8.31713 38.75 8.18913C38.063 8.11813 36.134 6.77913 34.465 5.21513C32.796 3.65013 30.463 1.85213 29.281 1.21913C26.22 -0.418868 19.021 -0.131868 15.5 1.76813Z" fill="#A47A5E"/>
<path d="M78.298 31.5211C77.087 33.3761 74.421 36.1701 72.373 37.7311C69.015 40.2901 67.904 40.5631 61.074 40.5051C55.092 40.4541 50.7 39.5611 40.175 36.2551C28.263 32.5131 25.795 32.0691 16.893 32.0691C10.46 32.0691 5.708 32.5821 3.468 33.5181C1.561 34.3151 0 35.1441 0 35.3611C0 35.5771 2.94 35.7131 6.533 35.6621C13.968 35.5561 14.134 35.6951 16.57 44.0691C20.639 58.0571 26.039 68.0691 29.513 68.0691C30.139 68.0691 31.577 67.0561 32.709 65.8191C35.486 62.7821 38.304 57.0691 37.026 57.0691C36.462 57.0691 36 57.4641 36 57.9481C36 58.4311 34.639 59.3901 32.974 60.0801C30.371 61.1581 29.682 61.0911 28.034 59.6001C25.645 57.4381 23.162 50.2951 22.325 43.1811C21.851 39.1421 21.989 37.9441 22.868 38.4871C25.754 40.2711 43.701 46.1331 50.708 47.5801C65.387 50.6121 73.135 47.1951 78.661 35.2511C81.594 28.9111 81.388 26.7901 78.298 31.5211Z" fill="#A47A5E"/>
<path d="M36.05 52.2461C33.955 54.4941 34.11 56.3591 36.217 54.2521C38.455 52.0141 39.755 53.0861 42.971 59.8191C47.576 69.4621 49.104 70.0841 54.395 64.4751C56.259 62.4981 58.986 58.6731 60.455 55.9751L63.125 51.0691H59.671C56.885 51.0691 56.103 51.5211 55.63 53.4071C55.307 54.6921 54.088 56.9591 52.92 58.4441C50.429 61.6101 49.532 61.1571 44.868 54.3771C41.539 49.5391 39.117 48.9541 36.05 52.2461Z" fill="#A47A5E"/>
<path d="M88 34.0551C88 35.9641 88.675 36.0381 105.25 35.9491C114.737 35.8991 123.287 35.4391 124.25 34.9281C128.589 32.6241 125.239 32.0691 107 32.0691C88.71 32.0691 88 32.1431 88 34.0551Z" fill="#72897C"/>
<path fill-rule="evenodd" clip-rule="evenodd" d="M88 28.0691V18.5691V9.06913L92.75 9.08413C100.631 9.10813 102.37 10.5771 103.286 17.9791C104.354 26.6091 103.06 28.0691 94.345 28.0691H88ZM106 19.2361C106 14.3771 106.319 10.0831 106.709 9.69313C107.099 9.30313 110.136 9.11613 113.459 9.27713C118.736 9.53213 119.5 9.82213 119.5 11.5691C119.5 13.2461 118.732 13.6181 114.75 13.8741C109.36 14.2201 108.208 16.0691 113.383 16.0691C115.892 16.0691 116.898 16.5711 117.275 18.0111C117.946 20.5771 117.312 21.0691 113.333 21.0691C111.037 21.0691 110 21.5361 110 22.5691C110 23.7211 111.278 24.0691 115.5 24.0691C120.333 24.0691 121 24.3111 121 26.0691C121 27.8911 120.333 28.0691 113.5 28.0691H106V19.2361ZM123 19.1501C123 14.3391 123.3 10.1021 123.667 9.73613C124.033 9.36913 124.933 9.06913 125.667 9.06913C126.659 9.06913 127 10.9861 127 16.5691V24.0691H132.5H138V16.5691C138 9.73613 138.178 9.06913 140 9.06913C141.822 9.06913 142 9.73613 142 16.5691V24.0691H147.277H152.555L155.366 17.6171C156.912 14.0681 157.886 10.6931 157.529 10.1171C157.146 9.49713 157.868 9.06913 159.296 9.06913C161.358 9.06913 162.315 10.3701 165.855 17.9901C168.135 22.8971 170 27.1721 170 27.4901C170 28.4831 166.151 28.1231 165.5 27.0691C165.16 26.5191 162.884 26.0691 160.441 26.0691C157.998 26.0691 156 26.5191 156 27.0691C156 27.6621 152.333 28.0691 147 28.0691C139.121 28.0691 137.992 27.8511 137.932 26.3191C137.874 24.8051 137.734 24.8391 136.894 26.5691C136.044 28.3201 135.119 28.5271 129.461 28.2341L123 27.8981V19.1501ZM94.441 16.0691C95.784 16.0691 97.16 15.6191 97.5 15.0691C97.861 14.4861 96.844 14.0691 95.059 14.0691C93.377 14.0691 92 14.5191 92 15.0691C92 15.6191 93.098 16.0691 94.441 16.0691ZM160.559 21.0691C161.416 21.0691 161.84 20.6191 161.5 20.0691C161.16 19.5191 160.459 19.0691 159.941 19.0691C159.423 19.0691 159 19.5191 159 20.0691C159 20.6191 159.702 21.0691 160.559 21.0691ZM95.5 23.5691C97.058 23.5691 98.521 23.0071 98.75 22.3191C99.033 21.4711 97.989 21.0691 95.5 21.0691C93.011 21.0691 91.967 21.4711 92.25 22.3191C92.479 23.0071 93.942 23.5691 95.5 23.5691ZM123.875 42.4181C123.299 41.7241 123.092 40.7291 123.415 40.2071C123.738 39.6841 125.014 39.5061 126.251 39.8111C128.589 40.3871 129.648 41.3251 134.251 46.8961L137 50.2221V45.2621C137 41.1931 137.349 40.2111 138.942 39.7941C140.01 39.5151 141.135 39.5381 141.442 39.8441C142.383 40.7851 142.06 57.9141 141.09 58.5131C139.446 59.5301 137.197 57.9781 133.572 53.3261L130 48.7411V53.2881C130 56.9941 129.63 57.9331 128.001 58.3581C125.386 59.0421 125.285 58.7751 125.089 50.6241C124.997 46.8051 124.451 43.1121 123.875 42.4181ZM143 42.1111C143 40.3651 143.838 40.1161 150.75 39.8121C155.012 39.6251 158.613 39.3811 158.75 39.2701C158.887 39.1601 159 40.1641 159 41.5031C159 43.4141 158.41 44.0041 156.25 44.2531C153.601 44.5571 153.489 44.8071 153.199 51.0691C153.034 54.6441 152.51 57.9571 152.036 58.4321C150.115 60.3551 149 57.6291 149 51.0101V44.0691H146C143.688 44.0691 143 43.6201 143 42.1111ZM90 51.9601C90 48.5461 89.344 44.7011 88.474 43.0191L86.949 40.0691L93.724 40.0911C102.37 40.1201 105.001 41.8901 105.704 48.1521C106.121 51.8651 105.805 52.9951 103.721 55.2401C101.222 57.9321 93.362 60.0291 91.071 58.6131C90.482 58.2491 90 55.2551 90 51.9601ZM115.5 59.0691C108.094 59.0691 108 58.9421 108 48.9621V40.0691H115C121.333 40.0691 122 40.2591 122 42.0691C122 43.8021 121.333 44.0691 117 44.0691C113.222 44.0691 112 44.4361 112 45.5691C112 46.6381 113.087 47.0691 115.786 47.0691C118.905 47.0691 119.571 47.4211 119.571 49.0691C119.571 50.7171 118.905 51.0691 115.786 51.0691C113.087 51.0691 112 51.5001 112 52.5691C112 53.7211 113.278 54.0691 117.5 54.0691C122.23 54.0691 123 54.3341 123 55.9621C123 58.2921 121.124 59.0691 115.5 59.0691ZM96.443 54.0691C101.159 54.0691 102.938 48.3561 99.169 45.3191C98.316 44.6321 96.804 44.0691 95.809 44.0691C94.305 44.0691 94 44.9121 94 49.0691C94 53.7051 94.178 54.0691 96.443 54.0691Z" fill="black"/>
<path d="M130.2 33.2691C129.54 33.9291 129 34.8291 129 35.2691C129 36.1771 167.021 36.3821 169.355 35.4861C170.19 35.1661 170.629 34.2661 170.33 33.4861C169.6 31.5851 132.087 31.3821 130.2 33.2691Z" fill="#72897C"/>
</svg>
