<svg width="95" height="157" viewBox="0 0 95 157" fill="none" xmlns="http://www.w3.org/2000/svg">
<path d="M0.293437 41.919C0.671437 43.156 3.13544 50.639 5.76944 58.548C12.9584 80.138 12.9284 81.715 4.79644 110.09C2.91744 116.647 1.53644 122.482 1.72844 123.057C2.13144 124.267 12.2894 106.482 16.4044 97.359C23.7914 80.989 23.8404 77.607 16.8914 63.937C9.87544 50.132 -2.01856 34.355 0.293437 41.919Z" fill="#A47A5E"/>
<path d="M80.3104 34.44C50.7794 64.908 44.2504 77.106 49.4234 92.143C53.8524 105.017 83.4324 159.063 83.4324 154.282C83.4324 153.921 80.5294 146.773 76.9814 138.397C64.1504 108.105 58.8644 88.093 61.2644 78.891C63.9834 68.464 72.9944 52.351 87.3944 32.169C97.9824 17.328 96.4044 17.834 80.3104 34.44Z" fill="#A47A5E"/>
<path d="M55.7614 31.281C46.4084 40.722 37.8454 46.643 33.5204 46.66C30.4554 46.672 23.0904 41.962 17.9794 36.722C12.9094 31.524 11.8424 31.585 14.5464 36.919C20.8744 49.403 32.5224 64.669 35.7204 64.669C38.4124 64.669 58.7454 36.906 64.8334 24.919C67.2874 20.087 65.8614 21.087 55.7614 31.281Z" fill="#A47A5E"/>
<path d="M28.2404 106.776C23.5274 111.796 9.27244 137.843 10.5434 139.113C10.8574 139.427 14.7424 136.109 19.1774 131.74C33.5574 117.57 37.9864 119.521 57.4784 148.61C60.9584 153.803 63.9814 157.522 64.1974 156.875C65.1284 154.08 44.2444 110.802 39.1814 105.036C35.2404 100.547 33.8854 100.762 28.2404 106.776Z" fill="#A47A5E"/>
<path d="M31.9324 1.334C24.2104 5.414 23.7504 7.469 30.6824 6.912C43.1234 5.914 48.7934 16.076 42.4854 28.067C39.4654 33.808 40.0294 35.126 44.1224 31.897C51.5424 26.044 53.5874 11.588 47.8484 5.565C42.6194 0.0779982 37.0914 -1.391 31.9324 1.334Z" fill="#72897C"/>
</svg>
