<svg width="184" height="52" viewBox="0 0 184 52" fill="none" xmlns="http://www.w3.org/2000/svg">
<path d="M59.9836 2.49624C59.7106 3.21223 59.6136 9.14106 59.7679 15.6725L60.0479 27.548H63.0153C65.9571 27.548 65.9867 27.4924 66.4774 21.0842L66.9719 14.6204L68.7287 17.8523C71.0235 22.0747 72.9682 21.9355 75.6607 17.3551L77.8527 13.626L78.1445 20.8973C78.4353 28.1527 78.4422 28.1676 81.1119 27.8583L83.7876 27.548L84.0636 14.3061L84.3405 1.06525L81.0961 1.3785C78.3047 1.64898 77.456 2.43658 75.0069 7.03086L72.1611 12.37L69.0828 6.78226C65.96 1.11597 61.3417 -1.05986 59.9836 2.49624Z" fill="#A47A5E"/>
<path d="M90.2171 14.6562V28.1169L99.8614 27.8325C106.685 27.6312 108.68 27.5724 109.375 26.5867C109.662 26.1792 109.727 25.6133 109.818 24.8133C109.929 23.8453 110.001 23.2199 109.737 22.8159C109.256 22.0787 107.657 22.0787 103.141 22.0787C96.3835 22.0787 96.1521 21.9981 96.1521 19.6423C96.1521 17.374 96.5438 17.185 101.84 16.9076C107.224 16.6252 107.544 16.4631 107.84 13.8746C108.152 11.1568 108.115 11.1399 102.152 11.1399C96.8118 11.1399 96.1521 10.9211 96.1521 9.151C96.1521 7.36599 96.8118 7.16213 102.582 7.16213C109.011 7.16213 109.011 7.16213 109.011 4.17882V1.19552H99.6141H90.2171V14.6562Z" fill="#A47A5E"/>
<path fill-rule="evenodd" clip-rule="evenodd" d="M117.525 2.76872C117.194 3.63387 116.919 6.43022 116.913 8.98393C116.898 15.8963 115.835 21.0842 114.438 21.0842C112.823 21.0842 111.938 24.6085 112.651 28.1934C113.348 31.6948 117.914 32.4297 117.914 29.0397C117.914 27.2278 118.573 27.0508 125.332 27.0508C132.091 27.0508 132.751 27.2278 132.751 29.0397C132.751 30.4985 133.411 31.0286 135.224 31.0286C137.531 31.0286 137.697 30.6974 137.697 26.0564C137.697 22.2994 137.334 21.0842 136.213 21.0842C134.993 21.0842 134.729 19.3161 134.729 11.1399V1.19552H126.427C119.769 1.19552 118.006 1.50678 117.525 2.76872ZM128.794 22.0787V14.6204C128.794 7.34312 128.735 7.16213 126.34 7.16213C123.625 7.16213 123.238 8.15557 122.565 16.8579C122.333 19.8484 122.235 21.1259 122.816 21.6716C123.249 22.0787 124.061 22.0787 125.478 22.0787H128.794Z" fill="#A47A5E"/>
<path d="M140.841 16.8111C141.313 20.943 154.018 21.2274 154.018 17.1065C154.018 14.7268 153.73 14.6075 147.271 14.325C140.524 14.0287 140.524 14.0287 140.841 16.8111Z" fill="#A47A5E"/>
<path d="M158.899 2.49624C158.626 3.21223 158.529 9.14106 158.684 15.6725L158.963 27.548H161.931C164.873 27.548 164.902 27.4924 165.393 21.0842L165.888 14.6204L167.644 17.8523C169.916 22.0339 171.672 21.9325 174.706 17.4446L177.165 13.8059L177.462 20.6765C177.746 27.2636 177.859 27.548 180.23 27.548C182.703 27.548 182.703 27.548 182.979 14.3718L183.255 1.19552H180.268C177.671 1.19552 176.87 1.92444 174.159 6.75541L171.038 12.3143L168.071 6.75541C165.057 1.10702 160.277 -1.11157 158.899 2.49624Z" fill="#A47A5E"/>
<path fill-rule="evenodd" clip-rule="evenodd" d="M22.2344 10.3553C20.169 11.3567 18.2857 14.7338 19.2511 15.7033C19.4895 15.944 20.8248 15.2389 22.2176 14.1371C29.3791 8.47379 38.9976 15.234 34.8531 23.0184C33.944 24.7278 26.1218 28.5773 25.28 27.731C25.0624 27.5122 26.7291 25.4786 28.9844 23.2123C33.5187 18.6528 33.1547 15.9977 28.0269 16.2294C25.4937 16.3447 25.5026 16.3656 28.3948 17.0677C33.126 18.2163 28.9606 19.4116 21.992 18.9044L16.1412 18.4788L17.8168 21.3617C18.7387 22.9468 20.2719 24.6672 21.2235 25.1853C23.727 26.5466 23.3482 28.7245 20.4816 29.4484C18.895 29.8482 18.0087 30.771 18.0087 32.023C18.0087 33.275 18.895 34.1978 20.4816 34.5976C23.7735 35.4289 23.6123 36.6143 20.1117 37.3184C15.0096 38.3436 15.7178 44.1163 20.9178 43.8886C21.9455 43.8438 21.718 43.462 20.2343 42.743C16.8306 41.0922 17.527 40.2211 23.2018 39.0278C29.6293 37.6774 31.3297 36.6551 30.5482 34.6095C29.8914 32.8892 25.922 32.376 25.922 34.0119C25.922 34.5588 26.3938 35.0063 26.9695 35.0063C27.5452 35.0063 27.742 35.4538 27.4057 36.0007C26.1465 38.0483 24.9328 36.8818 24.9328 33.625C24.9328 30.5671 25.2503 30.1952 28.3662 29.6085C33.1082 28.7135 37.59 24.6682 38.3497 20.5969C39.877 12.4127 30.4028 6.39144 22.2344 10.3553ZM21.9653 33.0174C22.5094 33.0174 22.9545 32.5699 22.9545 32.023C22.9545 31.4761 22.5094 31.0286 21.9653 31.0286C21.4213 31.0286 20.9762 31.4761 20.9762 32.023C20.9762 32.5699 21.4213 33.0174 21.9653 33.0174Z" fill="#A47A5E"/>
<path d="M26.9111 39.5668L23.4491 40.9918L27.7727 40.5632C30.1506 40.3285 32.577 39.6523 33.1636 39.0626C34.7007 37.5173 31.2021 37.7997 26.9111 39.5668Z" fill="#A47A5E"/>
<path d="M16.5359 1.79318C0.700447 7.61957 -4.61528 29.4802 6.59978 42.6525C24.1306 63.2433 57.8361 45.0451 50.6113 18.8915C49.912 16.3616 49.1563 15.3752 48.1997 15.7441C47.1522 16.1478 47.0375 16.8917 47.7398 18.7473C49.2759 22.8086 48.7596 30.242 46.6112 35.0063C38.3013 53.4342 13.5427 53.4342 5.23276 35.0063C-3.50643 15.6258 18.3144 -4.86059 36.5386 5.61479C41.2044 8.29777 43.6486 7.13627 39.8483 4.04259C35.0746 0.156335 23.911 -0.920638 16.5359 1.79318Z" fill="#72897C"/>
<path fill-rule="evenodd" clip-rule="evenodd" d="M140.111 38.984C139.327 38.984 138.686 38.632 138.686 38.2024C138.686 37.7728 139.543 37.4218 140.592 37.4218C141.639 37.4218 142.281 37.7728 142.017 38.2024C141.752 38.632 140.896 38.984 140.111 38.984ZM61.4554 44.9507C60.858 47.026 60.7284 46.7804 60.672 43.459C60.6097 39.7527 60.7047 39.6135 62.0578 41.4115C62.8561 42.4735 63.5277 43.816 63.5495 44.3948C63.5712 44.9745 64.2528 44.2178 65.0649 42.7132C67.0808 38.9781 68.4557 39.2804 68.4557 43.459C68.4557 45.3733 68.0106 46.9395 67.4665 46.9395C66.9225 46.9395 66.4774 46.1828 66.4774 45.2579C66.4774 43.7683 66.3221 43.7901 65.1193 45.4439C63.8175 47.2329 63.7265 47.209 62.9659 44.888L62.1716 42.4646L61.4554 44.9507ZM73.0127 46.9395C70.3885 46.9395 69.0798 44.6911 70.0017 41.7695C70.7565 39.3808 74.722 39.7219 75.1948 42.216C75.4233 43.4202 74.8931 43.9562 73.4737 43.9562C72.346 43.9562 71.4232 44.4554 71.4232 45.067C71.4232 45.6875 72.2956 45.9481 73.4015 45.6567C74.4895 45.3713 75.3798 45.5423 75.3798 46.0386C75.3798 46.5338 74.3145 46.9395 73.0127 46.9395ZM77.3581 45.4479C77.9021 45.1098 78.3472 43.7096 78.3472 42.3363C78.3472 40.3166 78.7716 39.9009 80.5728 40.1575C82.4671 40.428 82.8291 41.142 83.0042 44.9507C83.117 47.4119 82.9686 48.8667 82.6738 48.1826C82.38 47.4994 81.1001 46.9395 79.831 46.9395C78.5619 46.9395 77.2987 47.4994 77.0238 48.1826C76.7171 48.9483 76.4955 48.7792 76.4471 47.744C76.4045 46.8192 76.8141 45.786 77.3581 45.4479ZM86.7551 45.9451C85.4771 47.0111 85.2901 46.6492 85.4059 43.3317C85.488 41.0027 85.7105 40.3713 85.9717 41.7337C86.2081 42.9717 86.8154 43.7285 87.3199 43.4152C88.8333 42.4745 88.3565 44.6086 86.7551 45.9451ZM90.3329 46.9395C89.3407 46.9395 88.1725 41.8858 88.8926 40.7134C89.1518 40.2917 89.7789 40.2032 90.2854 40.5185C91.4575 41.2464 91.4991 46.9395 90.3329 46.9395ZM95.5754 46.9395C93.4438 46.9395 93.2014 46.5348 93.3429 43.2104C93.4991 39.5389 93.5071 39.531 93.8998 42.7132C94.4349 47.0489 97.1412 47.1175 97.1412 42.7957C97.1412 38.5316 97.7308 39.5121 98.435 44.9507C98.7535 47.4119 98.7783 48.8667 98.4904 48.1826C98.2016 47.4994 96.89 46.9395 95.5754 46.9395ZM102.061 46.3687C101.436 46.9972 101.128 45.958 101.183 43.4093C101.267 39.527 101.278 39.5161 102.146 42.4407C102.689 44.2705 102.657 45.7701 102.061 46.3687ZM103.995 43.5028C102.665 44.3291 102.866 42.5759 104.263 41.1718C105.972 39.4534 106.057 39.5847 105.909 43.7076C105.824 46.0455 105.613 46.5964 105.343 45.1843C105.107 43.9463 104.5 43.1895 103.995 43.5028ZM109.011 46.9395C108.467 46.9395 108.022 45.3733 108.022 43.459C108.022 41.5447 108.467 39.9785 109.011 39.9785C109.555 39.9785 110 40.6497 110 41.4701C110 43.5505 112.723 43.3436 113.275 41.2215C113.524 40.2649 113.727 41.2712 113.727 43.459C113.727 45.6468 113.524 46.6531 113.275 45.6965C112.723 43.5744 110 43.3675 110 45.4479C110 46.2683 109.555 46.9395 109.011 46.9395ZM118.665 46.7605C116.406 46.4363 115.331 43.99 116.315 41.4125C116.907 39.8611 120.881 39.3977 120.881 40.8794C120.881 41.3757 119.991 41.5467 118.903 41.2613C117.28 40.8347 116.924 41.2305 116.924 43.459C116.924 45.6875 117.28 46.0833 118.903 45.6567C119.991 45.3713 120.881 45.5732 120.881 46.1072C120.881 46.6412 119.884 46.9346 118.665 46.7605ZM123.717 45.6C123.233 46.8361 122.999 46.136 122.999 43.459C122.999 40.782 123.233 40.0819 123.717 41.318C124.37 42.9857 124.557 43.0085 125.748 41.5666C126.468 40.6935 127.544 39.9785 128.138 39.9785C128.732 39.9785 128.464 40.7362 127.543 41.6631C125.991 43.2233 125.987 43.4799 127.484 45.1436C128.373 46.131 128.641 46.9395 128.079 46.9395C127.518 46.9395 126.468 46.2245 125.748 45.3514C124.557 43.9095 124.37 43.9324 123.717 45.6ZM131.02 46.6909C130.184 46.9713 129.783 45.9511 129.783 43.5415C129.783 39.8442 131.649 38.463 131.91 41.9673C131.992 43.0612 132.103 44.4783 132.157 45.1167C132.212 45.7542 131.7 46.4632 131.02 46.6909ZM133.67 43.5028C132.598 44.169 132.523 43.7195 133.351 41.5517C134.444 38.6877 135.72 39.9198 135.584 43.7076C135.499 46.0455 135.288 46.5964 135.018 45.1843C134.782 43.9463 134.174 43.1895 133.67 43.5028ZM140.828 44.702C138.14 47.7629 137.681 47.5372 137.796 43.2104C137.881 39.9924 137.99 39.8224 138.599 41.9673L139.304 44.4534L140.717 42.216C142.75 38.995 143.634 39.4494 143.617 43.7076C143.606 46.3628 143.34 47.0211 142.693 45.9928C142.192 45.1983 142.011 44.0795 142.288 43.5067C142.566 42.9329 141.908 43.4719 140.828 44.702ZM150.968 46.9395C148.837 46.9395 148.594 46.5348 148.736 43.2104C148.892 39.5389 148.9 39.531 149.293 42.7132C149.588 45.1088 150.188 45.9451 151.607 45.9451C153.087 45.9451 153.548 45.2092 153.632 42.7132C153.729 39.8124 153.828 39.9337 154.6 43.8936C155.395 47.9628 154.818 51.0495 153.8 48.1826C153.557 47.4994 152.283 46.9395 150.968 46.9395ZM159.468 46.6054C156.952 46.4383 155.817 44.171 156.87 41.4125C157.344 40.1714 161.436 39.2595 161.436 40.3942C161.436 40.6229 161.706 41.5179 162.037 42.383C162.49 43.5694 162.003 43.9562 160.058 43.9562C156.898 43.9562 156.645 45.6269 159.705 46.2872C161.679 46.7138 161.652 46.7496 159.468 46.6054ZM164.096 45.6965C163.848 46.6531 163.644 45.6468 163.644 43.459C163.644 41.2712 163.848 40.2649 164.096 41.2215C164.345 42.1782 165.374 42.9618 166.382 42.9618C167.39 42.9618 168.419 42.1782 168.668 41.2215C168.916 40.2649 169.12 41.2712 169.12 43.459C169.12 45.6468 168.916 46.6531 168.668 45.6965C168.419 44.7398 167.39 43.9562 166.382 43.9562C165.374 43.9562 164.345 44.7398 164.096 45.6965ZM173.455 44.2774C173.357 42.1881 172.72 40.965 171.575 40.6636C170.623 40.414 171.402 40.1644 173.306 40.1088C175.21 40.0541 176.252 40.3395 175.621 40.7432C174.99 41.1459 174.278 42.8176 174.038 44.4564L173.603 47.4367L173.455 44.2774ZM177.933 48.7404C177.69 49.6643 177.441 48.0414 177.378 45.1336C177.265 39.9288 177.305 39.8512 179.983 40.1615C183.611 40.5811 184.089 46.2444 180.538 46.7516C179.348 46.9226 178.175 47.8176 177.933 48.7404ZM72.9069 42.9618C73.7229 42.9618 74.3906 42.5143 74.3906 41.9673C74.3906 41.4204 73.7229 40.9729 72.9069 40.9729C72.0908 40.9729 71.4232 41.4204 71.4232 41.9673C71.4232 42.5143 72.0908 42.9618 72.9069 42.9618ZM79.9685 45.9451C80.745 45.9451 81.3147 44.893 81.3147 43.459C81.3147 42.0917 80.921 40.9729 80.4413 40.9729C79.9606 40.9729 79.3542 42.0917 79.0941 43.459C78.7775 45.1257 79.0654 45.9451 79.9685 45.9451ZM158.963 42.9618C159.78 42.9618 160.447 42.5143 160.447 41.9673C160.447 41.4204 159.78 40.9729 158.963 40.9729C158.147 40.9729 157.48 41.4204 157.48 41.9673C157.48 42.5143 158.147 42.9618 158.963 42.9618ZM178.717 44.9029C179.955 46.9176 182.209 45.9859 182.209 43.459C182.209 41.8898 181.65 40.9729 180.694 40.9729C178.961 40.9729 177.764 43.3536 178.717 44.9029Z" fill="black"/>
<path d="M43.2569 9.11023C42.6615 10.0798 44.7001 14.1232 45.7842 14.1232C46.3283 14.1232 48.6726 9.64623 48.6726 8.60704C48.6726 7.72398 43.8326 8.17446 43.2569 9.11023Z" fill="#72897C"/>
</svg>
