<svg width="640" height="634" viewBox="0 0 640 634" fill="none" xmlns="http://www.w3.org/2000/svg">
<path fill-rule="evenodd" clip-rule="evenodd" d="M168.628 129.451C166.535 129.623 164.585 130.382 164.295 131.138C164.006 131.893 163.176 132.283 162.452 132.006C161.729 131.728 160.796 132.051 160.381 132.723C159.854 133.575 160.051 133.694 161.029 133.115C161.802 132.658 160.034 134.465 157.1 137.129C152.927 140.919 151.862 142.482 152.211 144.306C152.456 145.588 152.269 146.637 151.795 146.637C151.322 146.637 150.934 145.962 150.934 145.137C150.934 142.933 145.318 143.228 141.975 145.607C140.454 146.691 138.849 147.254 138.411 146.857C137.972 146.461 137.931 146.69 138.32 147.367C138.928 148.425 141.934 166.307 141.934 168.867C141.934 170.252 137.639 168.586 135.817 166.494C134.927 165.473 133.755 164.637 133.213 164.637C132.67 164.637 130.923 163.499 129.33 162.109C124.781 158.137 124.472 157.958 123.023 158.441C122.083 158.754 121.915 158.466 122.487 157.517C123.171 156.381 123.041 156.361 121.753 157.404C120.892 158.101 119.568 158.512 118.811 158.318C118.054 158.124 117.758 158.149 118.155 158.374C118.551 158.6 118.326 159.379 117.655 160.106C116.983 160.832 116.119 161.237 115.734 161.004C114.569 160.3 112.895 164.371 113.597 166.201C114.058 167.404 113.835 167.764 112.843 167.416C112.068 167.144 111.496 166.188 111.571 165.29C111.652 164.325 111.244 163.932 110.571 164.327C109.946 164.695 107.73 166.057 105.647 167.353C103.564 168.649 101.357 169.398 100.742 169.019C100.103 168.623 99.9028 168.777 100.274 169.378C100.89 170.375 98.2788 172.133 96.6838 171.796C96.2708 171.708 95.9338 172.063 95.9338 172.584C95.9338 173.105 93.6468 174.68 90.8518 176.084C85.1278 178.959 84.5178 179.12 85.5288 177.482C85.9618 176.783 85.8048 176.599 85.1318 177.015C84.5208 177.392 84.3028 178.435 84.6478 179.333C84.9918 180.231 84.8598 180.709 84.3538 180.397C83.8478 180.084 83.4268 181.473 83.4188 183.482C83.4078 185.993 84.1408 187.884 85.7588 189.522C87.6148 191.402 87.8298 192.088 86.7738 192.757C85.7598 193.4 85.8858 193.61 87.2908 193.622C88.5558 193.632 88.9578 194.132 88.5518 195.189C88.2248 196.043 88.3588 196.492 88.8498 196.189C89.6698 195.682 95.3478 204.111 95.4078 205.923C95.4218 206.356 96.0538 207.093 96.8118 207.562C97.5698 208.03 97.8808 208.914 97.5028 209.525C97.1248 210.137 97.1958 210.637 97.6598 210.637C98.1238 210.637 99.8378 213.11 101.469 216.134C103.1 219.157 104.772 221.632 105.184 221.634C105.596 221.635 105.934 222.312 105.934 223.137C105.934 223.962 106.609 224.637 107.434 224.637C108.259 224.637 108.941 225.2 108.949 225.887C108.959 226.661 109.244 226.756 109.699 226.137C110.103 225.587 111.109 224.989 111.934 224.808C112.759 224.627 114.205 223.785 115.147 222.937C116.089 222.089 117.575 221.669 118.449 222.004C119.323 222.34 119.779 222.195 119.463 221.683C119.146 221.172 120.473 220.001 122.411 219.081C124.349 218.161 125.934 217.01 125.934 216.523C125.934 216.036 126.272 215.75 126.684 215.887C127.615 216.197 130.954 212.776 132.868 209.553C134.466 206.86 135.057 197.637 133.632 197.637C133.13 197.637 132.979 196.962 133.296 196.137C133.612 195.312 133.495 194.637 133.036 194.637C132.576 194.637 131.043 192.889 129.629 190.752C127.744 187.903 125.799 186.438 122.337 185.259L117.616 183.65L110.156 187.239C103.104 190.631 102.606 190.732 101.065 189.091C100.168 188.136 99.9968 187.67 100.684 188.055C101.504 188.514 101.934 188.054 101.934 186.715C101.934 185.373 102.789 184.46 104.434 184.048C105.809 183.703 106.934 182.944 106.934 182.362C106.934 181.78 107.221 181.59 107.571 181.941C108.223 182.593 113.845 179.074 115.169 177.185C116.335 175.521 116.051 170.843 114.757 170.411C114.048 170.175 113.908 169.488 114.406 168.682C115.012 167.701 115.713 168.248 117.041 170.741C118.036 172.609 118.883 173.462 118.924 172.637C118.984 171.41 119.237 171.452 120.315 172.871C121.039 173.825 121.925 174.313 122.283 173.955C122.641 173.597 122.934 173.829 122.934 174.47C122.934 175.112 123.524 175.637 124.245 175.637C124.967 175.637 126.523 176.537 127.704 177.637C128.884 178.737 130.235 179.637 130.705 179.637C131.175 179.637 132.775 180.905 134.26 182.456C135.745 184.006 138.53 185.89 140.447 186.642C142.365 187.395 143.934 188.321 143.934 188.701C143.934 190.202 140.835 191.844 138.939 191.349C137.337 190.93 136.934 191.314 136.934 193.263C136.934 196.894 139.42 202.164 141.98 203.956C143.997 205.369 144.614 205.38 147.783 204.056C149.733 203.241 151.978 202.824 152.773 203.129C153.96 203.584 153.992 203.412 152.953 202.16C152.006 201.019 151.988 200.637 152.883 200.637C157.912 200.637 159.755 187.495 156.528 174.637C156.183 173.262 155.49 168.312 154.989 163.637C154.487 158.962 153.851 154.155 153.576 152.954C153.191 151.276 153.511 150.805 154.962 150.914C155.999 150.992 156.646 151.258 156.4 151.505C156.153 151.751 156.414 152.51 156.979 153.192C158.25 154.723 161.934 153.89 161.934 152.071C161.934 150.181 168.501 145.406 170.554 145.805C172.929 146.265 173.523 148.633 171.267 148.652C169.922 148.664 169.779 148.887 170.731 149.491C172.273 150.468 171.304 151.438 166.187 154.036C163.381 155.461 162.973 156.147 163.187 159.075C163.323 160.939 163.606 162.293 163.817 162.085C164.027 161.876 165.072 162.815 166.139 164.171C168.478 167.144 169.816 167.231 174.319 164.701C178.731 162.223 183.934 162.234 183.934 164.721C183.934 167.136 178.787 170.632 174.194 171.337C169.004 172.134 167.83 173.233 168.969 176.229C170.68 180.73 174.293 184.776 176.164 184.287C177.137 184.033 177.934 184.218 177.934 184.699C177.934 185.18 178.497 185.452 179.184 185.303C179.872 185.154 179.422 185.48 178.184 186.028C176.946 186.575 175.934 187.386 175.934 187.83C175.934 188.274 175.284 188.637 174.49 188.637C173.695 188.637 171.333 190.21 169.24 192.132C167.147 194.055 165.096 195.63 164.684 195.632C163.695 195.639 159.99 199.36 160.483 199.853C160.693 200.063 158.968 201.507 156.65 203.063C154.331 204.618 153.215 205.625 154.169 205.301C155.66 204.794 155.736 204.982 154.707 206.629C154.049 207.683 153.32 208.357 153.089 208.125C152.465 207.502 148.934 212.249 148.934 213.711C148.934 214.404 148.643 214.679 148.287 214.323C147.931 213.968 146.301 216.255 144.664 219.407C143.028 222.558 140.844 226.066 139.811 227.201C137.702 229.521 137.31 231.141 139.131 230.015C139.789 229.609 139.339 230.664 138.131 232.361C136.923 234.058 135.934 236.395 135.934 237.555C135.934 238.715 135.508 240.446 134.988 241.401C132.107 246.688 129.596 275.19 131.266 283.642C131.506 284.86 132.131 288.009 132.727 291.009L132.951 292.137C133.607 295.437 134.534 299.037 135.011 300.137C136.609 303.819 140.144 313.126 140.329 314.137C140.43 314.687 141.764 317.257 143.295 319.848L146.078 324.559L149.218 321.348C150.944 319.582 152.998 318.283 153.781 318.462C154.736 318.68 155 318.251 154.581 317.16C154.217 316.211 154.369 315.788 154.945 316.144C155.489 316.48 155.934 316.072 155.934 315.238C155.934 313.316 164.474 308.235 166.059 309.214C166.803 309.674 166.978 309.517 166.529 308.792C166.137 308.157 166.319 307.637 166.934 307.637C167.549 307.637 167.797 307.224 167.484 306.718C167.172 306.213 168.27 305.502 169.925 305.139C171.58 304.775 172.934 304.016 172.934 303.451C172.934 302.885 173.609 302.682 174.434 302.999C175.259 303.315 175.934 303.175 175.934 302.687C175.934 301.529 187.303 297.762 193.55 296.85C206.555 294.951 223.761 297.116 236.165 302.212C241.667 304.471 242.686 305.231 241.741 306.37C240.785 307.522 241.046 307.647 243.25 307.094C245.206 306.603 246.079 306.852 246.532 308.031C246.871 308.914 247.789 309.637 248.572 309.637C249.356 309.637 250.256 310.312 250.572 311.137C250.889 311.962 251.775 312.637 252.541 312.637C253.307 312.637 253.934 313.387 253.934 314.304C253.934 315.22 254.204 315.701 254.533 315.371C255.145 314.76 259.395 318.824 261.721 322.244C262.429 323.285 262.75 323.462 262.434 322.637C262.118 321.812 262.439 321.985 263.147 323.021C263.855 324.057 265.434 326.132 266.656 327.632C267.878 329.132 268.553 330.684 268.156 331.082C267.759 331.479 268.058 331.654 268.821 331.47C270.332 331.107 272.264 336.293 271.237 337.956C270.9 338.5 271.122 338.639 271.729 338.264C274.083 336.809 278.749 350.886 279.935 363.02C280.92 373.095 279.588 388.472 277.356 392.787C276.574 394.3 275.934 396.37 275.934 397.387C275.934 398.405 275.399 399.772 274.744 400.427C274.09 401.081 273.469 402.184 273.364 402.877C273.002 405.281 268.734 411.631 267.848 411.084C267.358 410.781 267.261 411.344 267.633 412.335C268.247 413.973 268.14 414.001 266.458 412.637C264.711 411.222 264.678 411.271 265.87 413.508C266.565 414.812 266.706 415.614 266.184 415.292C265.663 414.969 264.65 415.8 263.934 417.137C263.218 418.474 262.256 419.336 261.795 419.051C261.334 418.766 261.248 419.344 261.605 420.335C261.961 421.326 261.884 421.802 261.433 421.393C260.982 420.984 260.113 421.65 259.504 422.873C258.894 424.097 257.278 425.668 255.914 426.366C254.55 427.063 253.558 428.118 253.709 428.71C253.86 429.301 253.635 429.574 253.209 429.316C252.338 428.789 250.558 430.603 250.197 432.387C250.067 433.032 252.092 434.999 254.697 436.76C257.302 438.521 259.646 440.138 259.905 440.353C260.164 440.569 259.714 441.16 258.905 441.667C257.882 442.307 258.424 442.465 260.684 442.185C263.021 441.896 263.934 442.184 263.934 443.21C263.934 443.995 264.861 444.637 265.993 444.637C267.31 444.637 267.792 445.058 267.329 445.807C266.858 446.569 267.131 446.775 268.115 446.398C268.961 446.073 270.199 446.618 270.934 447.637C271.669 448.656 272.907 449.201 273.753 448.876C274.637 448.537 275 448.721 274.629 449.321C273.979 450.373 277.935 452.637 280.424 452.637C281.301 452.637 281.67 453.413 281.417 454.726C281.083 456.46 281.263 456.609 282.474 455.604C283.851 454.461 284.392 454.976 283.996 457.056C283.9 457.562 284.522 457.394 285.378 456.684C286.507 455.746 286.934 455.715 286.934 456.57C286.934 457.218 289.366 458.861 292.338 460.222C295.311 461.583 297.972 463.294 298.252 464.024C298.533 464.755 300.181 465.636 301.914 465.983C303.648 466.33 304.845 466.972 304.574 467.411C304.303 467.85 304.835 468.271 305.757 468.348C306.68 468.425 308.109 468.593 308.934 468.72C312.003 469.195 316.034 468.608 315.512 467.763C315.015 466.959 318.978 464.454 327.934 459.912C329.859 458.936 331.585 457.797 331.769 457.381C331.954 456.965 332.521 456.882 333.03 457.197C333.54 457.511 335.339 456.386 337.029 454.696C338.719 453.006 340.55 451.9 341.098 452.238C341.646 452.577 342.76 451.902 343.575 450.74C344.937 448.794 350.934 444.977 350.934 446.055C350.934 446.313 352.384 445.2 354.157 443.581C355.929 441.962 357.842 440.644 358.407 440.652C358.972 440.661 358.759 441.145 357.934 441.728C356.601 442.671 356.601 442.744 357.934 442.38C358.759 442.155 359.444 441.333 359.456 440.554C359.469 439.738 360.254 439.271 361.307 439.454C362.401 439.644 362.87 439.343 362.475 438.704C362.113 438.117 362.516 437.637 363.372 437.637C364.228 437.637 366.617 436.144 368.681 434.318C370.745 432.493 374.122 429.981 376.184 428.737C378.247 427.492 379.934 426.069 379.934 425.574C379.934 425.08 381.069 424.39 382.457 424.042C383.845 423.693 385.609 422.511 386.377 421.414C387.252 420.166 388.271 419.708 389.104 420.189C389.836 420.612 390.09 420.579 389.67 420.117C388.686 419.033 393.93 413.516 395.198 414.3C395.725 414.626 397.681 413.178 399.545 411.083C401.409 408.988 402.934 407.665 402.934 408.144C402.934 408.623 403.779 408.142 404.811 407.076C407.491 404.309 410.439 401.972 412.941 400.633C414.131 399.996 414.879 399.249 414.603 398.973C413.943 398.313 417.636 394.637 418.959 394.637C419.522 394.637 420.385 393.582 420.875 392.293C421.365 391.004 423.154 389.374 424.85 388.672C426.546 387.969 427.934 386.994 427.934 386.504C427.934 386.014 430.521 382.97 433.684 379.739C436.847 376.509 441.234 371.743 443.434 369.148C445.634 366.552 448.672 363.11 450.184 361.499C451.697 359.887 452.934 358.192 452.934 357.733C452.934 356.951 459.884 347.731 462.671 344.816C463.365 344.089 463.934 342.959 463.934 342.305C463.934 341.652 465.064 339.898 466.445 338.409C467.826 336.92 468.838 335.341 468.695 334.9C468.392 333.97 472.48 328.516 473.051 329.087C473.262 329.297 473.502 328.332 473.585 326.943C473.668 325.553 474.925 322.232 476.379 319.561C477.832 316.891 479.698 312.427 480.525 309.642C481.352 306.857 482.458 304.843 482.982 305.166C483.505 305.49 483.934 304.833 483.934 303.707C483.934 302.581 484.943 298.167 486.177 293.898C489.165 283.557 489.363 261.274 486.573 249.137C485.562 244.737 484.712 240.462 484.683 239.637C484.655 238.812 484.362 237.912 484.033 237.637C482.478 236.338 479.073 228.439 479.542 227.217C479.832 226.459 479.595 225.545 479.014 225.186C478.358 224.781 478.171 225.216 478.521 226.335C479.053 228.036 479.022 228.039 477.955 226.379C477.334 225.412 477.102 224.175 477.439 223.629C477.776 223.083 477.575 222.637 476.993 222.637C476.411 222.637 475.934 222.168 475.934 221.595C475.934 221.022 475.023 219.575 473.909 218.38C472.796 217.185 472.107 215.629 472.378 214.922C472.649 214.215 472.387 213.637 471.796 213.637C471.204 213.637 470.988 212.939 471.316 212.085C471.678 211.142 471.497 210.789 470.856 211.185C469.674 211.916 466.839 208.599 467.597 207.373C467.864 206.941 467.689 206.711 467.208 206.862C466.727 207.013 463.544 204.228 460.134 200.672C456.724 197.116 453.934 194.484 453.934 194.823C453.934 195.162 452.484 194.085 450.711 192.429C448.938 190.773 446.576 189.018 445.461 188.53C442.279 187.136 439.506 185.25 438.634 183.887C438.194 183.2 437.069 182.638 436.134 182.64C435.199 182.641 432.634 181.748 430.434 180.654C416.136 173.546 402.809 171.075 383.337 171.922C376.24 172.23 369.084 172.82 367.434 173.233C365.784 173.645 363.239 174.018 361.779 174.06C360.32 174.102 359.334 174.475 359.589 174.887C359.843 175.299 359.913 175.639 359.743 175.641C359.433 175.646 348.221 179.73 342.227 182.023C340.463 182.698 338.213 183.919 337.227 184.737C336.241 185.554 334.196 186.842 332.684 187.599C331.172 188.356 329.934 189.288 329.934 189.67C329.934 190.052 328.021 191.662 325.684 193.248C323.347 194.834 321.074 196.695 320.634 197.384C320.194 198.073 319.182 198.637 318.384 198.637C317.587 198.637 316.934 199.309 316.934 200.131C316.934 200.952 315.149 202.917 312.968 204.498C310.786 206.078 309.324 207.728 309.718 208.164C310.112 208.601 309.864 208.629 309.168 208.228C308.471 207.827 308.146 207.102 308.446 206.618C308.745 206.134 307.965 205.191 306.712 204.524C304.038 203.099 301.916 200.476 302.575 199.409C302.829 198.997 302.38 198.912 301.576 199.221C300.693 199.56 299.877 199.032 299.513 197.887C299.183 196.845 297.23 195.042 295.173 193.88C293.117 192.719 289.759 190.226 287.711 188.342C285.663 186.458 283.749 185.155 283.457 185.447C283.165 185.739 281.882 184.997 280.606 183.798C279.33 182.6 278.04 181.865 277.739 182.165C276.944 182.961 271.934 180.497 271.934 179.31C271.934 178.756 271.658 178.58 271.321 178.917C270.729 179.509 265.876 177.939 259.24 175.007C252.503 172.031 225.542 170.516 216.434 172.602C212.419 173.521 204.888 174.724 201.757 174.947C200.835 175.012 200.27 175.371 200.501 175.745C200.731 176.118 199.84 176.695 198.52 177.026C197.2 177.357 195.329 177.932 194.363 178.303C193.163 178.763 192.835 178.606 193.329 177.807C193.727 177.163 195.038 176.63 196.243 176.622C198.024 176.609 198.153 176.425 196.934 175.637C195.699 174.839 195.684 174.665 196.851 174.652C197.63 174.644 197.971 174.341 197.609 173.979C197.247 173.617 197.434 172.74 198.024 172.029C198.614 171.318 199.083 168.031 199.067 164.724C199.041 159.278 198.678 158.259 195.218 153.924C193.117 151.291 190.506 148.982 189.416 148.792C186.816 148.339 186.93 148.531 186.341 143.639C186.059 141.301 185.151 138.712 184.324 137.884C183.496 137.056 183.065 135.739 183.365 134.956C183.711 134.054 183.487 133.795 182.753 134.249C181.972 134.732 181.809 134.406 182.253 133.249C182.659 132.19 182.516 131.777 181.879 132.171C181.311 132.522 179.853 132.17 178.64 131.388C175.778 129.543 173.308 129.065 168.628 129.451ZM155.177 142.637C155.349 142.637 156.26 141.737 157.202 140.637C158.144 139.537 158.485 138.637 157.959 138.637C157.434 138.637 156.523 139.537 155.934 140.637C155.345 141.737 155.004 142.637 155.177 142.637ZM399.934 199.412C399.934 198.866 398.154 198.597 395.943 198.808C393.747 199.017 391.758 198.727 391.521 198.163C391.285 197.599 391.056 197.726 391.013 198.446C390.97 199.166 390.54 199.512 390.059 199.214C389.578 198.917 389.184 199.698 389.184 200.951C389.184 203.058 389.844 203.319 397.977 204.426C402.813 205.085 408.044 206.149 409.602 206.792C411.159 207.434 412.804 207.877 413.255 207.775C414.3 207.539 422.192 211.808 423.169 213.137C423.573 213.687 423.91 213.778 423.919 213.339C423.927 212.9 425.928 213.913 428.364 215.589C430.801 217.265 433.031 218.637 433.32 218.637C433.609 218.637 435.755 220.633 438.09 223.072C440.424 225.512 442.694 227.285 443.134 227.013C443.574 226.741 443.935 227.108 443.936 227.828C443.938 228.548 445.34 230.712 447.052 232.637C448.765 234.562 449.816 235.462 449.389 234.637C448.963 233.812 448.999 233.488 449.469 233.916C449.94 234.344 450.409 235.244 450.512 235.916C450.614 236.588 452.498 240.962 454.698 245.637C459.751 256.375 460.804 259.8 461.153 266.637C461.447 272.39 463.417 276.092 464.904 273.686C465.533 272.668 465.801 272.686 466.233 273.774C467.153 276.089 466.757 263.293 465.827 260.637C465.345 259.262 464.822 257.237 464.664 256.137C464.506 255.037 463.987 253.513 463.512 252.751C463.037 251.989 462.569 250.639 462.473 249.751C462.175 247.007 460.036 242.637 458.99 242.637C458.444 242.637 458.284 241.888 458.635 240.973C459.031 239.943 458.874 239.556 458.226 239.957C457.628 240.326 456.938 239.431 456.621 237.871C456.315 236.367 454.212 233.218 451.949 230.873C449.685 228.528 448.065 226.233 448.349 225.774C448.633 225.314 447.756 224.345 446.4 223.619C445.044 222.893 443.934 221.714 443.934 220.999C443.934 220.285 443.304 219.942 442.534 220.237C441.631 220.583 441.187 220.141 441.284 218.994C441.368 217.989 440.63 217.048 439.589 216.834C438.575 216.625 436.118 214.92 434.13 213.044C431.585 210.644 429.912 209.803 428.475 210.202C426.974 210.618 426.8 210.515 427.816 209.812C428.938 209.036 428.844 208.743 427.316 208.258C426.281 207.93 425.034 207.694 424.546 207.734C424.057 207.775 423.382 207.423 423.046 206.952C422.148 205.696 417.131 203.637 414.97 203.637C413.942 203.637 412.925 203.109 412.71 202.465C412.491 201.807 409.603 201.096 406.127 200.845C402.721 200.598 399.934 199.953 399.934 199.412ZM118.659 201.307C117.991 201.72 117.832 201.345 118.233 200.301C118.584 199.386 118.773 198.655 118.653 198.676C117.189 198.938 112.025 201.681 111.551 202.448C110.712 203.806 111.916 206.766 113.027 206.079C113.513 205.779 113.643 206.231 113.316 207.085C112.428 209.399 114.392 208.964 117.808 206.09C119.592 204.588 120.607 202.948 120.28 202.096C119.974 201.3 119.245 200.945 118.659 201.307Z" fill="#A47A5E"/>
<path d="M69.3378 188.672C67.1908 189.691 64.4028 191.425 63.1428 192.524C61.0128 194.383 60.8978 195.039 61.5118 201.828C61.8748 205.846 62.5678 210.175 63.0528 211.45C63.5378 212.724 63.9338 216.245 63.9338 219.274C63.9338 223.869 63.7118 224.561 62.5918 223.458C61.8538 222.732 59.7488 221.012 57.9128 219.637C52.2778 215.417 49.9328 212.975 50.6998 212.127C51.1038 211.681 50.8498 211.653 50.1358 212.065C49.3408 212.524 47.8358 211.812 46.2498 210.226C42.9838 206.96 38.2418 206.824 32.9918 209.846C27.2128 213.172 26.5128 214.853 28.4618 220.72C29.3628 223.433 30.4378 225.444 30.8498 225.189C31.5698 224.744 31.7488 225.332 32.1718 229.523C32.2768 230.561 32.8288 231.233 33.3978 231.016C34.7028 230.52 40.2658 240.29 39.4398 241.627C39.0768 242.215 39.5588 242.352 40.6318 241.966C41.6228 241.61 42.1118 241.674 41.7188 242.109C41.0048 242.899 45.2158 250.953 47.6568 253.465C48.3658 254.195 49.3808 255.603 49.9098 256.593C51.4418 259.455 55.4188 259.669 58.2518 257.043C59.6088 255.785 61.0478 255.066 61.4508 255.446C61.8528 255.826 61.8238 255.012 61.3848 253.637C60.9458 252.262 60.6318 250.012 60.6868 248.637C60.7408 247.262 60.5458 246.731 60.2528 247.457C59.8648 248.42 59.3278 248.216 58.2688 246.705C57.4708 245.566 57.1408 244.072 57.5358 243.385C57.9308 242.699 57.8838 242.473 57.4308 242.883C56.4838 243.742 52.9338 238.351 52.9338 236.054C52.9338 235.21 52.5838 234.735 52.1568 234.999C51.7298 235.263 50.6258 234.165 49.7038 232.558C48.7808 230.952 48.4558 229.637 48.9808 229.637C49.5048 229.637 49.9338 230.114 49.9338 230.696C49.9338 231.278 50.3518 231.497 50.8618 231.181C51.3718 230.866 52.0878 231.547 52.4518 232.695C52.8238 233.865 53.6908 234.561 54.4258 234.278C55.1478 234.001 57.5768 235.737 59.8238 238.135C62.0718 240.533 64.8158 242.782 65.9218 243.133C67.0288 243.484 67.9338 244.36 67.9338 245.079C67.9338 246.796 73.5848 247.894 75.9378 246.635C80.0248 244.448 80.9828 242.566 80.8028 237.079C80.6978 233.861 80.2338 231.951 79.6468 232.315C79.0528 232.682 78.8438 231.701 79.1188 229.832C79.3918 227.972 79.1838 226.983 78.5958 227.346C78.0178 227.703 77.8488 227.068 78.1828 225.794C78.4928 224.609 78.3578 223.399 77.8838 223.106C77.4088 222.813 77.2748 221.912 77.5848 221.105C77.8938 220.298 77.6498 219.637 77.0408 219.637C76.4318 219.637 75.9698 218.625 76.0128 217.387C76.0558 216.149 76.3098 215.674 76.5778 216.331C76.8448 216.987 77.6538 217.298 78.3748 217.021C79.7428 216.496 81.4778 220.866 81.0018 223.637C80.8598 224.462 81.0828 224.803 81.4968 224.396C82.6188 223.291 84.9338 225.597 84.9338 227.818C84.9338 229.042 85.3648 229.489 86.1038 229.032C86.8888 228.547 87.0648 228.853 86.6398 229.961C86.2908 230.87 86.3948 231.506 86.8698 231.375C87.3448 231.244 87.8168 231.587 87.9188 232.137C88.9618 237.771 99.0238 236.176 100.167 230.196C100.43 228.822 100.26 227.935 99.7898 228.226C99.3188 228.517 98.9338 228.045 98.9338 227.176C98.9338 226.308 97.8068 223.812 96.4298 221.63C95.0518 219.448 94.0398 217.095 94.1798 216.4C94.3198 215.705 93.8878 215.244 93.2198 215.375C92.5438 215.508 92.2458 214.987 92.5478 214.202C92.8548 213.401 92.1908 212.31 91.0118 211.679C89.8688 211.067 88.9338 209.682 88.9338 208.602C88.9338 207.521 88.4358 206.637 87.8268 206.637C87.2178 206.637 86.9678 205.991 87.2708 205.202C87.5738 204.412 87.4668 203.625 87.0328 203.452C85.9388 203.015 77.9338 191.116 77.9338 189.926C77.9338 189.394 76.8778 188.477 75.5878 187.889C73.7508 187.052 72.3938 187.222 69.3378 188.672Z" fill="#A47A5E"/>
<path fill-rule="evenodd" clip-rule="evenodd" d="M224.407 112.076C221.684 114.416 221.12 115.636 220.648 120.22C220.531 121.366 219.891 122.304 219.228 122.304C218.565 122.304 218.254 121.929 218.537 121.47C218.82 121.012 218.575 120.637 217.993 120.637C217.411 120.637 216.934 119.962 216.934 119.137C216.934 118.304 216.045 117.637 214.934 117.637C213.834 117.637 212.934 118.162 212.934 118.804C212.934 119.445 212.671 119.707 212.349 119.386C212.028 119.064 210.903 119.539 209.849 120.441C208.219 121.838 207.934 123.455 207.934 131.326C207.934 140.511 207.956 140.592 211.343 143.98C213.219 145.855 216.144 148.005 217.843 148.757C219.543 149.51 220.934 150.465 220.934 150.881C220.934 151.297 222.086 151.637 223.493 151.637C224.9 151.637 225.843 151.975 225.588 152.387C225.333 152.799 226.485 153.095 228.148 153.045C230.282 152.98 231.641 152.18 232.765 150.327C234.264 147.857 234.226 147.523 232.116 144.669C229.658 141.344 230.516 140.852 234.857 143.097C236.41 143.9 237.962 144.275 238.307 143.93C238.652 143.586 238.934 143.79 238.934 144.383C238.934 145.15 239.787 145.141 241.872 144.354C243.488 143.744 244.606 142.915 244.356 142.51C244.106 142.106 244.359 141.493 244.918 141.147C245.477 140.802 245.934 139.866 245.934 139.069C245.934 137.246 240.471 131.433 239.588 132.316C239.228 132.676 238.934 132.445 238.934 131.804C238.934 131.162 238.232 130.637 237.375 130.637C236.518 130.637 236.091 130.192 236.427 129.648C236.79 129.06 236.339 128.928 235.312 129.322C233.99 129.829 233.737 129.593 234.229 128.311C234.582 127.39 234.435 126.637 233.903 126.637C233.37 126.637 232.934 124.21 232.934 121.244C232.934 117.205 232.529 115.696 231.321 115.232C230.064 114.75 229.964 114.305 230.87 113.214C232.301 111.49 230.817 110.361 228.36 111.304C227.163 111.763 226.835 111.606 227.329 110.807C228.445 109.002 227.514 109.406 224.407 112.076ZM224.168 137.967C226.354 138.517 226.366 138.486 224.493 137.087C222.343 135.481 220.514 135.148 221.359 136.516C221.658 137 222.922 137.653 224.168 137.967ZM228.934 141.137C229.484 140.797 229.934 140.321 229.934 140.078C229.934 139.835 229.484 139.637 228.934 139.637C228.384 139.637 227.934 140.114 227.934 140.696C227.934 141.278 228.384 141.477 228.934 141.137Z" fill="#A47A5E"/>
<path fill-rule="evenodd" clip-rule="evenodd" d="M376.434 0.599111C370.473 1.90911 359.427 6.86911 349.63 12.6351C344.846 15.4511 340.413 17.4331 339.779 17.0411C339.066 16.6001 338.897 16.7671 339.336 17.4781C339.767 18.1761 338.942 19.1081 337.24 19.8471C335.697 20.5181 332.748 22.0991 330.688 23.3621C322.271 28.5191 315.749 31.6401 314.718 31.0041C314.117 30.6321 313.896 30.7671 314.227 31.3031C314.559 31.8391 312.266 33.7731 309.132 35.6011C305.998 37.4291 300.959 40.3751 297.934 42.1481C293.078 44.9951 287.785 47.9301 277.434 53.5181C275.784 54.4081 274.209 55.3821 273.934 55.6821C272.308 57.4531 265.594 60.5531 264.607 59.9881C263.962 59.6191 263.762 59.6791 264.163 60.1231C265.163 61.2271 250.157 69.8931 248.751 69.0241C248.117 68.6321 247.9 68.7731 248.255 69.3481C249.455 71.2891 237.875 71.6581 176.67 71.6291L173.985 71.6278C121.545 71.6021 111.87 71.5974 103.624 75.0275C101.759 75.8035 99.9663 76.7553 97.7684 77.9225L97.2718 78.1861C90.4198 81.8221 78.6478 92.8121 77.4018 96.7381C77.0648 97.7981 76.4468 98.4541 76.0288 98.1961C75.6098 97.9371 75.2288 98.2681 75.1828 98.9311C75.1368 99.5941 73.8938 103.012 72.4208 106.525C68.6488 115.523 67.9808 121.856 67.9258 149.137L67.8778 173.137L59.6558 177.75C55.1338 180.287 46.7878 185.012 41.1088 188.25C35.4308 191.488 28.7798 195.217 26.3288 196.538C23.8778 197.858 19.9008 200.675 17.4898 202.797C15.0788 204.919 12.9168 206.313 12.6838 205.896C12.4518 205.479 12.3798 205.65 12.5238 206.277C12.6688 206.904 12.0258 208.254 11.0948 209.277C7.47476 213.255 3.02076 221.4 1.42076 226.967C0.118761 231.497 -0.177239 235.87 0.0897606 246.59L0.433761 260.383L4.89576 269.26C7.34976 274.142 9.64976 278.362 10.0068 278.637C11.4368 279.741 13.8088 285.434 13.1438 286.171C12.7538 286.603 12.9968 286.634 13.6838 286.238C14.3928 285.83 14.9338 286.045 14.9338 286.734C14.9338 287.402 15.9948 289.341 17.2918 291.043C18.5888 292.745 20.8898 296.612 22.4058 299.637C23.9218 302.662 25.8298 305.896 26.6458 306.824C27.4618 307.752 27.7908 309.059 27.3768 309.728C26.9618 310.401 27.0418 310.688 27.5558 310.371C28.4898 309.793 38.5968 326.481 38.1648 327.887C38.0378 328.299 38.3008 328.637 38.7498 328.637C39.8308 328.637 44.0318 336.158 43.4148 336.989C43.1498 337.346 43.2268 337.419 43.5858 337.152C44.4428 336.514 46.9318 341.348 46.5548 342.918C46.3938 343.588 46.4618 343.766 46.7058 343.314C46.9498 342.861 48.2478 344.106 49.5898 346.081C50.9318 348.056 51.7138 350.184 51.3278 350.809C50.8638 351.559 51.0758 351.668 51.9488 351.127C52.9188 350.528 53.0978 350.769 52.6148 352.025C52.2238 353.046 52.3578 353.493 52.9468 353.129C53.4918 352.792 54.3838 353.556 54.9298 354.827C55.4758 356.097 57.7058 360.062 59.8848 363.637C60.7483 365.054 61.5215 366.254 62.2136 367.329C63.4233 369.208 64.3853 370.702 65.1493 372.291C68.1165 378.463 68.0968 386.071 68.0002 423.227C67.9859 428.702 67.97 434.818 67.9618 441.666C67.9128 482.281 68.2718 507.99 68.9458 512.213C70.1618 519.825 73.5758 528.803 77.5818 534.921C84.4368 545.392 100.656 556.246 118.149 562.069C125.641 564.563 126.616 564.637 151.864 564.637C176.929 564.637 177.903 564.71 178.945 566.658C179.54 567.769 179.711 569.189 179.326 569.812C178.918 570.472 179.069 570.672 179.687 570.29C180.611 569.719 186.045 578.211 194.942 594.132C201.171 605.277 209.819 614.856 217.092 618.667C219.104 619.721 220.904 620.95 221.092 621.397C221.507 622.385 229.973 627.434 235.32 629.882C248.108 635.737 269.708 634.278 282.567 626.691C284.503 625.549 286.573 624.914 287.165 625.28C287.806 625.676 287.953 625.477 287.529 624.792C287.137 624.157 287.206 623.637 287.684 623.637C288.161 623.637 291.225 622.019 294.493 620.041C297.76 618.064 303.795 614.626 307.903 612.401C316.253 607.88 317.741 607.039 330.263 599.765C335.119 596.945 339.506 594.637 340.013 594.637C340.519 594.637 340.934 594.139 340.934 593.53C340.934 592.894 341.666 592.704 342.654 593.083C343.599 593.446 344.061 593.431 343.68 593.05C342.991 592.36 347.374 589.612 355.934 585.368C358.409 584.141 361.055 582.549 361.813 581.829C362.571 581.11 363.832 580.768 364.615 581.068C365.398 581.368 365.813 581.25 365.538 580.806C364.633 579.341 386.489 567.244 388.168 568.281C388.788 568.665 388.954 568.479 388.561 567.842C386.75 564.912 392.729 564.637 458.15 564.637C512.102 564.637 525.517 564.373 529.95 563.223C532.949 562.445 535.709 561.998 536.083 562.229C536.457 562.46 536.914 562.309 537.099 561.893C537.283 561.477 540.52 559.562 544.292 557.637C551.263 554.079 561.083 545.14 563.812 539.868C564.589 538.366 565.722 536.806 566.329 536.402C566.937 535.998 567.045 535.661 566.569 535.652C566.093 535.644 566.39 534.59 567.229 533.309C571.292 527.109 571.934 521.362 571.935 491.205L571.936 462.137L579.685 457.87C583.947 455.524 589.806 452.241 592.705 450.575C595.605 448.909 598.487 447.861 599.11 448.246C599.789 448.665 599.968 448.5 599.556 447.834C598.706 446.459 604.538 443.274 606.118 444.251C606.792 444.667 606.966 444.497 606.551 443.827C606.127 443.141 607.903 441.682 611.147 440.052C617.271 436.976 629.396 427.511 630.963 424.583C631.552 423.482 632.531 422.888 633.139 423.264C633.746 423.639 633.978 423.518 633.655 422.994C633.331 422.47 634.611 418.972 636.5 415.219L639.934 408.396L639.933 391.767C639.932 375.537 639.863 374.991 637.065 369.076C635.488 365.742 632.997 361.113 631.53 358.789C630.062 356.464 629.173 354.06 629.552 353.445C629.937 352.823 629.795 352.605 629.231 352.953C628.406 353.464 623.529 346.116 622.06 342.147C621.854 341.592 620.141 338.773 618.254 335.883C616.3 332.891 615.13 330.092 615.538 329.383C615.932 328.698 615.894 328.463 615.453 328.862C614.787 329.464 605.934 316.522 605.934 314.947C605.934 314.671 605.086 313.251 604.049 311.791C600.389 306.636 597.021 299.882 597.723 299.104C598.114 298.671 597.872 298.64 597.184 299.036C596.497 299.431 595.934 299.257 595.934 298.648C595.934 298.039 594.285 294.975 592.27 291.839C590.255 288.703 587.202 283.662 585.487 280.637C582.397 275.188 581.46 273.577 575.211 262.959L571.987 257.483L571.711 189.31L571.434 121.137L568.678 114.637C567.162 111.062 565.963 107.737 566.013 107.249C566.064 106.76 565.671 106.085 565.141 105.749C563.168 104.497 557.11 95.7941 557.76 95.1441C558.131 94.7741 557.759 94.6201 556.934 94.8041C556.109 94.9871 555.547 94.5741 555.684 93.8871C555.822 93.1991 555.555 92.7491 555.092 92.8871C553.784 93.2751 543.013 82.3191 543.665 81.2641C543.985 80.7461 543.701 80.6631 543.031 81.0771C542.348 81.4991 540.207 80.7761 538.126 79.4201C534.234 76.8831 525.394 73.2331 520.569 72.1721C518.993 71.8251 506.269 71.5681 492.293 71.6021C478.317 71.6351 465.821 71.3961 464.524 71.0701C463.045 70.6991 461.097 68.5831 459.3 65.3981C456.094 59.7151 455.268 58.3011 448.922 47.6371C446.467 43.5121 444.003 39.3511 443.446 38.3891C441.904 35.7251 434.851 25.6211 431.456 21.2111C424.771 12.5261 416.259 6.71211 404.07 2.50611C397.667 0.296111 382.558 -0.745889 376.434 0.599111ZM408.701 15.0211C406.098 13.7011 401.39 11.9491 398.241 11.1291C391.434 9.35611 383.387 9.33411 376.233 11.0681C369.724 12.6461 357.832 18.6631 358.64 19.9701C358.972 20.5071 358.767 20.6521 358.184 20.2921C357.2 19.6831 346.319 25.2211 342.934 28.0531C342.109 28.7431 339.277 30.2931 336.641 31.4981C333.664 32.8581 332.112 34.1161 332.545 34.8171C332.964 35.4951 332.796 35.6691 332.123 35.2541C331.507 34.8731 329.187 35.4881 326.968 36.6201C322.581 38.8581 321.373 40.3061 325.438 38.4531C327.647 37.4471 328.286 37.6561 330.854 40.2241C333.175 42.5451 333.529 43.4271 332.6 44.5731C331.655 45.7391 331.756 45.8911 333.133 45.3751C334.427 44.8911 334.682 45.1441 334.202 46.4381C333.389 48.6311 328.818 52.6341 327.125 52.6361C326.388 52.6361 326.129 53.1431 326.531 53.7951C327.018 54.5821 326.581 54.7781 325.165 54.4081C323.661 54.0141 323.232 54.2511 323.62 55.2621C323.99 56.2261 323.657 56.4681 322.545 56.0411C321.609 55.6821 320.934 55.9311 320.934 56.6371C320.934 57.3051 320.302 57.6081 319.53 57.3121C318.521 56.9251 318.201 57.4681 318.396 59.2381C318.544 60.5931 318.937 61.9731 319.268 62.3041C320.206 63.2421 325.723 60.6311 326.371 58.9421C326.694 58.0991 327.611 57.6831 328.442 58.0021C329.263 58.3171 329.934 58.1971 329.934 57.7361C329.934 56.1961 339.946 56.5991 342.451 58.2401C343.768 59.1031 345.385 59.4761 346.045 59.0691C346.798 58.6031 346.981 58.7521 346.537 59.4701C346.149 60.0971 346.755 61.6021 347.883 62.8131C349.011 64.0231 349.934 65.6201 349.934 66.3611C349.934 67.1011 350.586 68.7041 351.383 69.9221C352.872 72.1961 352.877 72.6511 351.482 78.6371C350.676 82.0991 344.213 89.6371 342.052 89.6371C341.437 89.6371 340.934 90.0871 340.934 90.6371C340.934 91.1871 340.491 91.6371 339.949 91.6371C339.407 91.6371 336.757 92.9951 334.06 94.6541C328.147 98.2931 325.382 97.7161 321.924 92.1211C320.201 89.3331 319.44 88.7791 318.732 89.7981C318.078 90.7411 317.974 90.5221 318.383 89.0551C318.759 87.7041 318.278 86.3541 317.016 85.2111C315.945 84.2421 315.275 82.9131 315.526 82.2581C315.777 81.6031 315.099 80.1181 314.019 78.9581C312.938 77.7991 312.317 76.5881 312.637 76.2671C312.958 75.9461 312.481 75.4001 311.577 75.0541C310.673 74.7071 309.934 73.8071 309.934 73.0541C309.934 71.2531 306.413 65.4921 305.729 66.1751C305.437 66.4671 304.919 65.3111 304.578 63.6051C304.17 61.5661 303.553 60.7541 302.776 61.2351C301.946 61.7481 301.811 61.3961 302.323 60.0511C302.9 58.5381 302.794 58.3931 301.82 59.3601C300.895 60.2781 300.862 61.1831 301.687 62.9941C303.115 66.1291 301.366 68.7131 295.479 72.1641C291.362 74.5761 288.838 77.6371 290.965 77.6371C291.498 77.6371 291.934 78.3121 291.934 79.1371C291.934 79.9621 292.384 80.6371 292.934 80.6371C293.484 80.6371 293.821 81.0111 293.684 81.4681C293.546 81.9251 294.294 83.4541 295.345 84.8661C296.396 86.2781 298.2 89.3921 299.354 91.7851C300.507 94.1791 301.994 96.0301 302.657 95.8991C303.404 95.7511 303.625 96.3211 303.239 97.3991C302.896 98.3551 302.98 98.8061 303.426 98.4021C304.485 97.4421 307.121 102.526 306.274 103.896C305.917 104.473 306.097 104.654 306.673 104.298C308.026 103.462 307.814 108.766 306.44 110.15C303.668 112.942 300.253 114.395 298.618 113.48C297.683 112.957 296.477 112.801 295.938 113.135C295.359 113.492 295.227 113.037 295.615 112.025C296.062 110.861 295.898 110.541 295.104 111.032C294.355 111.495 293.934 111.013 293.934 109.696C293.934 108.564 293.484 107.637 292.934 107.637C292.384 107.637 291.919 107.075 291.9 106.387C291.857 104.797 288.021 96.7941 287.946 98.1371C287.915 98.6871 287.022 97.2251 285.961 94.8871C284.9 92.5501 283.574 90.6371 283.014 90.6371C282.455 90.6371 282.284 89.8881 282.635 88.9731C283.036 87.9291 282.877 87.5541 282.209 87.9671C281.623 88.3291 280.877 87.9301 280.55 87.0791C280.183 86.1241 280.369 85.7881 281.036 86.2001C281.629 86.5661 280.889 85.0151 279.391 82.7521C277.894 80.4891 276.353 78.6371 275.968 78.6371C275.583 78.6371 275.232 78.0751 275.188 77.3871C275.145 76.7001 274.676 74.7601 274.146 73.0771C272.995 69.4221 274.006 67.6821 278.684 65.2651C280.472 64.3411 280.208 65.5503 281.934 63.0911C283.66 60.6319 281.215 62.8818 277.934 64.6371C275.734 65.7591 273.934 67.1451 273.934 67.7161C273.934 68.2881 273.49 68.4801 272.947 68.1451C272.404 67.8091 271.391 68.0251 270.697 68.6251C268.705 70.3451 252.019 79.6371 250.922 79.6371C250.379 79.6371 249.934 79.9971 249.934 80.4381C249.934 80.8781 247.886 82.2341 245.382 83.4501C242.879 84.6661 241.102 86.1011 241.434 86.6381C241.769 87.1791 241.383 87.3631 240.567 87.0501C239.134 86.5001 234.172 89.0631 232.699 91.1141C232.295 91.6771 231.958 91.7891 231.949 91.3641C231.941 90.9391 230.813 91.3251 229.443 92.2231C228.072 93.1211 227.242 94.3261 227.597 94.9011C227.973 95.5091 227.761 95.6481 227.091 95.2341C225.622 94.3261 219.842 97.6791 220.643 98.9751C220.973 99.5091 220.758 99.6461 220.164 99.2791C218.993 98.5561 216.372 99.8541 198.934 109.797C192.609 113.404 183.609 118.508 178.934 121.139C166.199 128.307 155.94 134.116 151.182 136.853C148.843 138.199 147.268 139.673 147.682 140.129C148.096 140.585 147.906 140.655 147.261 140.286C146.274 139.721 139.56 142.821 137.934 144.592C137.659 144.892 134.871 146.458 131.739 148.072C128.607 149.686 126.268 151.369 126.541 151.811C126.814 152.252 126.442 152.385 125.713 152.106C124.984 151.826 122.245 152.956 119.626 154.617C117.007 156.278 114.382 157.637 113.792 157.637C113.203 157.637 112.936 158.199 113.199 158.887C113.495 159.658 112.739 160.194 111.228 160.286C109.881 160.368 107.8 161.329 106.606 162.421C105.411 163.513 103.415 164.716 102.169 165.094C100.895 165.481 100.198 166.254 100.574 166.864C100.958 167.485 100.78 167.66 100.156 167.274C99.2258 166.699 91.5638 170.24 88.4208 172.696C87.8638 173.132 83.3638 175.616 78.4208 178.217C73.4778 180.818 68.0838 183.938 66.4338 185.151C64.7838 186.363 60.0778 189.041 55.9748 191.102C46.4738 195.875 41.7428 199.092 42.6888 200.136C43.0988 200.588 42.9318 200.671 42.3178 200.321C39.9068 198.946 21.9338 210.445 21.9338 213.363C21.9338 214.129 21.5128 214.495 20.9988 214.177C19.6148 213.322 14.6178 220.3 15.5088 221.844C15.9188 222.555 15.8748 222.792 15.4098 222.369C14.1128 221.191 9.83776 231.402 8.77776 238.209C8.16776 242.131 8.18876 246.489 8.83776 250.519C9.97776 257.6 14.3978 268.086 15.8618 267.182C16.3958 266.851 17.3308 267.606 17.9388 268.859C18.9978 271.041 18.9788 271.055 17.4888 269.196C16.6338 268.128 15.9338 267.617 15.9338 268.061C15.9338 269.222 21.2018 278.893 22.6908 280.467C23.3838 281.198 25.1378 284.221 26.5888 287.185C28.0398 290.149 29.6808 292.293 30.2348 291.951C30.7898 291.608 30.9508 291.8 30.5948 292.376C30.0348 293.283 35.7248 303.881 40.9358 311.637C41.8598 313.012 44.5488 317.663 46.9118 321.973C50.0978 327.783 51.4568 329.464 52.1658 328.473C52.8708 327.488 52.9668 327.618 52.5298 328.965C52.0018 330.592 53.3708 333.344 61.4218 346.833C64.4168 351.851 74.8518 369.642 77.5178 374.276C79.2138 377.224 80.9738 379.299 81.4278 378.887C81.8828 378.474 81.9658 378.642 81.6138 379.26C80.8498 380.599 90.3878 396.85 91.3638 395.873C91.7358 395.502 91.7138 396.046 91.3168 397.082C90.7748 398.493 90.9258 398.76 91.9188 398.147C92.7838 397.612 93.0038 397.715 92.5528 398.444C92.1738 399.058 93.4008 401.94 95.2808 404.849C97.1608 407.757 101.41 414.862 104.723 420.637C108.036 426.412 111.576 432.037 112.59 433.137C113.604 434.237 114.327 435.458 114.197 435.849C114.066 436.241 117.255 442.091 121.283 448.849C125.312 455.608 129.87 463.486 131.414 466.358C132.957 469.229 134.675 471.297 135.231 470.953C135.788 470.609 135.944 470.811 135.579 471.402C135.214 471.993 135.627 473.187 136.496 474.056C137.366 474.926 137.707 475.644 137.255 475.652C136.804 475.661 136.893 475.998 137.454 476.402C138.016 476.806 139.03 478.4 139.709 479.943C140.387 481.487 141.385 482.476 141.927 482.141C142.468 481.807 142.668 482.166 142.371 482.941C141.79 484.454 145.382 491.288 147.9 493.461C149.201 494.584 149.206 494.672 147.934 494.039C146.91 493.53 147.028 493.97 148.307 495.43C149.337 496.605 151.587 500.188 153.307 503.393C160.684 517.141 173.401 537.466 174.284 536.921C174.811 536.595 174.922 536.847 174.53 537.481C173.795 538.67 178.846 548.634 180.184 548.636C180.596 548.637 180.934 549.132 180.934 549.736C180.934 551.049 188.108 562.992 189.184 563.47C189.597 563.654 189.934 564.34 189.934 564.996C189.934 565.652 191.959 569.443 194.434 573.42C196.909 577.397 198.934 581.098 198.934 581.644C198.934 582.19 199.384 582.637 199.934 582.637C200.484 582.637 200.934 583.121 200.934 583.713C200.934 586.873 213.098 604.637 215.263 604.637C215.749 604.637 216.979 605.696 217.997 606.99C219.015 608.284 222.758 610.733 226.315 612.432C241.657 619.761 256.581 618.829 272.46 609.549C276.143 607.398 279.501 605.637 279.922 605.637C280.344 605.637 281.245 604.967 281.925 604.148C282.605 603.329 283.521 602.882 283.962 603.154C284.403 603.427 284.914 603.272 285.099 602.81C285.283 602.349 289.484 599.791 294.434 597.126C306.156 590.815 310.094 588.148 309.179 587.138C308.769 586.686 308.957 586.615 309.595 586.981C310.589 587.549 316.409 585.201 317.933 583.617C318.209 583.33 319.697 582.541 321.24 581.862C322.941 581.115 323.767 580.175 323.336 579.478C322.894 578.763 323.066 578.601 323.792 579.049C324.813 579.68 327.384 578.432 339.029 571.649C340.456 570.817 346.081 567.709 351.529 564.742C356.977 561.774 365.096 557.162 369.573 554.492C374.049 551.822 378.212 549.637 378.823 549.637C379.434 549.637 379.934 549.289 379.934 548.864C379.934 548.439 381.622 547.217 383.684 546.149C397.889 538.787 404.983 534.277 403.75 533.392C402.803 532.713 402.956 532.618 404.295 533.054C406.32 533.713 423.934 524.25 423.934 522.503C423.934 521.962 424.379 521.794 424.923 522.13C425.467 522.467 430.08 520.304 435.173 517.326C453.327 506.708 463.519 500.861 469.408 497.682C480.491 491.701 483.937 489.451 483.382 488.553C483.079 488.062 483.416 487.879 484.132 488.146C484.848 488.413 494.142 483.683 504.785 477.635C515.428 471.586 524.54 466.637 525.035 466.637C525.529 466.637 525.934 466.187 525.934 465.637C525.934 465.087 526.326 464.637 526.806 464.637C527.285 464.637 532.123 462.098 537.556 458.994C542.989 455.891 548.334 452.843 549.434 452.221C555.472 448.808 581.562 433.861 584.265 432.267C586.008 431.238 589.605 429.261 592.26 427.872C595.826 426.007 596.739 425.108 595.76 424.427C594.832 423.782 595.05 423.677 596.488 424.077C598.845 424.732 611.6 416.653 611.184 414.768C611.047 414.146 611.477 413.75 612.141 413.887C614.03 414.278 621.591 402.315 623.498 395.915C624.47 392.653 625.216 386.856 625.21 382.602C625.2 374.769 622.639 363.637 620.847 363.637C620.28 363.637 620.061 363.24 620.361 362.755C620.661 362.269 620.125 360.803 619.17 359.497C618.215 358.191 616.944 356.226 616.344 355.13C611.29 345.888 609.561 342.934 608.451 341.637C607.745 340.812 606.154 338.112 604.916 335.637C603.678 333.162 602.163 330.806 601.55 330.402C600.936 329.998 600.827 329.661 601.306 329.652C601.786 329.644 601.719 329.075 601.157 328.387C600.595 327.7 597.116 321.962 593.426 315.637C589.737 309.312 586.204 303.806 585.576 303.402C584.948 302.998 584.759 302.661 585.156 302.652C585.866 302.637 574.808 283.103 568.346 272.955C565.317 268.199 560.625 260.158 554.157 248.637C552.767 246.162 551.249 243.987 550.782 243.804C550.316 243.62 549.934 242.806 549.934 241.995C549.934 241.134 549.453 240.816 548.779 241.232C548.087 241.661 547.896 241.508 548.301 240.852C549.164 239.456 545.538 233.393 544.437 234.391C543.984 234.801 543.872 234.679 544.189 234.119C544.799 233.041 540.584 225.321 539.808 226.096C539.558 226.347 539.291 225.72 539.214 224.704C539.035 222.333 527.966 203.637 526.741 203.637C526.232 203.637 526.078 203.214 526.397 202.697C526.717 202.179 525.956 200.763 524.706 199.55C523.456 198.336 523.03 197.681 523.758 198.095C524.845 198.712 524.854 198.482 523.808 196.806C523.107 195.684 522.104 195.032 521.579 195.356C521.054 195.681 520.948 195.423 521.343 194.785C521.737 194.146 521.205 192.389 520.16 190.88C519.115 189.371 517.944 187.462 517.558 186.637C517.171 185.812 516.311 184.237 515.645 183.137C514.979 182.037 512.936 178.545 511.105 175.377C509.274 172.209 507.366 169.87 506.866 170.179C506.366 170.488 506.17 170.155 506.431 169.439C507.047 167.75 494.465 146.464 493.413 147.415C492.973 147.812 492.945 147.562 493.35 146.859C493.78 146.114 492.806 143.65 491.01 140.938C489.318 138.384 487.934 135.895 487.934 135.407C487.934 134.918 487.414 134.84 486.779 135.232C486.079 135.666 485.896 135.508 486.314 134.83C486.694 134.217 484.687 129.985 481.855 125.426C479.024 120.867 476.309 116.097 475.822 114.827C475.336 113.556 474.538 112.764 474.049 113.066C473.56 113.368 473.222 113.058 473.297 112.376C473.519 110.366 465.659 97.6891 464.597 98.3451C464.063 98.6761 463.921 98.4671 464.283 97.8821C464.644 97.2961 464.661 96.0901 464.32 95.2021C463.806 93.8621 463.422 93.8041 462.067 94.8611C460.612 95.9981 460.584 95.9461 461.81 94.3831C463.006 92.8581 462.879 92.1801 460.842 89.2081C459.553 87.3271 458.152 86.0021 457.728 86.2641C457.304 86.5261 457.186 86.1431 457.467 85.4121C457.747 84.6811 456.842 82.5461 455.455 80.6661C454.069 78.7861 452.934 76.6611 452.934 75.9431C452.934 75.2251 452.484 74.6371 451.934 74.6371C451.384 74.6371 450.924 74.0751 450.911 73.3871C450.872 71.2031 444.355 61.5531 443.466 62.3611C442.997 62.7881 442.938 62.5741 443.334 61.8851C444.257 60.2811 437.032 48.4591 435.65 49.3121C435.086 49.6611 434.921 49.4671 435.283 48.8821C436.215 47.3731 434.935 44.5181 433.675 45.2971C433.097 45.6541 432.912 45.4811 433.263 44.9131C434.52 42.8791 423.48 25.1811 421.657 26.3081C421.09 26.6591 420.915 26.4771 421.27 25.9031C422.126 24.5181 414.63 18.0281 408.701 15.0211ZM305.684 49.6571C306.922 49.0571 307.934 48.3571 307.934 48.1021C307.934 47.3371 307.415 47.5581 305.375 49.1921C303.511 50.6861 303.523 50.7041 305.684 49.6571ZM296.934 56.7321C299.832 59.5271 301.434 58.7351 301.434 54.5091V51.7051C301.434 51.7421 300.422 52.2611 299.184 52.8571C297.946 53.4541 296.934 54.3501 296.934 54.8491C296.934 55.3471 296.372 55.4321 295.684 55.0381C294.997 54.6441 295.559 55.4061 296.934 56.7321ZM292.184 57.7651C293.146 57.0101 293.934 56.2221 293.934 56.0151C293.934 55.1921 293.113 55.7211 291.806 57.3871C290.563 58.9731 290.598 59.0081 292.184 57.7651ZM287.184 60.6941C298.082 53.8693 289.934 58.9381 289.934 58.4761V58.4539C289.934 58.1256 289.934 57.8968 289.825 57.8169C289.574 57.6332 288.746 58.237 286.016 60.2289L285.934 60.2891C275.694 66.2447 276.286 67.5189 287.184 60.6941ZM334.003 79.0291C336.675 77.4681 337.434 76.3761 337.434 74.0951C337.434 72.2701 336.868 71.0691 335.934 70.9101C334.155 70.6091 327.934 73.5401 327.934 74.6801C327.934 76.6481 329.274 78.6371 330.6 78.6371C331.473 78.6371 331.757 79.1141 331.312 79.8351C330.904 80.4941 332.115 80.1311 334.003 79.0291Z" fill="black"/>
<path fill-rule="evenodd" clip-rule="evenodd" d="M357.624 33.0891C356.826 33.8881 355.894 34.3381 355.553 34.0891C355.213 33.8411 355.155 33.9331 355.425 34.2951C355.696 34.6571 355.358 35.6431 354.675 36.4871C353.883 37.4661 353.849 37.7721 354.579 37.3351C355.209 36.9571 356.065 37.4331 356.48 38.3931C357.907 41.6851 357.755 42.4031 355.743 41.8771C354.354 41.5141 354.131 41.1331 354.995 40.6001C356.873 39.4381 352.988 38.8671 349.542 39.7981C347.951 40.2281 346.151 40.2951 345.542 39.9481C344.932 39.6001 344.765 39.6821 345.168 40.1281C345.572 40.5741 345.18 41.4681 344.296 42.1141C343.205 42.9121 342.914 43.9981 343.389 45.4941C344.172 47.9621 348.826 52.6371 350.499 52.6371C353.09 52.6371 355.934 57.3011 355.934 61.5501C355.934 67.0471 358.53 72.6371 361.083 72.6371C365.212 72.6371 367.858 69.6891 368.577 64.2861C368.954 61.4541 369.481 59.8121 369.748 60.6371C370.484 62.9151 373.307 66.1871 374.434 66.0691C376.445 65.8581 379.465 64.2221 380.652 62.6991C382.409 60.4471 382.247 47.6301 380.406 43.2251C379.566 41.2141 377.78 39.0681 376.438 38.4571C375.095 37.8451 374.215 36.9911 374.482 36.5601C374.748 36.1281 374.509 35.4931 373.95 35.1471C373.391 34.8021 372.934 35.0141 372.934 35.6201C372.934 36.2261 370.982 35.5771 368.596 34.1791C363.721 31.3221 359.783 30.9311 357.624 33.0891ZM366.014 47.6371C367.472 50.6981 367.934 51.2651 367.934 49.9951C367.934 49.4581 367.234 48.1461 366.379 47.0781C364.912 45.2481 364.892 45.2801 366.014 47.6371Z" fill="#A47A5E"/>
<path fill-rule="evenodd" clip-rule="evenodd" d="M365.625 16.6221C364.909 16.6121 365.033 16.2191 365.934 15.6371C367.855 14.3951 368.201 14.3951 367.434 15.6371C367.094 16.1871 366.28 16.6301 365.625 16.6221ZM349.625 25.6221C348.909 25.6121 349.033 25.2191 349.934 24.6371C351.855 23.3951 352.201 23.3951 351.434 24.6371C351.094 25.1871 350.28 25.6301 349.625 25.6221ZM335.875 73.6371C335.293 73.6371 335.094 73.1871 335.434 72.6371C335.774 72.0871 336.25 71.6371 336.493 71.6371C336.736 71.6371 336.934 72.0871 336.934 72.6371C336.934 73.1871 336.457 73.6371 335.875 73.6371ZM330.875 77.6371C330.293 77.6371 330.094 77.1871 330.434 76.6371C330.774 76.0871 331.25 75.6371 331.493 75.6371C331.736 75.6371 331.934 76.0871 331.934 76.6371C331.934 77.1871 331.457 77.6371 330.875 77.6371ZM219.617 114.825C219.298 115.622 219.061 115.385 219.013 114.22C218.97 113.166 219.206 112.576 219.538 112.908C219.87 113.24 219.906 114.103 219.617 114.825ZM154.934 137.137C154.384 137.477 153.934 137.278 153.934 136.696C153.934 136.114 154.384 135.637 154.934 135.637C155.484 135.637 155.934 135.835 155.934 136.078C155.934 136.321 155.484 136.797 154.934 137.137ZM91.4338 174.304C90.6568 174.304 90.2538 173.929 90.5368 173.47C90.8198 173.012 91.2238 172.637 91.4338 172.637C91.6438 172.637 92.0478 173.012 92.3308 173.47C92.6138 173.929 92.2108 174.304 91.4338 174.304ZM314.993 201.637C314.411 201.637 313.934 201.187 313.934 200.637C313.934 200.087 314.132 199.637 314.375 199.637C314.618 199.637 315.094 200.087 315.434 200.637C315.774 201.187 315.575 201.637 314.993 201.637ZM30.0518 210.637C29.5018 210.637 28.7738 210.187 28.4338 209.637C28.0938 209.087 28.2658 208.637 28.8158 208.637C29.3658 208.637 30.0938 209.087 30.4338 209.637C30.7738 210.187 30.6018 210.637 30.0518 210.637ZM24.7408 214.163C24.4328 214.471 23.8738 213.916 23.4978 212.93C22.9558 211.505 23.0698 211.39 24.0578 212.37C24.7418 213.049 25.0488 213.856 24.7408 214.163ZM82.2098 228.247C81.9478 227.985 82.0298 227.29 82.3928 226.704C83.3788 225.108 83.9548 225.418 83.2788 227.18C82.9528 228.029 82.4718 228.509 82.2098 228.247ZM578.993 294.637C578.411 294.637 577.934 294.187 577.934 293.637C577.934 293.087 578.132 292.637 578.375 292.637C578.618 292.637 579.094 293.087 579.434 293.637C579.774 294.187 579.575 294.637 578.993 294.637ZM159.4 314.245C158.589 314.364 158.132 314.126 158.385 313.716C158.639 313.306 159.541 312.97 160.39 312.97C162.241 312.97 161.49 313.938 159.4 314.245ZM505.858 332.368C503.996 332.508 503.24 330.665 504.601 329.304C505.563 328.341 505.758 328.44 506.823 330.43C507.585 331.854 507.387 332.253 505.858 332.368ZM536.687 370.984C537.271 371.345 538.803 371.219 540.092 370.702C541.38 370.186 543.829 369.735 545.535 369.7C548.975 369.63 555.345 371.559 554.491 372.413C553.882 373.023 558.076 376.236 559.066 375.918C559.414 375.807 559.639 376.485 559.566 377.426C559.494 378.367 560.03 379.013 560.758 378.862C561.487 378.711 561.847 378.968 561.56 379.434C561.272 379.899 561.639 381.442 562.376 382.862C564.363 386.693 565.823 391.633 566.298 396.137C567.026 403.042 562.569 409.083 553.78 413.107C546.018 416.661 541.549 415.742 534.925 409.232C532.18 406.534 529.934 403.946 529.934 403.482C529.934 403.017 529.232 402.637 528.375 402.637C527.518 402.637 527.051 403.017 527.337 403.481C528.954 406.097 522.008 417.637 518.816 417.637C517.524 417.637 518.683 421.581 520.627 423.799C523.092 426.609 521.872 430.681 517.936 432.783C515.394 434.141 514.328 434.319 514.034 433.436C513.811 432.767 512.572 431.081 511.281 429.689C509.99 428.297 508.934 426.542 508.934 425.79C508.934 425.007 508.315 424.661 507.485 424.979C506.465 425.371 506.22 425.055 506.659 423.912C507.129 422.687 506.862 422.451 505.567 422.948C504.212 423.468 504.041 423.268 504.753 421.996C505.381 420.873 504.883 418.989 503.103 415.762C501.7 413.218 500.15 410.862 499.658 410.525C499.166 410.189 498.796 409.514 498.837 409.025C498.996 407.102 497.74 404.639 496.873 405.174C496.369 405.486 496.207 405.088 496.514 404.29C496.82 403.492 496.59 402.542 496.002 402.179C494.403 401.191 494.715 396.658 496.428 396.001C497.25 395.685 497.631 394.955 497.274 394.378C496.883 393.745 497.109 393.627 497.843 394.08C498.512 394.494 499.819 394.168 500.747 393.356C504.828 389.781 510.442 388.055 516.578 388.486C518.848 388.646 525.183 393.927 524.407 395.014C524.156 395.366 524.35 395.312 524.837 394.895C525.325 394.478 525.904 391.125 526.123 387.444C526.389 382.984 527.092 380.12 528.23 378.862C529.17 377.824 529.6 376.602 529.186 376.146C528.772 375.689 528.997 375.64 529.684 376.036C530.372 376.431 530.934 376.388 530.934 375.94C530.934 375.492 532.287 374.527 533.94 373.795C535.622 373.05 536.655 371.994 536.285 371.396C535.916 370.798 536.093 370.617 536.687 370.984ZM529.527 381.387C528.214 383.695 529.537 382.666 531.776 379.637C532.996 377.987 533.825 376.637 533.619 376.637C533.14 376.637 530.458 379.751 529.527 381.387ZM548.909 384.153C548.373 384.484 547.934 384.368 547.934 383.896C547.934 382.688 543.188 382.826 540.616 384.108C537.472 385.676 536.129 390.201 537.967 393.032C538.774 394.274 540.334 396.715 541.434 398.457C543.027 400.979 544.115 401.626 546.776 401.631C551.181 401.639 554.587 398.897 554.4 395.493C554.2 391.864 550.107 383.412 548.909 384.153ZM527.684 399.765C529.303 401.034 529.324 400.987 527.967 399.137C527.16 398.037 526.373 396.95 526.217 396.72C526.061 396.491 525.934 396.774 525.934 397.348C525.934 397.922 526.722 399.01 527.684 399.765ZM511.863 407.637C513.293 407.637 516.066 404.533 515.677 403.366C515.487 402.795 514.348 401.965 513.147 401.52C511.494 400.909 510.718 401.173 509.949 402.609C508.658 405.021 508.646 406.63 509.934 404.637C510.718 403.424 510.906 403.568 510.919 405.387C510.927 406.625 511.352 407.637 511.863 407.637ZM469.991 420.637C470.574 420.637 470.844 420.3 470.589 419.887C470.334 419.474 472.263 419.137 474.876 419.137C479.398 419.137 482.389 420.501 484.245 423.408C484.692 424.107 485.386 424.476 485.788 424.227C486.19 423.979 486.587 424.681 486.67 425.789C486.754 426.896 487.995 429.339 489.429 431.219C490.863 433.099 491.675 434.644 491.235 434.652C490.794 434.661 490.884 434.998 491.434 435.402C492.759 436.376 495.551 442.739 495.485 444.637C495.457 445.462 494.003 446.852 492.254 447.726C490.505 448.6 487.805 450.147 486.254 451.164C480.525 454.92 478.835 455.469 475.733 454.579C472.897 453.766 472.744 453.862 473.186 456.175C473.5 457.816 473.203 458.637 472.295 458.637C471.547 458.637 470.934 459.051 470.934 459.558C470.934 460.064 469.497 460.794 467.742 461.179C465.104 461.759 464.216 461.468 462.629 459.509C461.573 458.204 460.422 457.137 460.071 457.137C459.721 457.137 459.547 456.8 459.684 456.387C460.032 455.342 457.172 455.443 456.519 456.499C456.226 456.973 456.722 459.234 457.622 461.524C459.208 465.562 459.192 465.748 457.096 467.701C455.907 468.809 454.934 469.417 454.934 469.054C454.934 468.69 454.259 468.952 453.434 469.637C452.256 470.615 451.934 470.618 451.934 469.652C451.934 468.976 451.282 468.673 450.485 468.979C449.516 469.351 449.22 469.055 449.592 468.086C449.94 467.178 449.526 466.637 448.482 466.637C447.566 466.637 447.084 466.203 447.411 465.673C447.739 465.144 447.128 463.831 446.054 462.757C444.98 461.683 444.332 460.572 444.615 460.29C445.496 459.409 441.623 453.711 440.581 454.355C440.002 454.713 439.858 454.277 440.233 453.301C440.65 452.214 440.362 451.637 439.403 451.637C438.595 451.637 437.934 451.16 437.934 450.578C437.934 449.996 438.473 449.852 439.131 450.259C439.789 450.665 439.421 449.679 438.313 448.068C435.644 444.183 435.8 440.415 438.684 439.15C439.922 438.607 440.934 437.834 440.934 437.431C440.934 436.365 444.017 437.72 445.92 439.623C446.821 440.524 447.36 441.859 447.117 442.589C446.855 443.373 447.132 443.633 447.793 443.224C448.505 442.784 448.695 443.097 448.316 444.085C447.988 444.939 448.218 445.637 448.827 445.637C449.436 445.637 449.99 445.187 450.059 444.637C450.128 444.087 450.26 443.075 450.352 442.387C450.444 441.7 450.202 439.636 449.813 437.801C449.271 435.243 449.533 434.038 450.937 432.634C451.944 431.627 452.55 430.586 452.284 430.32C452.018 430.055 452.35 429.498 453.022 429.083C453.763 428.625 453.986 428.744 453.588 429.388C453.153 430.091 454.361 430.315 457.184 430.055C460.266 429.77 461.022 429.939 459.934 430.669C458.605 431.56 458.611 431.815 459.981 432.906C461.101 433.797 461.467 435.677 461.307 439.716C461.102 444.885 461.294 445.418 463.914 446.966C465.47 447.885 466.922 448.637 467.141 448.637C467.36 448.637 467.516 446.207 467.487 443.236C467.458 440.265 467.206 438.202 466.928 438.651C465.78 440.501 462.898 436.642 462.354 432.527C461.822 428.497 462.068 427.83 465.352 424.387C467.32 422.325 469.407 420.637 469.991 420.637ZM470.684 435.232C471.922 434.184 472.934 433.172 472.934 432.982C472.934 432.182 472.129 432.773 470.339 434.887L468.434 437.137L470.684 435.232ZM434.923 444.13C434.379 443.794 433.934 443.096 433.934 442.578C433.934 441.14 434.651 441.457 435.316 443.189C435.657 444.079 435.489 444.48 434.923 444.13ZM426.305 446.289C427.734 445.547 428.573 444.586 428.169 444.153C427.765 443.72 428.456 443.898 429.705 444.548C430.954 445.198 432.412 445.46 432.945 445.13C433.479 444.8 434.707 446.242 435.675 448.334C436.642 450.426 437.733 452.365 438.099 452.643C439.11 453.414 436.638 456.307 434.934 456.347C430.623 456.449 428.974 457.828 428.949 461.352C428.933 463.764 432.288 466.155 434.109 465.029C434.804 464.599 434.967 464.775 434.529 465.482C432.888 468.138 436.599 466.384 438.434 463.637C439.534 461.99 440.792 460.641 441.229 460.64C442.409 460.636 446.898 465.34 446.292 465.945C446.006 466.232 446.263 467.383 446.863 468.505C447.776 470.211 447.449 471.119 444.862 474.066C441.085 478.368 435.999 480.001 430.768 478.592C427.117 477.609 420.934 472.492 420.934 470.453C420.934 469.887 420.334 469.653 419.601 469.935C418.867 470.216 418.267 469.834 418.267 469.086C418.267 468.337 418.755 468.017 419.351 468.373C419.946 468.729 419.875 468.331 419.193 467.487C418.51 466.643 418.285 465.585 418.693 465.135C419.1 464.685 418.937 464.6 418.329 464.946C417.574 465.377 417.284 463.924 417.413 460.356C417.654 453.723 418.029 452.439 420.201 450.819C421.172 450.093 421.746 449.141 421.474 448.702C421.203 448.263 421.975 447.057 423.19 446.021C425.028 444.453 425.172 444.431 424.044 445.887C422.416 447.99 422.87 448.07 426.305 446.289ZM396.546 448.318C397.599 448.722 398.017 448.581 397.628 447.951C397.233 447.312 397.954 447.109 399.546 447.414C400.95 447.682 402.333 448.514 402.621 449.264C402.908 450.013 403.515 450.396 403.97 450.115C404.424 449.834 405.078 450.062 405.424 450.621C405.769 451.18 405.59 451.637 405.025 451.637C404.369 451.637 404.313 452.449 404.87 453.887C405.35 455.125 406.268 456.013 406.912 455.862C407.556 455.711 407.798 456.049 407.449 456.612C407.095 457.185 407.724 457.637 408.875 457.637C410.007 457.637 410.934 458.114 410.934 458.696C410.934 459.278 411.353 459.496 411.865 459.18C412.377 458.863 413.121 459.131 413.519 459.775C413.971 460.506 413.81 460.678 413.089 460.232C411.38 459.176 411.669 460.244 414.219 464.407C415.476 466.458 417.042 469.375 417.698 470.887C418.354 472.399 419.351 473.637 419.913 473.637C420.474 473.637 420.934 474.367 420.934 475.259C420.934 476.444 421.271 476.602 422.184 475.844C423.137 475.053 423.455 475.559 423.52 477.972C423.568 479.713 423.947 481.907 424.363 482.849C424.889 484.04 424.357 485.267 422.617 486.879C420.291 489.036 415.277 490.509 416.389 488.71C416.663 488.267 415.997 487.099 414.91 486.116C413.823 485.132 412.934 483.722 412.934 482.982C412.934 482.242 412.5 481.637 411.969 481.637C410.891 481.637 408.787 485.118 409.123 486.346C409.242 486.781 408.983 488.937 408.548 491.137C407.786 494.992 405.097 498.637 403.015 498.637C401.29 498.637 397.87 494.365 394.866 488.46C393.278 485.337 391.511 482.494 390.94 482.141C390.369 481.788 390.22 480.967 390.61 480.318C391.013 479.645 390.59 479.728 389.626 480.509C387.838 481.96 387.319 484.637 388.826 484.637C389.316 484.637 390.01 485.803 390.367 487.228C390.757 488.782 391.535 489.62 392.309 489.323C393.02 489.051 393.601 489.44 393.601 490.188C393.601 490.937 393.199 491.301 392.708 490.997C392.216 490.693 393.047 492.803 394.555 495.686L397.295 500.926L394.95 502.825C393.66 503.87 391.98 504.485 391.217 504.192C390.346 503.858 390.097 504.091 390.546 504.818C391.024 505.592 390.709 505.765 389.598 505.338C388.542 504.933 387.934 505.203 387.934 506.079C387.934 507.426 380.486 511.637 378.105 511.637C376.482 511.637 372.612 509.414 371.662 507.936C371.237 507.276 370.246 506.092 369.459 505.305C367.93 503.776 367.115 496.771 368.252 494.932C368.688 494.226 368.275 493.997 367.116 494.3C365.409 494.746 362.046 492.012 362.759 490.758C362.938 490.444 362.538 490.005 361.87 489.782C361.202 489.56 360.948 489.85 361.305 490.429C362.691 492.671 362.653 497.531 361.245 498.071C360.359 498.411 360.094 498.187 360.537 497.471C360.972 496.767 360.8 496.602 360.089 497.042C359.454 497.434 358.934 498.323 358.934 499.017C358.934 501.22 362.51 507.728 363.291 506.947C363.703 506.535 363.743 506.972 363.38 507.917C363.001 508.905 363.191 509.637 363.827 509.637C364.436 509.637 364.934 510.776 364.934 512.168C364.934 513.561 365.601 514.956 366.416 515.268C368.515 516.074 366.715 519.101 363.049 520.93C359.703 522.599 358.988 522.063 354.94 514.862C353.659 512.583 352.164 510.995 351.618 511.332C351.045 511.687 350.94 511.436 351.371 510.738C351.81 510.028 351.194 508.729 349.873 507.584C347.466 505.497 345.934 505.087 345.934 506.53C345.934 507.021 345.236 507.691 344.382 508.019C343.528 508.346 343.086 508.2 343.398 507.695C343.711 507.189 343.44 506.45 342.796 506.052C342.065 505.6 341.893 505.761 342.339 506.482C342.737 507.128 342.475 507.651 341.743 507.669C340.936 507.688 341.178 508.263 342.375 509.169C343.443 509.976 343.936 510.637 343.47 510.637C343.005 510.637 343.323 511.425 344.178 512.387C346.638 515.159 349.545 520.861 350.207 524.216C350.856 527.5 348.54 530.672 346.089 529.855C345.402 529.626 344.065 530.333 343.117 531.426C338.131 537.175 330.316 538.565 326.876 534.316C325.747 532.923 325.034 532.666 324.534 533.475C324.139 534.114 324.25 534.637 324.781 534.637C325.312 534.637 325.511 535.537 325.224 536.637C324.936 537.737 324.303 538.637 323.817 538.637C323.332 538.637 322.934 539.312 322.934 540.137C322.934 542.157 320.171 544.787 313.769 548.863C307.361 552.942 305.384 553.747 303.527 553.034C302.124 552.496 295.568 542.827 292.749 537.137C291.931 535.487 289.571 530.851 287.503 526.834C282.952 517.992 283.197 515.548 288.888 513.037C291.061 512.078 292.613 510.926 292.335 510.477C292.057 510.028 292.607 509.958 293.556 510.322C294.941 510.854 295.137 510.605 294.548 509.061C293.974 507.554 294.079 507.398 295.031 508.344C295.981 509.286 296.814 509.151 298.841 507.725C302.307 505.285 305.626 504.329 306.382 505.553C306.721 506.101 307.546 506.418 308.216 506.257C308.886 506.096 309.097 506.154 308.684 506.384C308.271 506.615 307.934 507.243 307.934 507.779C307.934 508.316 308.379 508.48 308.923 508.144C309.475 507.803 309.665 508.174 309.354 508.984C309.048 509.782 309.28 510.733 309.869 511.097C310.617 511.559 310.574 512.417 309.724 513.948C309.056 515.152 308.612 516.496 308.737 516.934C308.863 517.373 308.396 517.641 307.7 517.531C305.571 517.193 299.216 520.459 298.532 522.243C297.486 524.968 298.71 525.131 302.831 522.815C304.963 521.617 307.395 520.637 308.237 520.637C309.079 520.637 310.03 520.075 310.351 519.387C310.794 518.436 311.069 518.423 311.499 519.331C311.809 519.987 312.637 520.304 313.338 520.035C314.04 519.766 315.191 520.241 315.896 521.091C316.602 521.942 317.799 522.637 318.556 522.637C319.314 522.637 319.934 523.142 319.934 523.759C319.934 524.535 320.398 524.497 321.434 523.637C323.294 522.093 323.395 519.637 321.599 519.637C320.076 519.637 314.67 513.936 315.735 513.453C316.12 513.279 317.252 511.562 318.252 509.637C320.057 506.16 325.82 501.637 328.444 501.637C329.199 501.637 330.077 501.214 330.397 500.697C330.741 500.14 332.371 500.34 334.402 501.188C336.925 502.242 338.013 502.317 338.535 501.474C338.972 500.767 338.801 500.601 338.089 501.042C336.688 501.907 336.657 501.496 337.877 498.286C338.498 496.654 341.233 494.538 345.877 492.098C349.758 490.058 352.934 487.92 352.934 487.346C352.934 486.773 353.23 486.6 353.592 486.962C353.954 487.324 354.862 487.111 355.611 486.49C356.648 485.629 357.444 485.788 358.959 487.16L359.027 487.222C359.998 488.1 360.53 488.582 360.938 488.493C361.432 488.385 361.744 487.438 362.433 485.341L362.474 485.218C364.203 479.961 378.521 472.181 380.809 475.255C381.17 475.74 382.881 477.42 384.61 478.988L387.755 481.84L388.944 479.618C389.739 478.133 389.769 477.621 389.034 478.075C388.407 478.463 387.934 478.059 387.934 477.137C387.934 476.247 387.512 475.78 386.997 476.098C386.469 476.424 386.257 475.587 386.511 474.183C386.883 472.132 386.65 471.806 385.199 472.35C383.669 472.923 383.612 472.793 384.77 471.368C385.505 470.464 385.819 469.26 385.468 468.692C385.097 468.092 385.437 467.893 386.281 468.217C387.079 468.523 388.036 468.282 388.407 467.68C388.779 467.079 388.647 466.711 388.115 466.862C386.636 467.282 381.936 461.4 381.942 459.137C381.948 456.733 386.506 453.976 389.699 454.446C390.944 454.63 391.731 455.156 391.447 455.615C391.164 456.075 391.865 456.206 393.007 455.908C394.594 455.493 394.947 454.823 394.505 453.062C394.187 451.796 394.386 450.476 394.947 450.129C395.508 449.782 395.711 449.085 395.398 448.579C395.084 448.071 395.597 447.954 396.546 448.318ZM397.732 473.012C399.299 473.981 400.7 472.073 401.371 468.054C401.927 464.73 401.763 463.97 400.494 463.97C399.636 463.97 398.934 464.372 398.934 464.863C398.934 465.353 398.408 465.43 397.764 465.032C396.985 464.55 396.801 464.848 397.213 465.922C397.648 467.055 397.401 467.37 396.383 466.979C395.586 466.673 394.934 466.921 394.934 467.53C394.934 468.139 395.561 468.637 396.327 468.637C397.093 468.637 397.993 469.349 398.327 470.219C399.237 472.59 399.031 473.334 397.934 471.637C397.352 470.736 396.959 470.612 396.949 471.328C396.941 471.983 397.293 472.741 397.732 473.012ZM357.993 484.637C357.411 484.637 356.934 484.187 356.934 483.637C356.934 483.087 357.132 482.637 357.375 482.637C357.618 482.637 358.094 483.087 358.434 483.637C358.774 484.187 358.575 484.637 357.993 484.637ZM371.684 491.232C372.922 490.184 373.934 489.172 373.934 488.982C373.934 488.182 373.129 488.773 371.339 490.887L369.434 493.137L371.684 491.232ZM150.741 493.163C150.433 493.471 149.874 492.916 149.498 491.93C148.956 490.505 149.07 490.39 150.058 491.37C150.742 492.049 151.049 492.856 150.741 493.163ZM372.184 494.765C373.146 494.01 373.934 493.222 373.934 493.015C373.934 492.192 373.113 492.721 371.806 494.387C370.563 495.973 370.598 496.008 372.184 494.765ZM380.21 499.247C380.472 499.509 380.953 499.029 381.279 498.18C381.955 496.418 381.379 496.108 380.393 497.704C380.03 498.29 379.948 498.985 380.21 499.247ZM157.741 509.163C157.433 509.471 156.874 508.916 156.498 507.93C155.956 506.505 156.07 506.39 157.058 507.37C157.742 508.049 158.049 508.856 157.741 509.163ZM327.184 515.765C328.146 515.01 328.934 514.222 328.934 514.015C328.934 513.192 328.113 513.721 326.806 515.387C325.563 516.973 325.598 517.008 327.184 515.765ZM409.382 531.019C408.492 531.36 408.091 531.192 408.441 530.626C408.777 530.082 409.475 529.637 409.993 529.637C411.431 529.637 411.114 530.354 409.382 531.019ZM307.827 537.637C310.665 537.637 312.558 535.456 311.378 533.547C310.759 532.545 310.171 532.514 307.934 533.366C306.367 533.962 304.976 535.604 304.949 536.887C304.941 537.3 306.236 537.637 307.827 537.637ZM265.275 537.767C266.287 536.885 268.312 535.656 269.775 535.035C271.8 534.176 272.791 534.201 273.934 535.142C274.759 535.821 276.109 536.175 276.934 535.93C278.267 535.534 278.267 535.604 276.934 536.561C275.601 537.517 275.601 537.746 276.934 538.622C277.759 539.163 277.984 539.62 277.434 539.637C276.884 539.654 277.012 540.034 277.718 540.482C279.424 541.565 278.337 544.143 275.35 546.1C272.199 548.165 272.303 549.89 275.934 555.791C277.584 558.473 278.934 561.309 278.934 562.093C278.934 562.877 279.384 563.797 279.934 564.137C280.484 564.477 280.934 565.178 280.934 565.696C280.934 567.433 276.955 570.637 274.799 570.637C272.798 570.637 268.756 567.263 268.172 565.105C267.224 561.6 266.68 560.676 265.862 561.181C265.352 561.497 264.934 560.933 264.934 559.928C264.934 558.923 263.854 556.512 262.534 554.57C259.087 549.497 257.17 542.727 258.88 541.67C259.601 541.225 259.928 540.437 259.608 539.919C259.289 539.402 260.018 539.066 261.23 539.175C262.442 539.283 264.262 538.649 265.275 537.767ZM177.741 543.163C177.433 543.471 176.874 542.916 176.498 541.93C175.956 540.505 176.07 540.39 177.058 541.37C177.742 542.049 178.049 542.856 177.741 543.163ZM284.839 548.637C286.737 548.637 288.653 546.294 288.104 544.646C287.75 543.584 288.112 543.672 289.402 544.962C290.407 545.967 291.889 546.484 292.782 546.142C293.657 545.806 294.056 545.848 293.669 546.235C293.282 546.622 293.576 547.434 294.322 548.038C296.786 550.035 297.741 554.856 296.322 558.137C295.608 559.787 295.004 560.744 294.979 560.265C294.954 559.785 294.348 559.879 293.631 560.473C292.683 561.261 291.534 561.142 289.404 560.037C285.914 558.226 284.97 556.911 284.949 553.828C284.939 552.249 284.539 551.756 283.684 552.27C282.687 552.869 282.685 552.711 283.675 551.487C284.358 550.643 284.621 549.657 284.259 549.295C283.897 548.933 284.158 548.637 284.839 548.637ZM188.364 592.637C188.089 592.637 188.345 591.737 188.934 590.637C189.523 589.537 190.229 588.637 190.504 588.637C190.779 588.637 190.523 589.537 189.934 590.637C189.345 591.737 188.639 592.637 188.364 592.637Z" fill="black"/>
<path fill-rule="evenodd" clip-rule="evenodd" d="M195.434 303.687C192.684 304.127 187.299 305.388 183.468 306.488C179.637 307.588 176.08 308.227 175.564 307.908C175.047 307.589 174.946 307.848 175.339 308.482C175.757 309.16 175.429 309.637 174.545 309.637C173.715 309.637 171.818 310.766 170.329 312.147C168.839 313.527 167.394 314.43 167.117 314.153C166.84 313.876 165.985 314.547 165.217 315.643C164.449 316.74 163.145 317.637 162.318 317.637C161.492 317.637 161.062 318.035 161.362 318.521C161.663 319.007 160.58 319.955 158.957 320.628C157.333 321.3 156.102 322.365 156.22 322.994C156.337 323.622 155.601 323.994 154.584 323.82C153.482 323.631 152.998 323.931 153.387 324.561C154.202 325.88 150.9 330.563 149.125 330.606C148.405 330.623 148.094 331.087 148.434 331.637C148.774 332.187 148.678 332.637 148.22 332.637C147.763 332.637 146.677 334.099 145.806 335.887C142.283 343.122 140.583 347.177 140.764 347.917C140.869 348.346 140.32 349.923 139.546 351.42C137.283 355.796 136.013 369.692 137.077 378.42C138.312 388.542 143.236 402.882 146.707 406.466C149.531 409.381 155.422 418.057 153.967 417.158C153.069 416.602 152.861 416.71 153.339 417.482C153.731 418.117 154.588 418.643 155.243 418.649C155.898 418.656 158.252 420.344 160.475 422.399C162.697 424.455 166.185 427.027 168.225 428.114C170.265 429.202 171.934 430.451 171.934 430.889C171.934 431.894 175.523 433.293 184.434 435.762C193.674 438.322 208.705 439.22 217.497 437.737C226.894 436.153 238.075 432.674 237.381 431.552C237.07 431.049 237.45 430.637 238.225 430.637C239 430.637 241.553 429.247 243.898 427.548C246.243 425.849 247.847 425.062 247.463 425.798C247.078 426.535 248.146 425.675 249.835 423.887C251.524 422.099 253.437 420.637 254.087 420.637C254.736 420.637 255.015 420.385 254.707 420.076C254.008 419.378 258.655 414.637 260.038 414.637C260.596 414.637 260.79 414.213 260.47 413.695C259.686 412.427 268.434 399.492 269.453 400.412C269.894 400.811 269.944 400.595 269.564 399.933C268.677 398.387 269.88 393.486 270.98 394.166C271.438 394.449 271.796 393.883 271.775 392.909C271.754 391.934 272.457 387.61 273.336 383.299C275.23 374.011 275.285 367.637 273.552 358.137C272.274 351.124 266.303 336.807 263.25 333.434C262.356 332.446 261.937 331.637 262.319 331.637C262.702 331.637 261.867 330.399 260.463 328.887C259.06 327.375 257.684 325.422 257.406 324.547C257.128 323.673 255.783 322.359 254.417 321.628C253.052 320.897 251.934 319.925 251.934 319.468C251.934 319.011 251.337 318.637 250.608 318.637C249.879 318.637 248.226 317.512 246.934 316.137C245.642 314.762 244.059 313.637 243.415 313.637C242.771 313.637 241.415 312.721 240.402 311.602C239.389 310.482 237.969 309.793 237.247 310.07C236.525 310.347 235.934 310.21 235.934 309.766C235.934 309.321 234.022 308.388 231.684 307.693C229.346 306.998 226.407 306.029 225.153 305.54C222.621 304.554 206.849 302.587 202.934 302.77C201.559 302.834 198.184 303.247 195.434 303.687ZM214.966 343.087C214.944 333.531 214.55 328.653 213.734 327.837C212.002 326.105 195.315 326.201 194.645 327.947C194.369 328.668 194.073 335.736 193.989 343.654C193.905 351.572 193.4 358.576 192.867 359.218C192.191 360.033 188.205 360.265 179.666 359.988C172.938 359.77 165.955 359.85 164.148 360.166L160.863 360.741L161.148 370.439L161.434 380.137L177.434 380.637L193.434 381.137L193.934 397.137C194.209 405.937 194.772 413.024 195.184 412.887C195.596 412.75 196.272 412.691 196.684 412.758C200.989 413.453 212.683 412.903 213.684 411.958C214.567 411.126 214.934 406.71 214.934 396.908C214.934 387.453 215.316 382.655 216.134 381.837C216.956 381.015 221.861 380.637 231.705 380.637C241.875 380.637 246.439 380.271 247.317 379.387C249.026 377.665 248.561 361.642 246.77 360.536C246.058 360.096 239.166 359.828 231.455 359.941C220.001 360.109 217.211 359.871 216.216 358.642C215.391 357.623 214.987 352.598 214.966 343.087Z" fill="#72897C"/>
<path d="M256.635 78.0991C252.583 80.4841 249.781 82.9041 251.434 82.5901C254.741 81.9621 256.267 84.1891 256.819 90.4461C256.883 91.1801 257.448 91.4371 258.104 91.0321C258.898 90.5411 259.062 90.8611 258.615 92.0251C258.224 93.0441 258.358 93.4931 258.945 93.1301C259.489 92.7941 259.934 93.2471 259.934 94.1371C259.934 95.0651 260.406 95.4631 261.041 95.0711C261.795 94.6051 261.921 95.1041 261.434 96.6371C260.947 98.1701 261.073 98.6691 261.827 98.2031C262.436 97.8271 262.934 98.1361 262.934 98.8891C262.934 99.6431 263.873 101.268 265.021 102.5C266.169 103.732 266.849 105.416 266.533 106.241C266.161 107.21 266.367 107.487 267.115 107.025C267.904 106.538 268.056 106.876 267.593 108.084C267.07 109.446 267.292 109.714 268.543 109.233C269.802 108.75 270.055 109.068 269.648 110.624C269.358 111.732 269.529 112.388 270.027 112.079C270.526 111.771 270.934 112.46 270.934 113.61C270.934 115.721 267.294 117.913 265.529 116.865C265.018 116.561 264.981 116.903 265.444 117.652C266.043 118.622 265.802 118.801 264.546 118.318C263.602 117.956 263.076 118.058 263.376 118.544C263.677 119.03 263.262 119.681 262.455 119.991C261.644 120.302 260.559 119.789 260.031 118.845C259.505 117.906 258.746 117.362 258.344 117.637C257.941 117.912 257.111 116.648 256.498 114.828C255.885 113.008 254.986 111.884 254.499 112.328C254.001 112.783 253.93 112.587 254.337 111.879C254.736 111.188 254.358 109.918 253.498 109.058C252.638 108.198 251.934 106.851 251.934 106.066C251.934 105.28 251.528 104.637 251.033 104.637C250.537 104.637 249.161 102.992 247.975 100.982C246.249 98.0571 246.08 97.1391 247.126 96.3871C248.104 95.6851 248.015 95.5821 246.776 95.9761C245.61 96.3471 244.927 95.7451 244.477 93.9521C244.125 92.5491 243.566 91.6721 243.234 92.0031C242.903 92.3351 242.095 91.8721 241.438 90.9741C239.982 88.9831 236.432 89.6711 232.596 92.6881C229.999 94.7311 228.777 97.4701 231.104 96.0321C231.891 95.5461 232.065 95.8541 231.635 96.9731C231.284 97.8881 231.459 98.6371 232.024 98.6371C232.59 98.6371 232.782 99.0741 232.451 99.6091C231.915 100.476 234.391 105.351 236.021 106.637C236.37 106.912 237.456 108.712 238.434 110.637C239.412 112.562 240.498 114.362 240.847 114.637C242.642 116.054 244.928 120.849 244.315 121.915C243.929 122.587 243.973 122.812 244.413 122.415C244.852 122.017 246.097 123.48 247.178 125.665C248.259 127.849 249.546 129.637 250.039 129.637C250.531 129.637 250.934 130.564 250.934 131.696C250.934 132.828 251.384 133.477 251.934 133.137C252.484 132.797 252.934 133.151 252.934 133.923C252.934 136.999 259.997 140.411 261.101 137.869C261.518 136.906 271.323 130.637 272.411 130.637C272.852 130.637 275.407 129.287 278.088 127.637C283.51 124.301 285.934 123.856 285.934 126.196C285.934 127.053 286.384 127.477 286.934 127.137C287.85 126.571 288.379 127.937 288.028 129.961C287.949 130.415 288.376 130.482 288.976 130.111C289.576 129.74 290.6 130.158 291.251 131.04C292.332 132.506 292.735 132.493 295.934 130.89C298.639 129.535 299.398 128.569 299.274 126.637C299.041 122.99 298.485 121.012 297.265 119.488C296.67 118.745 295.445 116.682 294.542 114.904C293.639 113.127 291.558 110.298 289.917 108.619C287.444 106.089 286.595 105.748 284.956 106.625C283.294 107.515 283.082 107.414 283.626 105.996C284.064 104.857 283.894 104.544 283.104 105.032C282.355 105.495 281.934 105.013 281.934 103.696C281.934 102.564 281.372 101.75 280.684 101.887C279.997 102.025 279.496 101.354 279.571 100.398C279.646 99.4411 279.372 98.8661 278.961 99.1211C278.55 99.3751 277.407 97.7951 276.422 95.6101C275.436 93.4251 274.267 91.6371 273.822 91.6371C273.378 91.6371 272.479 89.8521 271.826 87.6701C271.172 85.4881 270.301 83.9101 269.89 84.1641C269.48 84.4181 268.886 83.9531 268.57 83.1311C268.255 82.3091 268.545 81.6081 269.215 81.5741C269.886 81.5391 269.379 81.0881 268.09 80.5711C266.8 80.0541 265.535 78.8291 265.279 77.8471C264.628 75.3571 261.118 75.4601 256.635 78.0991Z" fill="black"/>
</svg>
