<svg width="56" height="64" viewBox="0 0 56 64" fill="none" xmlns="http://www.w3.org/2000/svg">
<path fill-rule="evenodd" clip-rule="evenodd" d="M52.5 0.5H3.5C2.57174 0.5 1.6815 0.868749 1.02513 1.52513C0.368749 2.1815 0 3.07174 0 4V60C0 60.9283 0.368749 61.8185 1.02513 62.4749C1.6815 63.1313 2.57174 63.5 3.5 63.5H52.5C53.4283 63.5 54.3185 63.1313 54.9749 62.4749C55.6313 61.8185 56 60.9283 56 60V4C56 3.07174 55.6313 2.1815 54.9749 1.52513C54.3185 0.868749 53.4283 0.5 52.5 0.5ZM7 56.5H49V7.5H7V56.5Z" fill="#A47A5E"/>
<path d="M42 14.5H28V21.5H42V14.5Z" fill="#72897C"/>
<path d="M24.5 14.5H14V28.5H24.5V14.5Z" fill="#72897C"/>
<path d="M42 25H28V28.5H42V25Z" fill="#72897C"/>
<path d="M21 32H14V35.5H21V32Z" fill="#72897C"/>
<path d="M24.5 35.5H42V32H24.5V35.5Z" fill="#72897C"/>
<path d="M31.5 39H14V42.5H31.5V39Z" fill="#72897C"/>
<path d="M35 42.5H42V39H35V42.5Z" fill="#72897C"/>
<path d="M42 46H14V49.5H42V46Z" fill="#72897C"/>
</svg>
