{
  "data": [
    {
      "id": 1,
      "full_name": "Galen Slixby",
      "role": "Editor",
      "username": "gslixby0",
      "email": "gslixby0@abc.net.au",
      "current_plan": "Enterprise",
      "billing": "Manual - Credit Card",
      "status": 3,
      "avatar": ""
    },
    {
      "id": 2,
      "full_name": "Halsey Redmore",
      "role": "Author",
      "username": "hredmore1",
      "email": "hredmore1@imgur.com",
      "current_plan": "Team",
      "billing": "Manual - Paypal",
      "status": 1,
      "avatar": ""
    },
    {
      "id": 3,
      "full_name": "Marjory Sicely",
      "role": "Maintainer",
      "username": "msicely2",
      "email": "msicely2@who.int",
      "current_plan": "Enterprise",
      "billing": "Auto Debit",
      "status": 2,
      "avatar": ""
    },
    {
      "id": 4,
      "full_name": "Cyrill Risby",
      "role": "Maintainer",
      "username": "crisby3",
      "email": "crisby3@wordpress.com",
      "current_plan": "Team",
      "billing": "Manual - Credit Card",
      "status": 3,
      "avatar": ""
    },
    {
      "id": 5,
      "full_name": "Maggy Hurran",
      "role": "Subscriber",
      "username": "mhurran4",
      "email": "mhurran4@yahoo.co.jp",
      "current_plan": "Enterprise",
      "billing": "Auto Debit",
      "status": 1,
      "avatar": ""
    },
    {
      "id": 6,
      "full_name": "Silvain Halstead",
      "role": "Author",
      "username": "shalstead5",
      "email": "shalstead5@shinystat.com",
      "current_plan": "Company",
      "billing": "Auto Debit",
      "status": 2,
      "avatar": ""
    },
    {
      "id": 7,
      "full_name": "Breena Gallemore",
      "role": "Subscriber",
      "username": "bgallemore6",
      "email": "bgallemore6@boston.com",
      "current_plan": "Company",
      "billing": "Manual - Paypal",
      "status": 1,
      "avatar": ""
    },
    {
      "id": 8,
      "full_name": "Kathryne Liger",
      "role": "Author",
      "username": "kliger7",
      "email": "kliger7@vinaora.com",
      "current_plan": "Enterprise",
      "billing": "Manual - Cash",
      "status": 1,
      "avatar": ""
    },
    {
      "id": 9,
      "full_name": "Franz Scotfurth",
      "role": "Subscriber",
      "username": "fscotfurth8",
      "email": "fscotfurth8@dailymotion.com",
      "current_plan": "Team",
      "billing": "Auto Debit",
      "status": 1,
      "avatar": ""
    },
    {
      "id": 10,
      "full_name": "Jillene Bellany",
      "role": "Maintainer",
      "username": "jbellany9",
      "email": "jbellany9@kickstarter.com",
      "current_plan": "Company",
      "billing": "Auto Debit",
      "status": 3,
      "avatar": ""
    },
    {
      "id": 11,
      "full_name": "Jonah Wharlton",
      "role": "Subscriber",
      "username": "jwharltona",
      "email": "jwharltona@oakley.com",
      "current_plan": "Team",
      "billing": "Manual - Paypal",
      "status": 3,
      "avatar": ""
    },
    {
      "id": 12,
      "full_name": "Seth Hallam",
      "role": "Subscriber",
      "username": "shallamb",
      "email": "shallamb@hugedomains.com",
      "current_plan": "Team",
      "billing": "Manual - Credit Card",
      "status": 1,
      "avatar": ""
    },
    {
      "id": 13,
      "full_name": "Yoko Pottie",
      "role": "Subscriber",
      "username": "ypottiec",
      "email": "ypottiec@privacy.gov.au",
      "current_plan": "Basic",
      "billing": "Auto Debit",
      "status": 3,
      "avatar": ""
    },
    {
      "id": 14,
      "full_name": "Maximilianus Krause",
      "role": "Author",
      "username": "mkraused",
      "email": "mkraused@stanford.edu",
      "current_plan": "Team",
      "billing": "Auto Debit",
      "status": 2,
      "avatar": ""
    },
    {
      "id": 15,
      "full_name": "Zsazsa McCleverty",
      "role": "Maintainer",
      "username": "zmcclevertye",
      "email": "zmcclevertye@soundcloud.com",
      "current_plan": "Enterprise",
      "billing": "Auto Debit",
      "status": 2,
      "avatar": ""
    },
    {
      "id": 16,
      "full_name": "Bentlee Emblin",
      "role": "Author",
      "username": "bemblinf",
      "email": "bemblinf@wired.com",
      "current_plan": "Company",
      "billing": "Auto Debit",
      "status": 2,
      "avatar": ""
    },
    {
      "id": 17,
      "full_name": "Brockie Myles",
      "role": "Maintainer",
      "username": "bmylesg",
      "email": "bmylesg@amazon.com",
      "current_plan": "Basic",
      "billing": "Manual - Paypal",
      "status": 2,
      "avatar": ""
    },
    {
      "id": 18,
      "full_name": "Bertha Biner",
      "role": "Editor",
      "username": "bbinerh",
      "email": "bbinerh@mozilla.com",
      "current_plan": "Team",
      "billing": "Manual - Cash",
      "status": 2,
      "avatar": ""
    },
    {
      "id": 19,
      "full_name": "Travus Bruntjen",
      "role": "Admin",
      "username": "tbruntjeni",
      "email": "tbruntjeni@sitemeter.com",
      "current_plan": "Enterprise",
      "billing": "Manual - Cash",
      "status": 2,
      "avatar": ""
    },
    {
      "id": 20,
      "full_name": "Wesley Burland",
      "role": "Editor",
      "username": "wburlandj",
      "email": "wburlandj@uiuc.edu",
      "current_plan": "Team",
      "billing": "Auto Debit",
      "status": 3,
      "avatar": ""
    },
    {
      "id": 21,
      "full_name": "Stu Delamaine",
      "role": "Author",
      "username": "sdelamainek",
      "email": "sdelamainek@who.int",
      "current_plan": "Basic",
      "billing": "Auto Debit",
      "status": 1,
      "avatar": ""
    },
    {
      "id": 22,
      "full_name": "Jameson Lyster",
      "role": "Editor",
      "username": "jlysterl",
      "email": "jlysterl@guardian.co.uk",
      "current_plan": "Company",
      "billing": "Auto Debit",
      "status": 3,
      "avatar": ""
    },
    {
      "id": 23,
      "full_name": "Kare Skitterel",
      "role": "Maintainer",
      "username": "kskitterelm",
      "email": "kskitterelm@washingtonpost.com",
      "current_plan": "Basic",
      "billing": "Manual - Paypal",
      "status": 1,
      "avatar": ""
    },
    {
      "id": 24,
      "full_name": "Cleavland Hatherleigh",
      "role": "Admin",
      "username": "chatherleighn",
      "email": "chatherleighn@washington.edu",
      "current_plan": "Team",
      "billing": "Manual - Paypal",
      "status": 1,
      "avatar": ""
    },
    {
      "id": 25,
      "full_name": "Adeline Micco",
      "role": "Admin",
      "username": "amiccoo",
      "email": "amiccoo@whitehouse.gov",
      "current_plan": "Enterprise",
      "billing": "Manual - Credit Card",
      "status": 1,
      "avatar": ""
    },
    {
      "id": 26,
      "full_name": "Hugh Hasson",
      "role": "Admin",
      "username": "hhassonp",
      "email": "hhassonp@bizjournals.com",
      "current_plan": "Basic",
      "billing": "Manual - Cash",
      "status": 3,
      "avatar": ""
    },
    {
      "id": 27,
      "full_name": "Germain Jacombs",
      "role": "Editor",
      "username": "gjacombsq",
      "email": "gjacombsq@jigsy.com",
      "current_plan": "Enterprise",
      "billing": "Manual - Cash",
      "status": 2,
      "avatar": ""
    },
    {
      "id": 28,
      "full_name": "Bree Kilday",
      "role": "Maintainer",
      "username": "bkildayr",
      "email": "bkildayr@mashable.com",
      "current_plan": "Team",
      "billing": "Manual - Credit Card",
      "status": 2,
      "avatar": ""
    },
    {
      "id": 29,
      "full_name": "Candice Pinyon",
      "role": "Maintainer",
      "username": "cpinyons",
      "email": "cpinyons@behance.net",
      "current_plan": "Team",
      "billing": "Auto Debit",
      "status": 2,
      "avatar": ""
    },
    {
      "id": 30,
      "full_name": "Isabel Mallindine",
      "role": "Subscriber",
      "username": "imallindinet",
      "email": "imallindinet@shinystat.com",
      "current_plan": "Team",
      "billing": "Manual - Credit Card",
      "status": 1,
      "avatar": ""
    },
    {
      "id": 31,
      "full_name": "Gwendolyn Meineken",
      "role": "Admin",
      "username": "gmeinekenu",
      "email": "gmeinekenu@hc360.com",
      "current_plan": "Basic",
      "billing": "Manual - Cash",
      "status": 1,
      "avatar": ""
    },
    {
      "id": 32,
      "full_name": "Rafaellle Snowball",
      "role": "Editor",
      "username": "rsnowballv",
      "email": "rsnowballv@indiegogo.com",
      "current_plan": "Basic",
      "billing": "Manual - Paypal",
      "status": 1,
      "avatar": ""
    },
    {
      "id": 33,
      "full_name": "Rochette Emer",
      "role": "Admin",
      "username": "remerw",
      "email": "remerw@blogtalkradio.com",
      "current_plan": "Basic",
      "billing": "Auto Debit",
      "status": 2,
      "avatar": ""
    },
    {
      "id": 34,
      "full_name": "Ophelie Fibbens",
      "role": "Subscriber",
      "username": "ofibbensx",
      "email": "ofibbensx@booking.com",
      "current_plan": "Company",
      "billing": "Manual - Cash",
      "status": 2,
      "avatar": ""
    },
    {
      "id": 35,
      "full_name": "Stephen MacGilfoyle",
      "role": "Maintainer",
      "username": "smacgilfoyley",
      "email": "smacgilfoyley@bigcartel.com",
      "current_plan": "Company",
      "billing": "Manual - Paypal",
      "status": 1,
      "avatar": ""
    },
    {
      "id": 36,
      "full_name": "Bradan Rosebotham",
      "role": "Subscriber",
      "username": "brosebothamz",
      "email": "brosebothamz@tripadvisor.com",
      "current_plan": "Team",
      "billing": "Manual - Paypal",
      "status": 3,
      "avatar": ""
    },
    {
      "id": 37,
      "full_name": "Skip Hebblethwaite",
      "role": "Admin",
      "username": "shebblethwaite10",
      "email": "shebblethwaite10@arizona.edu",
      "current_plan": "Company",
      "billing": "Manual - Cash",
      "status": 3,
      "avatar": ""
    },
    {
      "id": 38,
      "full_name": "Moritz Piccard",
      "role": "Maintainer",
      "username": "mpiccard11",
      "email": "mpiccard11@vimeo.com",
      "current_plan": "Enterprise",
      "billing": "Manual - Credit Card",
      "status": 3,
      "avatar": ""
    },
    {
      "id": 39,
      "full_name": "Tyne Widmore",
      "role": "Subscriber",
      "username": "twidmore12",
      "email": "twidmore12@bravesites.com",
      "current_plan": "Team",
      "billing": "Manual - Cash",
      "status": 1,
      "avatar": ""
    },
    {
      "id": 40,
      "full_name": "Florenza Desporte",
      "role": "Author",
      "username": "fdesporte13",
      "email": "fdesporte13@omniture.com",
      "current_plan": "Company",
      "billing": "Manual - Cash",
      "status": 2,
      "avatar": ""
    },
    {
      "id": 41,
      "full_name": "Edwina Baldetti",
      "role": "Maintainer",
      "username": "ebaldetti14",
      "email": "ebaldetti14@theguardian.com",
      "current_plan": "Team",
      "billing": "Manual - Credit Card",
      "status": 1,
      "avatar": ""
    },
    {
      "id": 42,
      "full_name": "Benedetto Rossiter",
      "role": "Editor",
      "username": "brossiter15",
      "email": "brossiter15@craigslist.org",
      "current_plan": "Team",
      "billing": "Manual - Cash",
      "status": 3,
      "avatar": ""
    },
    {
      "id": 43,
      "full_name": "Micaela McNirlan",
      "role": "Admin",
      "username": "mmcnirlan16",
      "email": "mmcnirlan16@hc360.com",
      "current_plan": "Basic",
      "billing": "Manual - Credit Card",
      "status": 3,
      "avatar": ""
    },
    {
      "id": 44,
      "full_name": "Vladamir Koschek",
      "role": "Author",
      "username": "vkoschek17",
      "email": "vkoschek17@abc.net.au",
      "current_plan": "Team",
      "billing": "Manual - Paypal",
      "status": 2,
      "avatar": ""
    },
    {
      "id": 45,
      "full_name": "Corrie Perot",
      "role": "Subscriber",
      "username": "cperot18",
      "email": "cperot18@goo.ne.jp",
      "current_plan": "Team",
      "billing": "Manual - Paypal",
      "status": 1,
      "avatar": ""
    },
    {
      "id": 46,
      "full_name": "Saunder Offner",
      "role": "Maintainer",
      "username": "soffner19",
      "email": "soffner19@mac.com",
      "current_plan": "Enterprise",
      "billing": "Auto Debit",
      "status": 1,
      "avatar": ""
    },
    {
      "id": 47,
      "full_name": "Karena Courtliff",
      "role": "Admin",
      "username": "kcourtliff1a",
      "email": "kcourtliff1a@bbc.co.uk",
      "current_plan": "Basic",
      "billing": "Manual - Paypal",
      "status": 2,
      "avatar": ""
    },
    {
      "id": 48,
      "full_name": "Onfre Wind",
      "role": "Admin",
      "username": "owind1b",
      "email": "owind1b@yandex.ru",
      "current_plan": "Basic",
      "billing": "Manual - Paypal",
      "status": 1,
      "avatar": ""
    },
    {
      "id": 49,
      "full_name": "Paulie Durber",
      "role": "Subscriber",
      "username": "pdurber1c",
      "email": "pdurber1c@gov.uk",
      "current_plan": "Team",
      "billing": "Manual - Cash",
      "status": 3,
      "avatar": ""
    },
    {
      "id": 50,
      "full_name": "Beverlie Krabbe",
      "role": "Editor",
      "username": "bkrabbe1d",
      "email": "bkrabbe1d@home.pl",
      "current_plan": "Company",
      "billing": "Auto Debit",
      "status": 2,
      "avatar": ""
    }
  ]
}