^I:\ПАРАЛЛЕЛЬНОЕ ПРОГРАММИРОВАНИЕ (ПП)\ЛАБОРАТОРНЫЕ РАБОТЫ\LAB2_PARPROGR\LAB1_PARPROGR\DEBUG\LAB1_PARPROGR.OBJ|I:\ПАРАЛЛЕЛЬНОЕ ПРОГРАММИРОВАНИЕ (ПП)\ЛАБОРАТОРНЫЕ РАБОТЫ\LAB2_PARPROGR\LAB1_PARPROGR\DEBUG\STDAFX.OBJ
I:\Параллельное Программирование (ПП)\Лабораторные работы\LAB2_PARPROGR\DEBUG\LAB1_PARPROGR.EXE
I:\Параллельное Программирование (ПП)\Лабораторные работы\LAB2_PARPROGR\DEBUG\LAB1_PARPROGR.ILK
I:\ПАРАЛЛЕЛЬНОЕ ПРОГРАММИРОВАНИЕ (ПП)\ЛАБОРАТОРНЫЕ РАБОТЫ\LAB2_PARPROGR\DEBUG\LAB1_PARPROGR.PDB
^I:\ПАРАЛЛЕЛЬНОЕ ПРОГРАММИРОВАНИЕ (ПП)\ЛАБОРАТОРНЫЕ РАБОТЫ\LAB3_PARPROGR\LAB1_PARPROGR\DEBUG\LAB1_PARPROGR.OBJ|I:\ПАРАЛЛЕЛЬНОЕ ПРОГРАММИРОВАНИЕ (ПП)\ЛАБОРАТОРНЫЕ РАБОТЫ\LAB3_PARPROGR\LAB1_PARPROGR\DEBUG\STDAFX.OBJ
I:\Параллельное Программирование (ПП)\Лабораторные работы\LAB3_PARPROGR\DEBUG\LAB1_PARPROGR.EXE
I:\Параллельное Программирование (ПП)\Лабораторные работы\LAB3_PARPROGR\DEBUG\LAB1_PARPROGR.ILK
I:\ПАРАЛЛЕЛЬНОЕ ПРОГРАММИРОВАНИЕ (ПП)\ЛАБОРАТОРНЫЕ РАБОТЫ\LAB3_PARPROGR\DEBUG\LAB1_PARPROGR.PDB
^I:\ПАРАЛЛЕЛЬНОЕ ПРОГРАММИРОВАНИЕ (ПП)\ЛАБОРАТОРНЫЕ РАБОТЫ\5\LAB1_PARPROGR\DEBUG\LAB1_PARPROGR.OBJ|I:\ПАРАЛЛЕЛЬНОЕ ПРОГРАММИРОВАНИЕ (ПП)\ЛАБОРАТОРНЫЕ РАБОТЫ\5\LAB1_PARPROGR\DEBUG\STDAFX.OBJ
I:\Параллельное Программирование (ПП)\Лабораторные работы\5\DEBUG\LAB1_PARPROGR.ILK
I:\Параллельное Программирование (ПП)\Лабораторные работы\5\DEBUG\LAB1_PARPROGR.EXE
I:\ПАРАЛЛЕЛЬНОЕ ПРОГРАММИРОВАНИЕ (ПП)\ЛАБОРАТОРНЫЕ РАБОТЫ\5\DEBUG\LAB1_PARPROGR.PDB
^I:\ПАРАЛЛЕЛЬНОЕ ПРОГРАММИРОВАНИЕ (ПП)\ЛАБОРАТОРНЫЕ РАБОТЫ\6\LAB1_PARPROGR\DEBUG\LAB1_PARPROGR.OBJ|I:\ПАРАЛЛЕЛЬНОЕ ПРОГРАММИРОВАНИЕ (ПП)\ЛАБОРАТОРНЫЕ РАБОТЫ\6\LAB1_PARPROGR\DEBUG\STDAFX.OBJ
I:\Параллельное Программирование (ПП)\Лабораторные работы\6\DEBUG\LAB1_PARPROGR.EXE
I:\Параллельное Программирование (ПП)\Лабораторные работы\6\DEBUG\LAB1_PARPROGR.ILK
I:\ПАРАЛЛЕЛЬНОЕ ПРОГРАММИРОВАНИЕ (ПП)\ЛАБОРАТОРНЫЕ РАБОТЫ\6\DEBUG\LAB1_PARPROGR.PDB
^C:\USERS\КНЯЗЬ\DESKTOP\6\LAB1_PARPROGR\DEBUG\LAB1_PARPROGR.OBJ|C:\USERS\КНЯЗЬ\DESKTOP\6\LAB1_PARPROGR\DEBUG\STDAFX.OBJ
C:\USERS\Князь\DESKTOP\6\DEBUG\LAB1_PARPROGR.EXE
C:\USERS\Князь\DESKTOP\6\DEBUG\LAB1_PARPROGR.ILK
C:\USERS\КНЯЗЬ\DESKTOP\6\DEBUG\LAB1_PARPROGR.PDB
