^\\LIVT-PFS\ROAMING PROFILES\K.PAVLOV\DOCUMENTS\VISUAL STUDIO 2012\PROJECTS\LAB1_PARPROGR\LAB1_PARPROGR\STDAFX.CPP
/c /ZI /nologo /W3 /WX- /Od /Oy- /D WIN32 /D _DEBUG /D _CONSOLE /D _UNICODE /D UNICODE /Gm /EHsc /RTC1 /MDd /GS /fp:precise /Zc:wchar_t /Zc:forScope /Yc"stdafx.h" /Fp"DEBUG\LAB1_PARPROGR.PCH" /Fo"DEBUG\\" /Fd"DEBUG\VC110.PDB" /Gd /TP /analyze- \\LIVT-PFS\ROAMING PROFILES\K.PAVLOV\DOCUMENTS\VISUAL STUDIO 2012\PROJECTS\LAB1_PARPROGR\LAB1_PARPROGR\STDAFX.CPP
^\\LIVT-PFS\ROAMING PROFILES\K.PAVLOV\DOCUMENTS\VISUAL STUDIO 2012\PROJECTS\LAB1_PARPROGR\LAB1_PARPROGR\LAB1_PARPROGR.CPP
/c /ZI /nologo /W3 /WX- /Od /Oy- /D WIN32 /D _DEBUG /D _CONSOLE /D _UNICODE /D UNICODE /Gm /EHsc /RTC1 /MDd /GS /fp:precise /Zc:wchar_t /Zc:forScope /Yu"stdafx.h" /Fp"DEBUG\LAB1_PARPROGR.PCH" /Fo"DEBUG\\" /Fd"DEBUG\VC110.PDB" /Gd /TP /analyze- \\LIVT-PFS\ROAMING PROFILES\K.PAVLOV\DOCUMENTS\VISUAL STUDIO 2012\PROJECTS\LAB1_PARPROGR\LAB1_PARPROGR\LAB1_PARPROGR.CPP
