^I:\ПАРАЛЛЕЛЬНОЕ ПРОГРАММИРОВАНИЕ (ПП)\ЛАБОРАТОРНЫЕ РАБОТЫ\LAB1_PARPROGR\LAB1_PARPROGR\STDAFX.CPP
I:\ПАРАЛЛЕЛЬНОЕ ПРОГРАММИРОВАНИЕ (ПП)\ЛАБОРАТОРНЫЕ РАБОТЫ\LAB1_PARPROGR\LAB1_PARPROGR\DEBUG\VC141.PDB
I:\Параллельное Программирование (ПП)\Лабораторные работы\LAB1_PARPROGR\LAB1_PARPROGR\DEBUG\LAB1_PARPROGR.PCH
I:\Параллельное Программирование (ПП)\Лабораторные работы\LAB1_PARPROGR\LAB1_PARPROGR\DEBUG\VC141.IDB
I:\Параллельное Программирование (ПП)\Лабораторные работы\LAB1_PARPROGR\LAB1_PARPROGR\DEBUG\STDAFX.OBJ
^I:\ПАРАЛЛЕЛЬНОЕ ПРОГРАММИРОВАНИЕ (ПП)\ЛАБОРАТОРНЫЕ РАБОТЫ\LAB1_PARPROGR\LAB1_PARPROGR\LAB1_PARPROGR.CPP
I:\ПАРАЛЛЕЛЬНОЕ ПРОГРАММИРОВАНИЕ (ПП)\ЛАБОРАТОРНЫЕ РАБОТЫ\LAB1_PARPROGR\LAB1_PARPROGR\DEBUG\VC141.PDB
I:\Параллельное Программирование (ПП)\Лабораторные работы\LAB1_PARPROGR\LAB1_PARPROGR\DEBUG\VC141.IDB
I:\Параллельное Программирование (ПП)\Лабораторные работы\LAB1_PARPROGR\LAB1_PARPROGR\DEBUG\LAB1_PARPROGR.OBJ
