^\\LIVT-PFS\ROAMING PROFILES\K.PAVLOV\DOCUMENTS\VISUAL STUDIO 2012\PROJECTS\LAB1_PARPROGR\LAB1_PARPROGR\DEBUG\LAB1_PARPROGR.OBJ|\\LIVT-PFS\ROAMING PROFILES\K.PAVLOV\DOCUMENTS\VISUAL STUDIO 2012\PROJECTS\LAB1_PARPROGR\LAB1_PARPROGR\DEBUG\STDAFX.OBJ
C:\PROGRAM FILES (X86)\MPICH\SDK\LIB\MPICH.LIB
C:\PROGRAM FILES (X86)\WINDOWS KITS\8.0\LIB\WIN8\UM\X86\KERNEL32.LIB
C:\PROGRAM FILES (X86)\WINDOWS KITS\8.0\LIB\WIN8\UM\X86\USER32.LIB
C:\PROGRAM FILES (X86)\WINDOWS KITS\8.0\LIB\WIN8\UM\X86\GDI32.LIB
C:\PROGRAM FILES (X86)\WINDOWS KITS\8.0\LIB\WIN8\UM\X86\WINSPOOL.LIB
C:\PROGRAM FILES (X86)\WINDOWS KITS\8.0\LIB\WIN8\UM\X86\COMDLG32.LIB
C:\PROGRAM FILES (X86)\WINDOWS KITS\8.0\LIB\WIN8\UM\X86\ADVAPI32.LIB
C:\PROGRAM FILES (X86)\WINDOWS KITS\8.0\LIB\WIN8\UM\X86\SHELL32.LIB
C:\PROGRAM FILES (X86)\WINDOWS KITS\8.0\LIB\WIN8\UM\X86\OLE32.LIB
C:\PROGRAM FILES (X86)\WINDOWS KITS\8.0\LIB\WIN8\UM\X86\OLEAUT32.LIB
C:\PROGRAM FILES (X86)\WINDOWS KITS\8.0\LIB\WIN8\UM\X86\UUID.LIB
C:\PROGRAM FILES (X86)\WINDOWS KITS\8.0\LIB\WIN8\UM\X86\ODBC32.LIB
C:\PROGRAM FILES (X86)\WINDOWS KITS\8.0\LIB\WIN8\UM\X86\ODBCCP32.LIB
\\LIVT-PFS\ROAMING PROFILES\K.PAVLOV\DOCUMENTS\VISUAL STUDIO 2012\PROJECTS\LAB1_PARPROGR\LAB1_PARPROGR\DEBUG\LAB1_PARPROGR.OBJ
\\LIVT-PFS\ROAMING PROFILES\K.PAVLOV\DOCUMENTS\VISUAL STUDIO 2012\PROJECTS\LAB1_PARPROGR\LAB1_PARPROGR\DEBUG\STDAFX.OBJ
C:\WINDOWS\GLOBALIZATION\SORTING\SORTDEFAULT.NLS
C:\PF\MICROSOFT VISUAL STUDIO 11.0\VC\LIB\MSVCRTD.LIB
C:\PF\MICROSOFT VISUAL STUDIO 11.0\VC\LIB\OLDNAMES.LIB
C:\PROGRAM FILES (X86)\WINDOWS KITS\8.0\BIN\X86\RC.EXE
C:\PF\MICROSOFT VISUAL STUDIO 11.0\VC\BIN\CVTRES.EXE
C:\WINDOWS\SYSTEM32\TZRES.DLL
C:\WINDOWS\SYSTEM32\RSAENH.DLL
