Value
0.17146526096424974
0.7370864936885216
0.1270293935724024
0.3696498749466268
0.6043340048360264
0.10310443885564724
0.8023741823372101
0.9455532358421244
0.9790388199339376
0.881232246338927
0.6276819214639752
0.9304865334026656
0.7247899531024389
0.7166778860553562
0.04107856658418385
0.4394817751674749
0.28206978311608777
0.3349959688919273
0.0835270070444003
0.760849147057386
