Value
0.25565328643413965
0.10831149418272878
0.7761807231738822
0.782477992600202
0.7616039143074941
0.9144031132693238
0.6586227819424226
0.5683675815729324
0.2017556924529783
0.6982963755517612
0.9521954098154773
0.8899632871420051
0.9935673628631737
0.8187035102039255
0.5451221661797199
0.4512540549640983
0.8905571879288573
0.9732647911186689
0.5934113295689697
0.36607449772047085
