Value
0.3230946929662495
0.871423255048698
0.21563406298839582
0.7349451885621964
0.3656190873671856
0.8016025985027602
0.7827355919753762
0.701355379236693
0.6227765866031991
0.49368264574711207
0.8405377001184887
0.7120969869436473
0.44390898141585244
0.031034861133332647
0.36323976019359805
0.7307217914103388
0.4755665730836416
0.3444169701220027
0.6408804349960188
0.12620532161439946
