Value
0.45781164889742754
0.9204025710930878
0.8790691615146757
0.2526157550465302
0.34800879286934616
0.18258873158030875
0.9017960513709921
0.7065281631717975
0.7266584615621408
0.9000878368097077
0.7791638007693242
0.5991547806042924
0.29112524489787484
0.15139526440743212
0.3351746591494349
0.6575517771578194
0.07334254363261816
0.05500639540622365
0.32319481392117644
0.5904818044629861
