Value
0.5659446430505314
0.00676406199000279
0.617441708804297
0.9121228864331543
0.7905241330570334
0.9920814661883615
0.9588017621528665
0.7919641352916398
0.2852509600245098
0.624916705305911
0.47809379567067456
0.19567517866589823
0.38231745203150647
0.05387368514623658
0.45164840826085906
0.9820047415219545
0.12394270048696299
0.1193808979262484
0.7385230561433468
0.5873036334639846
