Value
0.5282242775850605
0.9514287637535932
0.4803591785100161
0.5025595633825504
0.5368781929244097
0.8192020670641583
0.05711563808885989
0.6694217430745488
0.7671166283794725
0.7081153619776038
0.7968671837251966
0.5577608284274495
0.9658365319921276
0.14715689989299718
0.02964700053541558
0.5938934926247718
0.11406569874266248
0.9508098500841222
0.32570741442534723
0.1936186901537772
