Value
0.8538985671256417
0.287062425000009
0.17306722681479214
0.13402120599884282
0.9946538286442945
0.17949786946939184
0.31754682302719583
0.5682914046591072
0.00934857450024451
0.9006486211550919
0.9772414309225871
0.5568946791368349
0.08477384339419014
0.3330024657291001
0.728428676369672
0.14243537334181722
0.5524689394975455
0.2730432596836856
0.9744951380872597
0.6677869061450377
