Value
0.5092724471639539
0.6610474176084522
0.6303144424842815
0.3709268274575275
0.4467401517308447
0.4151082201975932
0.4803885080134066
0.9833235733884662
0.37342370735353736
0.012406981727713595
0.9219033377990289
0.873276070344208
0.35174682158758874
0.6301331125022921
0.35782695934169106
0.21281993764846496
0.22331922312265218
0.4195637917308277
0.07291022107806677
0.6508390701366923
