Value
0.4716325343203678
0.1071268171938663
0.22921856546061792
0.8999651948366754
0.4167535378026932
0.5358516625316159
0.006208516587129398
0.30064170577030114
0.4368931721756102
0.6121489970657575
0.9181980753805731
0.6257366699625353
0.7059975650817732
0.14983371598992723
0.7460634091367166
0.8310069924335378
0.6337257689509791
0.4383098811224275
0.15257277467450536
0.5684096152471901
