2018-01-01_00:00:00;18.72
2018-02-01_00:00:00;18.8
2018-03-01_00:00:00;18.92
2018-04-01_00:00:00;18.92
2018-05-01_00:00:00;19.14
2018-06-01_00:00:00;19.37
2018-07-01_00:00:00;19.63
2018-08-01_00:00:00;19.63
2018-09-01_00:00:00;20.38
2018-10-01_00:00:00;20.75
2018-11-01_00:00:00;21.27
2018-12-01_00:00:00;20.79
2019-01-01_00:00:00;20.79
2020-01-01_00:00:00;0.0