2016-01-01_00:00:00;17.68
2016-02-01_00:00:00;16.87
2016-03-01_00:00:00;16.33
2016-04-01_00:00:00;15.33
2016-05-01_00:00:00;15.18
2016-06-01_00:00:00;15.25
2016-07-01_00:00:00;15.47
2016-08-01_00:00:00;15.29
2016-09-01_00:00:00;14.96
2016-10-01_00:00:00;15.52
2016-11-01_00:00:00;16.12
2016-12-01_00:00:00;16.7
2017-01-01_00:00:00;16.7
2018-01-01_00:00:00;0