2015-01-01_00:00:00;22.69
2015-02-01_00:00:00;21.03
2015-03-01_00:00:00;21.27
2015-04-01_00:00:00;21.39
2015-05-01_00:00:00;21.21
2015-06-01_00:00:00;20.89
2015-07-01_00:00:00;20.5
2015-08-01_00:00:00;20.44
2015-09-01_00:00:00;20.46
2015-10-01_00:00:00;19.96
2015-11-01_00:00:00;19.39
2015-12-01_00:00:00;19.49
2016-01-01_00:00:00;19.49
2017-01-01_00:00:00;0