2015-01-01_00:00:00;0.9998474513478763
2015-01-07_23:00:00;0.9998474513478763
2015-01-08_00:00:00;0.9945518338527252
2015-01-14_23:00:00;0.9945518338527252
2015-01-15_00:00:00;1.0
2015-01-21_23:00:00;1.0
2015-01-22_00:00:00;0.9994987687144508
2015-01-28_23:00:00;0.9994987687144508
2015-01-29_00:00:00;0.9973412949201299
2015-02-04_23:00:00;0.9973412949201299
2015-02-05_00:00:00;0.9940723952317649
2015-02-11_23:00:00;0.9940723952317649
2015-02-12_00:00:00;0.9933314446357356
2015-02-18_23:00:00;0.9933314446357356
2015-02-19_00:00:00;0.9830017216205026
2015-02-25_23:00:00;0.9830017216205026
2015-02-26_00:00:00;0.9749820210517139
2015-03-04_23:00:00;0.9749820210517139
2015-03-05_00:00:00;0.9723233159718438
2015-03-11_23:00:00;0.9723233159718438
2015-03-12_00:00:00;0.8784405169220041
2015-03-18_23:00:00;0.8784405169220041
2015-03-19_00:00:00;0.8677839039379345
2015-03-25_23:00:00;0.8677839039379345
2015-03-26_00:00:00;0.881273563318587
2015-04-01_23:00:00;0.881273563318587
2015-04-02_00:00:00;0.898838450977401
2015-04-08_23:00:00;0.898838450977401
2015-04-09_00:00:00;0.8749536905877482
2015-04-15_23:00:00;0.8749536905877482
2015-04-16_00:00:00;0.8633382003617582
2015-04-22_23:00:00;0.8633382003617582
2015-04-23_00:00:00;0.861333275219561
2015-04-29_23:00:00;0.861333275219561
2015-04-30_00:00:00;0.8544903785385839
2015-05-06_23:00:00;0.8544903785385839
2015-05-07_00:00:00;0.8578464488853053
2015-05-13_23:00:00;0.8578464488853053
2015-05-14_00:00:00;0.8424608276854011
2015-05-20_23:00:00;0.8424608276854011
2015-05-21_00:00:00;0.8389522086865561
2015-05-27_23:00:00;0.8389522086865561
2015-05-28_00:00:00;0.8201015538169852
2015-06-03_23:00:00;0.8201015538169852
2015-06-04_00:00:00;0.8015995815808399
2015-06-10_23:00:00;0.8015995815808399
2015-06-11_00:00:00;0.7920326018262253
2015-06-17_23:00:00;0.7920326018262253
2015-06-18_00:00:00;0.7906814566217011
2015-06-24_23:00:00;0.7906814566217011
2015-06-25_00:00:00;0.791531370540676
2015-07-01_23:00:00;0.791531370540676
2015-07-02_00:00:00;0.7679299147906815
2015-07-08_23:00:00;0.7679299147906815
2015-07-09_00:00:00;0.5785952448405867
2015-07-15_23:00:00;0.5785952448405867
2015-07-16_00:00:00;0.5722753721097479
2015-07-22_23:00:00;0.5722753721097479
2015-07-23_00:00:00;0.685749776625188
2015-07-29_23:00:00;0.685749776625188
2015-07-30_00:00:00;0.6915030400767102
2015-08-05_23:00:00;0.6915030400767102
2015-08-06_00:00:00;0.7984178525508314
2015-08-12_23:00:00;0.7984178525508314
2015-08-13_00:00:00;0.9288251574520017
2015-08-19_23:00:00;0.9288251574520017
2015-08-20_00:00:00;0.9282367555080959
2015-08-26_23:00:00;0.9282367555080959
2015-08-27_00:00:00;0.9229411380129449
2015-09-02_23:00:00;0.9229411380129449
2015-09-03_00:00:00;0.9269509882973391
2015-09-09_23:00:00;0.9269509882973391
2015-09-10_00:00:00;0.9245537951925382
2015-09-16_23:00:00;0.9245537951925382
2015-09-17_00:00:00;0.9190838363806743
2015-09-23_23:00:00;0.9190838363806743
2015-09-24_00:00:00;0.9147035107982653
2015-09-30_23:00:00;0.9147035107982653
2015-10-01_00:00:00;0.820472029115
2015-10-07_23:00:00;0.820472029115
2015-10-08_00:00:00;0.7104408656046375
2015-10-14_23:00:00;0.7104408656046375
2015-10-15_00:00:00;0.824242160088914
2015-10-21_23:00:00;0.824242160088914
2015-10-22_00:00:00;0.9428814261119707
2015-10-28_23:00:00;0.9428814261119707
2015-10-29_00:00:00;0.946455423104583
2015-11-04_23:00:00;0.946455423104583
2015-11-05_00:00:00;0.9397650750757295
2015-11-11_23:00:00;0.9397650750757295
2015-11-12_00:00:00;0.929130254756249
2015-11-18_23:00:00;0.929130254756249
2015-11-19_00:00:00;0.9482206289363
2015-11-25_23:00:00;0.9482206289363
2015-11-26_00:00:00;0.9470220323838996
2015-12-02_23:00:00;0.9470220323838996
2015-12-03_00:00:00;0.942510950813956
2015-12-09_23:00:00;0.942510950813956
2015-12-10_00:00:00;0.9441671933227276
2015-12-16_23:00:00;0.9441671933227276
2015-12-17_00:00:00;0.9351886155120187
2015-12-23_23:00:00;0.9351886155120187
2015-12-24_00:00:00;0.9353629568287315
2015-12-30_23:00:00;0.9353629568287315
2015-12-31_00:00:00;0.9340118116242073
2015-12-31_23:00:00;0.9340118116242073
2016-01-01_00:00:00;0
2017-01-01_00:00:00;0