2018-01-01_00:00:00;0.9922105263157894
2018-01-31_09:00:00;0.9922105263157894
2018-01-31_10:00:00;0.9947368421052631
2018-03-02_19:00:00;0.9947368421052631
2018-03-02_20:00:00;0.9856842105263158
2018-04-02_05:00:00;0.9856842105263158
2018-04-02_06:00:00;0.8310526315789474
2018-05-02_15:00:00;0.8310526315789474
2018-05-02_16:00:00;0.8102368421052631
2018-06-02_01:00:00;0.8102368421052631
2018-06-02_02:00:00;0.9762368421052632
2018-07-02_11:00:00;0.9762368421052632
2018-07-02_12:00:00;0.971
2018-08-01_21:00:00;0.971
2018-08-01_22:00:00;0.9650263157894737
2018-09-01_07:00:00;0.9650263157894737
2018-09-01_08:00:00;0.8462105263157895
2018-10-01_17:00:00;0.8462105263157895
2018-10-01_18:00:00;0.8493684210526316
2018-11-01_03:00:00;0.8493684210526316
2018-11-01_04:00:00;0.9884473684210526
2018-12-01_13:00:00;0.9884473684210526
2018-12-01_14:00:00;1.0
2018-12-31_23:00:00;1.0
2019-01-01_00:00:00;0.0
2020-01-01_00:00:00;0.0