2019-01-01_00:00:00;33.69
2019-02-01_00:00:00;34.62
2019-03-01_00:00:00;36.73
2019-04-01_00:00:00;37.6
2019-05-01_00:00:00;40.37
2019-06-01_00:00:00;37.66
2019-07-01_00:00:00;36.61
2019-08-01_00:00:00;35.0
2019-09-01_00:00:00;34.89
2019-10-01_00:00:00;37.8
2019-11-01_00:00:00;38.58
2019-12-01_00:00:00;41.38
2020-01-01_00:00:00;0.0
2021-01-01_00:00:00;0.0