2016-01-01_00:00:00;8.37
2016-02-01_00:00:00;8.2
2016-03-01_00:00:00;8.19
2016-04-01_00:00:00;8.11
2016-05-01_00:00:00;8.17
2016-06-01_00:00:00;8.5
2016-07-01_00:00:00;8.91
2016-08-01_00:00:00;9.17
2016-09-01_00:00:00;9.35
2016-10-01_00:00:00;10.84
2016-11-01_00:00:00;12.35
2016-12-01_00:00:00;13.72
2017-01-01_00:00:00;13.72
2018-01-01_00:00:00;0