URL;Language;URL_List;Stars;Commits;Num_Files;Topics
https://github.com/SecWiki/sec-chart ; None; ['https://github.com/SecWiki/sec-chart/blob/2fc81095b6b4d104faae5d38a906160ddbf3d291/README.md'];5920;40;29;[]
https://github.com/trimstray/nginx-admins-handbook ; Shell; ['https://github.com/trimstray/nginx-admins-handbook/blob/3a663bca957f37ff9766959ff170d5bdb8eda269/doc/SSL_TLS_BASICS.md'];13280;1337;6;['nginx', 'nginx-proxy', 'nginx-configuration', 'security', 'performance', 'http', 'https', 'ssllabs', 'notes', 'cheatsheet', 'reference', 'handbook', 'best-practices', 'hacks', 'snippets', 'tengine', 'openresty']
https://github.com/microsoft/code-with-engineering-playbook ; Dockerfile; ['https://github.com/microsoft/code-with-engineering-playbook/blob/c21950a383b5850b5ec0ccd3971c01adde10050b/docs/security/threat-modelling-example.md'];1918;522;27;[]
https://github.com/lanjelot/kb ; None; ['https://github.com/lanjelot/kb/blob/fa29d804ce5a8278d8f6f6dae1893a4b4e306701/ssl'];314;38;285;[]
https://github.com/devsecopsmaturitymodel/DevSecOps-MaturityModel ; TypeScript; ['https://github.com/devsecopsmaturitymodel/DevSecOps-MaturityModel/blob/e5120b4387fb856776d5cb12a6b95fcfb9f1e41c/src/assets/Markdown%20Files/USAGE.md'];421;973;22;[]
https://github.com/sse-secure-systems/connaisseur ; Python; ['https://github.com/sse-secure-systems/connaisseur/blob/015e328d8c1b344323ecc804bd25c20bf2bcd91d/docs/threat_model.md', 'https://github.com/sse-secure-systems/connaisseur/blob/015e328d8c1b344323ecc804bd25c20bf2bcd91d/mkdocs.yml'];405;780;18;['kubernetes', 'integrity', 'docker', 'docker-content-trust', 'signature-verification', 'authentication', 'cosign', 'security', 'provenance', 'container', 'admission-controllers', 'image-signature', 'container-images', 'notary', 'sigstore']
https://github.com/center-for-threat-informed-defense/defending-iaas-with-attack ; Makefile; ['https://github.com/center-for-threat-informed-defense/defending-iaas-with-attack/blob/9409e11e760763400e22c567479495275119612c/docs/methodology.rst'];12;36;10;['ctid', 'cybersecurity', 'mitre-attack', 'threat-informed-defense', 'iaas']
https://github.com/PeterXiao/books_list_backup_2018_2019 ; TeX; ['https://github.com/PeterXiao/books_list_backup_2018_2019/blob/fcac8ae4b405c5098e4c344d9f20de281b391232/2019/3/Readme.md', 'https://github.com/PeterXiao/books_list_backup_2018_2019/blob/fcac8ae4b405c5098e4c344d9f20de281b391232/2019/3/files/sec-charts/README.md', 'https://github.com/PeterXiao/books_list_backup_2018_2019/blob/fcac8ae4b405c5098e4c344d9f20de281b391232/README.md'];192;1376;5;[]
https://github.com/Cloudneeti/pci-paas-webapp-ase-sqldb-appgateway-keyvault-oms ; HTML; ['https://github.com/Cloudneeti/pci-paas-webapp-ase-sqldb-appgateway-keyvault-oms/blob/dba0df97085fd044facb34b3441dcdbb17e27033/Overview.md'];37;323;22;['reference-architecture', 'azure', 'compliance', 'pci-dss', 'pci', 'azure-paas', 'gartner', 'paas', 'infrastructure', 'reference-architecture-diagram', 'decision-maker', 'azure-governance', 'governance', 'cloud', 'security', 'azure-security', 'microsoft']
https://github.com/UMBCvision/Universal-Litmus-Patterns ; Python; ['https://github.com/UMBCvision/Universal-Litmus-Patterns/blob/ade40061147ce8d158f8ce877a4df655b1beea92/docs/index.html'];38;41;6;[]
https://github.com/hysnsec/awesome-threat-modelling ; Dockerfile; ['https://github.com/hysnsec/awesome-threat-modelling/blob/c60fb0a82371c8ce557afbdfe903860ae959e9b3/README.md'];1134;84;6;['threat-modeling', 'practical-devsecops', 'security-review', 'devsecops-university', 'appsec', 'devsecops', 'awesome', 'awesome-list']
https://github.com/brampat/security ; HTML; ['https://github.com/brampat/security/blob/9628ab9250fb37ea56d404a329f068024929dd73/publications/presentation/ssd.md', 'https://github.com/brampat/security/blob/9628ab9250fb37ea56d404a329f068024929dd73/publications/presentation/ssd_sysmgt_special.md', 'https://github.com/brampat/security/blob/9628ab9250fb37ea56d404a329f068024929dd73/publications/presentation/2019-04-08.html', 'https://github.com/brampat/security/blob/9628ab9250fb37ea56d404a329f068024929dd73/publications/presentation/index.html', 'https://github.com/brampat/security/blob/9628ab9250fb37ea56d404a329f068024929dd73/publications/presentation/2019-07-31_madspace.html'];108;479;15;[]
https://github.com/devsecopsguides/devsecopsguides.github.io ; SCSS; ['https://github.com/devsecopsguides/devsecopsguides.github.io/blob/2813bdd4a83b31a93451ea39ca884be559bb11a7/docs/plan-develop/threats.md'];90;64;26;['devops', 'devsecops']
https://github.com/jasonblog/note ; C; ['https://github.com/jasonblog/note/blob/4471f95736c60969a718d854cab929f06726280a/blog/jin-yang.github.com/2014-06-07-https-introduce.md'];122;6421;103;[]
https://github.com/OWASP/www-project-integration-standards ; HTML; ['https://github.com/OWASP/www-project-integration-standards/blob/870eead5fe46d455ac0ea6463fd457a06fd564d3/writeups/owasp_in_sdlc/index.md'];25;67;11;[]
https://github.com/hardenedlinux/hardenedlinux.github.io ; HTML; ['https://github.com/hardenedlinux/hardenedlinux.github.io/blob/f1eced3a144573789a72f5ae2a26406ec1f63d86/_posts/2017-03-17-debian_hardened_boot.markdown'];30;512;17;[]
https://github.com/open-feature/open-feature-operator ; Go; ['https://github.com/open-feature/open-feature-operator/blob/a6fa04f590ad4ad6779ce85f4fc167b59f1b17a7/docs/threat_model.md', 'https://github.com/open-feature/open-feature-operator/blob/a6fa04f590ad4ad6779ce85f4fc167b59f1b17a7/docs/README.md'];123;754;32;[]
https://github.com/par-tec/security-ontologies ; Jupyter Notebook; ['https://github.com/par-tec/security-ontologies/blob/38f5dc6165572199182cc76e8c0c289dcfa7c770/docs/sparql/dsomm.ttl', 'https://github.com/par-tec/security-ontologies/blob/38f5dc6165572199182cc76e8c0c289dcfa7c770/vocabularies/dsomm.ttl', 'https://github.com/par-tec/security-ontologies/blob/38f5dc6165572199182cc76e8c0c289dcfa7c770/external/dimensions-subdimensions-activities/CultureAndOrganization/Design.yaml'];3;19;32;[]
https://github.com/iosifache/oss_fortress ; HTML; ['https://github.com/iosifache/oss_fortress/blob/8cd06ad98121ba887bcafacea46b123e8ffa240e/presentation/ubuntu-summit-23/project.md', 'https://github.com/iosifache/oss_fortress/blob/8cd06ad98121ba887bcafacea46b123e8ffa240e/wiki/docs/threat-modelling/Proposed%20threat%20model.md'];14;111;14;['workshop', 'open-source', 'software-security']
https://github.com/SuperXiaoxiong/smartools ; Python; ['https://github.com/SuperXiaoxiong/smartools/blob/42f0bee6f255316033d2cad398f756b2be6327b3/Xhofe-alist%E6%96%87%E4%BB%B6%E9%80%92%E5%BD%92%E4%B8%8B%E8%BD%BD.ipynb'];1;16;12;[]
https://github.com/lihararora/lihararora.github.io ; HTML; ['https://github.com/lihararora/lihararora.github.io/blob/88bd45435b79c055e0b0fdbd74a18820e8aef6b9/_site/security-resources.html', 'https://github.com/lihararora/lihararora.github.io/blob/88bd45435b79c055e0b0fdbd74a18820e8aef6b9/_pages/security-resources.md'];0;112;23;[]
https://github.com/DevComputaria/GuiaSegurancaParaDevs ; None; ['https://github.com/DevComputaria/GuiaSegurancaParaDevs/blob/c90245b787f7c0273cfb093a358f52465e931c14/Languages/awesome-threat-modelling.md'];3;50;12;['security', 'codesecurity', 'security-checklist', 'codesecure', 'devsec', 'appsec']
https://github.com/KubeWatch-Monitoring/KubeWatch ; TypeScript; ['https://github.com/KubeWatch-Monitoring/KubeWatch/blob/7b8f5b1bd71b66053a44b1dac6d41e7122f6fcff/Documentation/src/02_product-documentation/07_threat-model.tex'];1;350;8;[]
https://github.com/Ascotbe/HackerMind ; None; ['https://github.com/Ascotbe/HackerMind/blob/f52e1e7e5032f0f60279d65517bda98099c67235/README.md'];1085;22;38;['ctf', 'linux', 'security', 'hacker', 'mind']
https://github.com/dimmyvi/tigress-sample-implementation ; Makefile; ['https://github.com/dimmyvi/tigress-sample-implementation/blob/a318b65d3a22c02018e3d3b79ec1c31ef3e57edf/draft-tigress-sample-implementation.md'];0;71;9;[]
https://github.com/andifalk/architecture-docs ; None; ['https://github.com/andifalk/architecture-docs/blob/e009df40f535ea3e444582dfa7b886bff0b80504/src/docs/asciidoc/chapters/10_quality_requirements.adoc'];0;7;9;[]
https://github.com/IEEE-NITK/virtual-expo ; CSS; ['https://github.com/IEEE-NITK/virtual-expo/blob/203771aeb46027a91c6c9d4cebad23503054242a/_posts/2020-07-06-adversarial-reinforcement-learning.md'];0;108;26;['expo', 'jekyll', 'projects']
https://github.com/TalEliyahu/Threat_Model_Examples ; None; ['https://github.com/TalEliyahu/Threat_Model_Examples/blob/3b0d3ad7fc65444a7b98b0daa8983daef0ce1518/README.md'];330;46;1;['risk-assessment', 'threat', 'threat-analysis', 'threat-modeling']
https://github.com/Dajamante/rust_spark_joy ; None; ['https://github.com/Dajamante/rust_spark_joy/blob/c5ccf60d0dc6fb78042c4024938d039c0edfeb01/src/background_files/ffi.md', 'https://github.com/Dajamante/rust_spark_joy/blob/c5ccf60d0dc6fb78042c4024938d039c0edfeb01/src/sources_analysis/mergendahl.md'];0;18;4;[]
https://github.com/sgayou/medfusion-4000-research ; Python; ['https://github.com/sgayou/medfusion-4000-research/blob/3a85c1084bd41ca0b09fd05dcc5242663967ee98/doc/README.md'];336;1;4;['reverse-engineering', 'exploitation']
https://github.com/mo-xiaoxi/ESpoofing ; Python; ['https://github.com/mo-xiaoxi/ESpoofing/blob/5a1e943ceca3008284d19507ea2ac565acc34662/README.md'];193;20;14;['espoofing', 'spoofing-emails', 'security', 'emailspoofing']
https://github.com/Jin-Yang/jin-yang.github.com ; CSS; ['https://github.com/Jin-Yang/jin-yang.github.com/blob/cd62fbcce950e14afc70c93d8511e6c7e97ae463/_posts/2014-06-07-https-introduce.md'];18;13;36;['blog', 'linux', 'mysql', 'python']
https://github.com/hartwork/sandwine ; Python; ['https://github.com/hartwork/sandwine/blob/53a895b7d8d90b77a01f911900b92db746b42b2e/README.md'];33;109;11;['bubblewrap', 'bubblewrap-wrap', 'bwrap', 'gplv3-licensing', 'pulseaudio', 'sandbox', 'sandbox-environment', 'sandboxing', 'winamp', 'windows', 'wine', 'x11', 'x2go', 'xephyr', 'nxagent', 'xnest', 'python', 'python-3', 'python3']
https://github.com/Nieuport/Nginx-Admin-s-Handbook ; Shell; ['https://github.com/Nieuport/Nginx-Admin-s-Handbook/blob/c5ce10ee27b3b5714ae6858ef2a60616f70df4d3/doc/SSL_TLS_BASICS.md'];3;1198;6;[]
https://github.com/Princeton-SysML/FILM ; Python; ['https://github.com/Princeton-SysML/FILM/blob/e895628881ddcaaf8743110d1a4e94e3beac3270/README.md'];48;9;13;[]
https://github.com/jinzhao-dev/sworndisk-oscomp ; C; ['https://github.com/jinzhao-dev/sworndisk-oscomp/blob/c5899a8d747e34c7d108f7d9d2f45df9c82827e3/README.md'];19;24;5;[]
https://github.com/MahlerTom/UniversityCourseBookAOI ; TeX; ['https://github.com/MahlerTom/UniversityCourseBookAOI/blob/f5fedf3f2b02b191c3eb1e52131be78d71541aa5/chapters/02_Temporal_SC_1.tex'];5;120;12;[]
https://github.com/Truvis/CheatSheets ; None; ['https://github.com/Truvis/CheatSheets/blob/70b54a56268a0367ebd11c16a950750f9143184c/RedTeam_Hacking_Notes.md'];61;169;29;['windows', 'linux', 'opnsense', 'pfsense', 'splunk', 'elkstack', 'snmp', 'siem', 'network-monitoring', 'security-tools', 'security-audit', 'logstash', 'elasticsearch', 'kibana', 'dashboards', 'filebeat', 'packetbeat', 'security', 'cheatsheets', 'zeek']
https://github.com/tradem/secure-coding-slides ; JavaScript; ['https://github.com/tradem/secure-coding-slides/blob/e9b19aaed4084d947e632a3f096c4aa199cdfca4/index.html'];4;14;16;[]
https://github.com/EmailTestTools/EmailTestTools ; Python; ['https://github.com/EmailTestTools/EmailTestTools/blob/384cf319c6cd3d817da48a617d056a3705552162/README.md'];9;14;18;[]
https://github.com/paulveillard/cybersecurity-threat-modeling ; Go; ['https://github.com/paulveillard/cybersecurity-threat-modeling/blob/abbe2ef40fce4387359bf31fcbabae9c5d468bf0/README.md'];4;39;6;[]
https://github.com/SexyBeast233/SecBooks ; HTML; ['https://github.com/SexyBeast233/SecBooks/blob/5db89917881e79a58f6eef3c83c125c92e92d08b/%E3%80%90%E5%85%AC%E4%BC%97%E5%8F%B7%E6%96%87%E7%AB%A0%E3%80%91HACK%E5%AD%A6%E4%B9%A0%E5%91%80/html/HACK%E5%AD%A6%E4%B9%A0%E5%91%80_2019-02-17_%E5%B9%B2%E8%B4%A7%E4%BF%A1%E6%81%AF%E5%AE%89%E5%85%A8%E7%B1%BB%E6%80%9D%E7%BB%B4%E5%AF%BC%E5%9B%BE%E6%95%B4%E7%90%86%E5%88%86%E4%BA%AB.html'];476;7;16;[]
https://github.com/Echobob/awesome-all ; None; ['https://github.com/Echobob/awesome-all/blob/94a8e0fa6d1cdcaaaf12e04b6c507e578440c1b5/archives/awesome-threat-modelling/hysnsec/README.md'];64;9;3;['awesome', 'awesome-list', 'archives']
https://github.com/EHB-TI/web-app-callback-cats ; JavaScript; ['https://github.com/EHB-TI/web-app-callback-cats/blob/dfc37f1d99ec3b3e5edc19700658bfb0a8a6f6f3/README.md'];0;109;6;[]
https://github.com/EHB-TI/web-app-brute-force ; CSS; ['https://github.com/EHB-TI/web-app-brute-force/blob/d0d82c2419c0fd0e9a50c32b63c18f6a4957adff/README.md'];0;128;8;[]
https://github.com/hpacheco/ses ; HTML; ['https://github.com/hpacheco/ses/blob/8658f1724e421f4a8dbe0f15923b17f96036d3f1/labs/Lab3.md'];3;169;11;[]
https://github.com/iosifache/opensource-check-security-check ; None; ['https://github.com/iosifache/opensource-check-security-check/blob/d39939d0170617b11295f5a6f9c2f4d8506f0677/project.md'];0;2;5;['open-source', 'talk', 'secure-oss']
https://github.com/z-r0crypt/SecNotes ; None; ['https://github.com/z-r0crypt/SecNotes/blob/3e4500308e7167692fef5d3098fbc22660fcc678/ssl'];7;24;298;[]
https://github.com/sobinge/- ; None; ['https://github.com/sobinge/-/blob/f04f086e3922e8ad7c3528873f3d549242bff31e/Cheat%20Sheet/ssl'];4;141;92;[]
https://github.com/lazaars/Useful-notes ; None; ['https://github.com/lazaars/Useful-notes/blob/3427f6971f1d1223ec76147e9ba6527f22530a9c/ssl'];5;11;290;[]
https://github.com/dzvision/hack_learn ; HTML; ['https://github.com/dzvision/hack_learn/blob/eb5d84b3b7d25c2db03b28bf6235aa49585f9632/HACK%E5%AD%A6%E4%B9%A0%E5%91%80_2019-02-17_%E5%B9%B2%E8%B4%A7%E4%BF%A1%E6%81%AF%E5%AE%89%E5%85%A8%E7%B1%BB%E6%80%9D%E7%BB%B4%E5%AF%BC%E5%9B%BE%E6%95%B4%E7%90%86%E5%88%86%E4%BA%AB.html'];1;2;474;[]
https://github.com/Mayter/sec-charts ; None; ['https://github.com/Mayter/sec-charts/blob/e6e6bfb19e3f84628b6ad1f78e3361650e099de9/README.md'];33;8;18;[]
https://github.com/carlospolop/hacktricks ; Python; ['https://github.com/carlospolop/hacktricks/blob/d3fb5739181b1a83d0471cbb7b976c76d9d80bd9/generic-methodologies-and-resources/threat-modeling.md'];7533;4163;40;['hacktricks', 'pentesting', 'hacking', 'peass']
https://github.com/linuxboot/heads-wiki ; None; ['https://github.com/linuxboot/heads-wiki/blob/cffdc0d08d501a7bdfddbdc91c6f5c5e93799352/About/Heads-threat-model.md'];78;248;12;[]
https://github.com/creatis-myriad/creatis-myriad.github.io ; HTML; ['https://github.com/creatis-myriad/creatis-myriad.github.io/blob/73fd6b72af9e765c750de216e9fb1a9beca5591b/collections/_posts/2023-04-05-GenerativeGradientLeakageFL.md'];16;162;23;['artificial-intelligence', 'deep-learning', 'medical-image-processing', 'modeling-and-simulation']
https://github.com/Kicksecure/kicksecure-wiki-backup ; None; ['https://github.com/Kicksecure/kicksecure-wiki-backup/blob/619c6a2c924f8e8ef45d5f26b0a29915e418249b/Threat_Modeling.mw'];0;296;1000;[]
https://github.com/bhismarajtimsina/book ; Python; ['https://github.com/bhismarajtimsina/book/blob/28a171cefcfb7233c727289da9cacc4dec7bc28c/generic-methodologies-and-resources/threat-modeling.md'];0;2;41;[]
https://github.com/emtee40/HackTrix ; Python; ['https://github.com/emtee40/HackTrix/blob/b57b0d67b9cb3585d0331d10ac1b9843850c39fe/generic-methodologies-and-resources/threat-modeling.md'];0;3991;41;[]
https://github.com/whoami-chmod777/HackTricks ; Python; ['https://github.com/whoami-chmod777/HackTricks/blob/9f5e99c77f231ba906b29a529c2f5e7dce3a816b/generic-methodologies-and-resources/threat-modeling.md'];0;4057;40;[]
https://github.com/status-im/nimbus-eth2 ; Nim; ['https://github.com/status-im/nimbus-eth2/blob/3a527d622d6ba9c0588c5165f77f7e5d454dc3cb/docs/the_auditors_handbook/src/SUMMARY.md'];463;6054;40;['ethereum', 'nim', 'beacon-chain', 'serenity', 'nimbus', 'eth2-clients', 'nimbus-eth2', 'eth2', 'proof-of-stake', 'hacktoberfest']
https://github.com/penumbra-zone/penumbra ; Rust; ['https://github.com/penumbra-zone/penumbra/blob/c0445f34752f64a253b672188f3a6d8f5f58c116/docs/protocol/src/crypto/fmd.md', 'https://github.com/penumbra-zone/penumbra/blob/c0445f34752f64a253b672188f3a6d8f5f58c116/docs/protocol/src/SUMMARY.md'];280;5347;20;['privacy', 'dex', 'cosmos']
https://github.com/confidential-containers/td-shim ; Rust; ['https://github.com/confidential-containers/td-shim/blob/850bb35490f634041c6bd049e55de6523613c7d6/doc/design.md', 'https://github.com/confidential-containers/td-shim/blob/850bb35490f634041c6bd049e55de6523613c7d6/README.md'];77;663;29;[]
https://github.com/department-of-veterans-affairs/va.gov-team ; HTML; ['https://github.com/department-of-veterans-affairs/va.gov-team/blob/89187a0178a400701f54f9dfffe821a1826649d6/platform/engineering/backend/threat-model-in-practice.md'];261;96230;29;[]
https://github.com/leto/hushlist ; TeX; ['https://github.com/leto/hushlist/blob/b9390a5f583ecadba0186eb8a038db52243981d7/MANIFEST'];9;189;11;['zcash', 'hush', 'bitcoin', 'communication', 'privacy', 'censorship-circumvention', 'metadata']
https://github.com/valory-xyz/open-autonomy ; Python; ['https://github.com/valory-xyz/open-autonomy/blob/494434ea88529665457b615da3f952a5f94172ea/docs/key_concepts/index.md', 'https://github.com/valory-xyz/open-autonomy/blob/863aebbf176535b7475a89afe8dacb4a1584e3de/.spelling', 'https://github.com/valory-xyz/open-autonomy/blob/863aebbf176535b7475a89afe8dacb4a1584e3de/mkdocs.yml'];49;12655;32;['aea', 'autonomy', 'open-aea', 'open-autonomy', 'autonomous-economic-agents', 'agent-framework', 'multi-agent-systems', 'cryptocurrencies', 'cryptocurrency', 'multi-agent', 'agent-services', 'decentralized', 'decentralized-network']
https://github.com/mithril-security/blindai ; Rust; ['https://github.com/mithril-security/blindai/blob/f96e2a1833ca8f115c3cf16c0589dfa594753eb2/mkdocs.yml'];471;449;30;['ai', 'intel-sgx', 'confidential-computing', 'privacy', 'rust', 'python3', 'inference', 'enclave', 'onnx', 'sgx', 'machine-learning']
https://github.com/MeisterP/torbrowser-overlay ; Shell; ['https://github.com/MeisterP/torbrowser-overlay/blob/6c7ee325ae3c909da74cbbe366d11a281d14e7da/app-misc/mat2/mat2-0.13.4.ebuild'];32;733;12;['gentoo', 'gentoo-overlay', 'ebuild', 'tor', 'tor-browser']
https://github.com/mrwadams/stride-gpt ; Python; ['https://github.com/mrwadams/stride-gpt/blob/8e2c01b0b4810fdfb420151c0af39f1c339f6c15/main.py'];71;44;9;[]
https://github.com/ShellCode33/ArchLinux-Hardened ; Python; ['https://github.com/ShellCode33/ArchLinux-Hardened/blob/85e48c316f13dc00a051147dc2420335c04c07b4/docs/FIREJAIL.md'];8;226;8;['apparmor', 'archlinux', 'auditd', 'btrfs', 'encryption', 'hardening', 'luks', 'secure-boot', 'security', 'wayland']
https://github.com/danielcuthbert/home-assistant ; None; ['https://github.com/danielcuthbert/home-assistant/blob/986fa907996848bfcec8ffffe48c94f9c37b800c/readme.md'];58;45;12;[]
https://github.com/w3ctag/meetings ; HTML; ['https://github.com/w3ctag/meetings/blob/23dcfee18441effdd387d161076374edf8cbd63f/2021/05-Arakeen/minutes.md'];44;2173;19;[]
https://github.com/BlockchainCommons/Pseudonymity-Guide ; None; ['https://github.com/BlockchainCommons/Pseudonymity-Guide/blob/b1201ca9bb07f7d6d4e53db4e54044d7e13f3659/01_2_regain_privacy.md', 'https://github.com/BlockchainCommons/Pseudonymity-Guide/blob/b1201ca9bb07f7d6d4e53db4e54044d7e13f3659/README.md'];81;45;13;['privacy', 'privacy-tools', 'bitcoin', 'anonymity', 'pseudonymous', 'pseudonymity']
https://github.com/Electric-Coin-Company/zcash-docs ; HTML; ['https://github.com/Electric-Coin-Company/zcash-docs/blob/e69b7fe7955d97f9c379a5de92de2993039d98d6/source/index.rst'];0;715;12;[]
https://github.com/xvnpw/ai-threat-modeling-action ; Dockerfile; ['https://github.com/xvnpw/ai-threat-modeling-action/blob/3d0f3d7e80834ea0bebbd61e8f78cf3a9388c660/action.yml'];22;51;8;['ai', 'devsecops', 'github-actions', 'gpt', 'langchain', 'python', 'security', 'threat-modeling']
https://github.com/indieweb/indieweb-chat-archive ; PHP; ['https://github.com/indieweb/indieweb-chat-archive/blob/ddbf8b5e0d0717ce26bd3df7a96c652b99904257/freenode/%23indieweb-dev/2020/10/12.txt'];12;151655;11;[]
https://github.com/OpenMandrivaAssociation/mat2 ; Shell; ['https://github.com/OpenMandrivaAssociation/mat2/blob/325165a8a9dafa9a61b54d73f6c9e0f5a9f2361f/mat2.spec'];0;4;3;[]
https://github.com/parallaxsecond/parsec-book ; Shell; ['https://github.com/parallaxsecond/parsec-book/blob/c1a937b348d8da5536d9e4e8664e2dac0435d138/src/parsec_security/secure_deployment.md', 'https://github.com/parallaxsecond/parsec-book/blob/c1a937b348d8da5536d9e4e8664e2dac0435d138/src/parsec_service/stability.md', 'https://github.com/parallaxsecond/parsec-book/blob/c1a937b348d8da5536d9e4e8664e2dac0435d138/src/parsec_service/install_parsec_linux.md', 'https://github.com/parallaxsecond/parsec-book/blob/c1a937b348d8da5536d9e4e8664e2dac0435d138/src/SUMMARY.md', 'https://github.com/parallaxsecond/parsec-book/blob/c1a937b348d8da5536d9e4e8664e2dac0435d138/src/parsec_security/README.md'];10;286;8;[]
https://github.com/valory-xyz/mech ; Python; ['https://github.com/valory-xyz/mech/blob/91d535daeea7f8d194e5cdf1d1f39f4dbf9abc64/.spelling'];14;756;26;[]
https://github.com/alixaxel/dump.HN ; JavaScript; ['https://github.com/alixaxel/dump.HN/blob/11fd7291c89c68daf4196a47e8cfa47e4df30c8d/data/items/2013/05/15/14-15.csv'];44;6;4;[]
https://github.com/tillitis/tillitis-key1 ; Verilog; ['https://github.com/tillitis/tillitis-key1/blob/d83f235fd352f5d9eaf2b1bbcdb3122fc8939e21/README.md'];310;424;10;['fpga', 'open-hardware', 'security-token']
https://github.com/phnx-im/docs ; None; ['https://github.com/phnx-im/docs/blob/ec04134c8371d9b0da173eff88cbb0fc2cce9936/src/spec.md', 'https://github.com/phnx-im/docs/blob/ec04134c8371d9b0da173eff88cbb0fc2cce9936/src/status.md', 'https://github.com/phnx-im/docs/blob/ec04134c8371d9b0da173eff88cbb0fc2cce9936/src/spec/federation.md', 'https://github.com/phnx-im/docs/blob/ec04134c8371d9b0da173eff88cbb0fc2cce9936/src/spec/federation/federation_protocol.md', 'https://github.com/phnx-im/docs/blob/ec04134c8371d9b0da173eff88cbb0fc2cce9936/src/SUMMARY.md'];0;51;5;[]
https://github.com/xxfoundation/elixxir-docs ; None; ['https://github.com/xxfoundation/elixxir-docs/blob/1ce87f00db92fba7b0fb09d4a4cf22d0f7815ac2/pki.md', 'https://github.com/xxfoundation/elixxir-docs/blob/1ce87f00db92fba7b0fb09d4a4cf22d0f7815ac2/architecture.md', 'https://github.com/xxfoundation/elixxir-docs/blob/1ce87f00db92fba7b0fb09d4a4cf22d0f7815ac2/cmix.md', 'https://github.com/xxfoundation/elixxir-docs/blob/1ce87f00db92fba7b0fb09d4a4cf22d0f7815ac2/wire.md', 'https://github.com/xxfoundation/elixxir-docs/blob/1ce87f00db92fba7b0fb09d4a4cf22d0f7815ac2/README.md'];9;225;13;[]
https://github.com/linkedin/forthic ; Python; ['https://github.com/linkedin/forthic/blob/ed8d60e35e52b7213d7b12deb5c82c3149412c47/README.md'];15;111;19;[]
https://github.com/DMTF/libspdm ; C; ['https://github.com/DMTF/libspdm/blob/93cd9b2e65fe6b9529ce7a9b35ec230b78ddf417/README.md'];73;1894;16;[]
https://github.com/digitalcredentials/docs ; None; ['https://github.com/digitalcredentials/docs/blob/e39261a6c6316133d546c3513d7d3a57f8d8f142/README.md'];16;99;13;[]
https://github.com/edgexfoundry/edgex-docs ; HTML; ['https://github.com/edgexfoundry/edgex-docs/blob/bc469fdbb7819525864e8cc50d67cde279bd54e0/docs_src/threat-models/secret-store/README.md'];38;1380;13;[]
https://github.com/mt-caret/mizu ; Rust; ['https://github.com/mt-caret/mizu/blob/93d7536094106926a270334e6fe998708fd80277/README.md', 'https://github.com/mt-caret/mizu/blob/93d7536094106926a270334e6fe998708fd80277/docs/technical_details.md'];13;283;15;[]
https://github.com/TankerHQ/spec ; None; ['https://github.com/TankerHQ/spec/blob/05d28e84faca9ee1a2675ad04cee938848e668f3/README.md'];16;151;12;['tanker', 'encryption', 'end-to-end', 'sdk', 'cryptography', 'privacy', 'security', 'specification']
https://github.com/netology-code/ibb-homeworks ; None; ['https://github.com/netology-code/ibb-homeworks/blob/00ec4d3be50a1a357be53226441a72365125314f/README.md', 'https://github.com/netology-code/ibb-homeworks/blob/00ec4d3be50a1a357be53226441a72365125314f/06_threats/README.md'];13;181;17;[]
https://github.com/fairlayer/wiki ; None; ['https://github.com/fairlayer/wiki/blob/5b6d78ac2adf7e23f58e8b1df7c834c6fccadf35/README.md', 'https://github.com/fairlayer/wiki/blob/5b6d78ac2adf7e23f58e8b1df7c834c6fccadf35/11_step_by_step.md'];9;11;20;[]
https://github.com/ojkelly/paranoidmode.com ; None; ['https://github.com/ojkelly/paranoidmode.com/blob/46be938723de3d32b832ce693bac7e6e4205a4a4/SUMMARY.md'];15;352;10;[]
https://github.com/GaloisInc/BESSPIN-Voter-Registration ; C; ['https://github.com/GaloisInc/BESSPIN-Voter-Registration/blob/223bd9d8ac3470e18e281ef03d5324160397eb41/design/README.md'];1;319;10;[]
https://github.com/Electric-Coin-Company/zashi-ios ; Swift; ['https://github.com/Electric-Coin-Company/zashi-ios/blob/88715ded046de2b4778710341ef768c2ca21de82/README.md'];20;546;22;['cryptocurrency', 'wallet', 'zcash', 'ios-app', 'ios-swift']
https://github.com/ep-infosec/36_linkedin_forthic ; Python; ['https://github.com/ep-infosec/36_linkedin_forthic/blob/3b1a4fcdc185024d2c563cc2a4a7a76a5bc4ecec/README.md'];0;1;14;[]
https://github.com/rustic-rs/dev-docs ; CSS; ['https://github.com/rustic-rs/dev-docs/blob/f9adbd9d63ba4f994340d6d7693d31d85a786be8/src/SUMMARY.md'];0;40;8;['backup', 'deduplication', 'developer', 'documentation', 'encryption', 'restic', 'rust']
https://github.com/wszhs/my_knowledge_map ; None; ['https://github.com/wszhs/my_knowledge_map/blob/7cef63dca920e8bb843ebe0f4aadc119fd3720d7/README.md'];5;28;9;[]
https://github.com/Electric-Coin-Company/zashi-android ; Kotlin; ['https://github.com/Electric-Coin-Company/zashi-android/blob/0074c2ebe33cc9e5f3d3a704faf65a6a7722558f/README.md'];15;506;34;['cryptocurrency', 'wallet', 'zcash']
https://github.com/YadongQi/spdm ; C; ['https://github.com/YadongQi/spdm/blob/f9672bcddf0065a87e646ad390b7bc3bbb707ff3/README.md'];1;256;12;[]
https://github.com/Electric-Coin-Company/zashi ; None; ['https://github.com/Electric-Coin-Company/zashi/blob/e4de2bef26866cb579a22cb52bb319f41647b96c/README.md', 'https://github.com/Electric-Coin-Company/zashi/blob/e4de2bef26866cb579a22cb52bb319f41647b96c/.github/ISSUE_TEMPLATE/bug-report.md'];2;5;5;[]
https://github.com/valory-xyz/trader ; Python; ['https://github.com/valory-xyz/trader/blob/3bbba776823d0ee012d9beea904459da2300a1d1/.spelling'];13;906;19;[]
https://github.com/croutondefi/quadrocycle ; Go; ['https://github.com/croutondefi/quadrocycle/blob/e9f8dfde56d803cfe553646f7ddfb855ca7e6e9a/README.md'];0;68;28;[]
https://github.com/valory-xyz/autonomous-fund ; Python; ['https://github.com/valory-xyz/autonomous-fund/blob/6e1bb012362ad3b70c2284ce5f4bd51cbe730456/.spelling'];6;508;21;[]
https://github.com/valory-xyz/IEKit ; Python; ['https://github.com/valory-xyz/IEKit/blob/a60861d11eb68b3002a38c4f574a22fac3df5827/.spelling'];7;815;28;[]
https://github.com/valory-xyz/contribution-service ; Python; ['https://github.com/valory-xyz/contribution-service/blob/0c33c1c1648447a5c9a618cba4678f34b749e48d/.spelling'];4;871;21;[]
https://github.com/valory-xyz/governatooorr ; Python; ['https://github.com/valory-xyz/governatooorr/blob/ebf2818019195dacbffbe3d8a084ac7e8f635b7c/.spelling'];3;550;27;[]
https://github.com/valory-xyz/agent-academy-1 ; Python; ['https://github.com/valory-xyz/agent-academy-1/blob/91cb7a199aecefa37f1d6761be209ac85b5642a5/.spelling'];1;1060;20;[]
https://github.com/mithril-security/aigovtool ; Rust; ['https://github.com/mithril-security/aigovtool/blob/e113cd03900c9778e8ffb383a450138ebfaf62f9/mkdocs.yml'];3;54;39;[]
https://github.com/rfjakob/gocryptfs-website ; HTML; ['https://github.com/rfjakob/gocryptfs-website/blob/615f0b7443d4f682ab3d28eb8ee1ea0cd21f29da/mkdocs.yml'];15;164;9;[]
https://github.com/mailchain/mailchain-specification ; None; ['https://github.com/mailchain/mailchain-specification/blob/f913baa083f92100942095cc4ae15ab740f9f5af/README.md'];8;13;7;['blockchain', 'mail', 'encrypted-messages', 'mailchain']
https://github.com/gobicycle/bicycle ; Go; ['https://github.com/gobicycle/bicycle/blob/c3eeafb8bb7434f6d858f10762ca088c29164c06/README.md'];41;87;26;['blockchain', 'golang', 'ton']
https://github.com/jyao1/openspdm-pqc ; C; ['https://github.com/jyao1/openspdm-pqc/blob/3828dc34a956df9ce9d41979233d5de2b76f3be7/libspdm/readme.md'];0;10;5;[]
https://github.com/nvm-sh/nvm ; Shell; ['https://github.com/nvm-sh/nvm/blob/bab86d5de571015b63fd8fc30b47bbe072a1290e/.github/SECURITY.md'];72272;2174;25;['nvm', 'nodejs', 'node', 'node-js', 'version-manager', 'posix', 'posix-compliant', 'bash', 'zsh', 'shell', 'nvmrc', 'lts', 'install']
https://github.com/deepin-community/mat2 ; Python; ['https://github.com/deepin-community/mat2/blob/502291d34f45da9822c7669b132c161b1c7329aa/debian/mat2.docs'];0;9;20;[]
https://github.com/forky-anonymized/forky ; Go; ['https://github.com/forky-anonymized/forky/blob/717fdaf6aeb4b0a9a17de0ad8fb187a602b88821/forky-eth2/nimbus-23.5.1/docs/the_auditors_handbook/src/SUMMARY.md'];0;23;5;[]
https://github.com/gentoo-mirror/torbrowser ; Shell; ['https://github.com/gentoo-mirror/torbrowser/blob/cce606705e2c7efb61e3df88896ab7393e247fa5/app-misc/mat2/mat2-0.13.4.ebuild'];7;1888;12;[]
https://github.com/Elixxir-io/docs ; None; ['https://github.com/Elixxir-io/docs/blob/1ce87f00db92fba7b0fb09d4a4cf22d0f7815ac2/pki.md', 'https://github.com/Elixxir-io/docs/blob/1ce87f00db92fba7b0fb09d4a4cf22d0f7815ac2/architecture.md', 'https://github.com/Elixxir-io/docs/blob/1ce87f00db92fba7b0fb09d4a4cf22d0f7815ac2/cmix.md', 'https://github.com/Elixxir-io/docs/blob/1ce87f00db92fba7b0fb09d4a4cf22d0f7815ac2/wire.md', 'https://github.com/Elixxir-io/docs/blob/1ce87f00db92fba7b0fb09d4a4cf22d0f7815ac2/README.md'];0;225;13;[]
https://github.com/jyao1/openspdm-pqc-kem ; C; ['https://github.com/jyao1/openspdm-pqc-kem/blob/326ab4306c68341f0776caac098b5435cb3a1f0d/libspdm/readme.md'];0;14;5;[]
https://github.com/scg192168/nvm ; Shell; ['https://github.com/scg192168/nvm/blob/bab86d5de571015b63fd8fc30b47bbe072a1290e/.github/SECURITY.md'];0;2174;25;[]
https://github.com/aws/karpenter-provider-aws ; Go; ['https://github.com/aws/karpenter-provider-aws/blob/571e0fb471f04f873c290287e2ff03a6210410f6/website/content/en/v0.31/concepts/threat-model.md', 'https://github.com/aws/karpenter-provider-aws/blob/571e0fb471f04f873c290287e2ff03a6210410f6/website/content/en/v0.30/concepts/threat-model.md', 'https://github.com/aws/karpenter-provider-aws/blob/571e0fb471f04f873c290287e2ff03a6210410f6/website/content/en/docs/reference/threat-model.md', 'https://github.com/aws/karpenter-provider-aws/blob/571e0fb471f04f873c290287e2ff03a6210410f6/website/content/en/v0.32/reference/threat-model.md', 'https://github.com/aws/karpenter-provider-aws/blob/571e0fb471f04f873c290287e2ff03a6210410f6/website/content/en/preview/reference/threat-model.md', 'https://github.com/aws/karpenter-provider-aws/blob/571e0fb471f04f873c290287e2ff03a6210410f6/website/content/en/v0.33/reference/threat-model.md', 'https://github.com/aws/karpenter-provider-aws/blob/571e0fb471f04f873c290287e2ff03a6210410f6/website/content/en/v0.31/upgrade-guide.md', 'https://github.com/aws/karpenter-provider-aws/blob/571e0fb471f04f873c290287e2ff03a6210410f6/website/content/en/v0.30/upgrade-guide.md', 'https://github.com/aws/karpenter-provider-aws/blob/571e0fb471f04f873c290287e2ff03a6210410f6/website/content/en/docs/upgrading/upgrade-guide.md', 'https://github.com/aws/karpenter-provider-aws/blob/571e0fb471f04f873c290287e2ff03a6210410f6/website/content/en/v0.33/upgrading/upgrade-guide.md', 'https://github.com/aws/karpenter-provider-aws/blob/571e0fb471f04f873c290287e2ff03a6210410f6/website/content/en/v0.32/upgrading/upgrade-guide.md', 'https://github.com/aws/karpenter-provider-aws/blob/571e0fb471f04f873c290287e2ff03a6210410f6/website/content/en/preview/upgrading/upgrade-guide.md'];5334;2916;24;[]
https://github.com/hardenedvault/bootkit-samples ; None; ['https://github.com/hardenedvault/bootkit-samples/blob/c6add7d7cff583982b45f3c427e02fe4a0cfde99/README.md'];221;9;4;[]
https://github.com/ControlCompass/ControlCompass.github.io ; JavaScript; ['https://github.com/ControlCompass/ControlCompass.github.io/blob/cc01dfc8bb96522db804aa114bae924947185d39/index.html'];110;182;14;['security', 'intelligence', 'cybersecurity', 'threat-intelligence', 'threat-hunting', 'red-teaming', 'red-team', 'detection', 'detection-engineering', 'mitre-attack', 'siem', 'security-tools', 'security-operations', 'soc', 'infosec', 'information-security']
https://github.com/bf2fc6cc711aee1a0c2a/architecture ; HTML; ['https://github.com/bf2fc6cc711aee1a0c2a/architecture/blob/1e83c6943627eabffe8c78f379d6a5ae5cc215fc/_adr/91/index.adoc'];5;100;20;[]
https://github.com/c4pr1c3/cuc-ns-ppt ; HTML; ['https://github.com/c4pr1c3/cuc-ns-ppt/blob/6f89d9aedc4c57b594d9cc42b412f90b4ed86dfd/chap0x10.md', 'https://github.com/c4pr1c3/cuc-ns-ppt/blob/6f89d9aedc4c57b594d9cc42b412f90b4ed86dfd/chap0x01.md'];23;43;29;['cybersecurity', 'security', 'tutorial', 'highschool']
https://github.com/Cyber-Mint/useful-diagrams ; None; ['https://github.com/Cyber-Mint/useful-diagrams/blob/e3aab1479316e2e807ba4823428cbe7c9eb3a088/cyber-security.md'];2;28;15;[]
https://github.com/MicrosoftDocs/learn ; Jupyter Notebook; ['https://github.com/MicrosoftDocs/learn/blob/61da785a72dc0264f381d61502102ddeae8f5c08/learn-pr/azure/threat-modeling-secured-environment/includes/4-visualize-risk.md', 'https://github.com/MicrosoftDocs/learn/blob/61da785a72dc0264f381d61502102ddeae8f5c08/learn-pr/azure/threat-modeling-enterprise-infrastructure/includes/4-visualize-risk.md'];21;134439;14;[]
https://github.com/tandin2000/hash-multi-auth-fullstack ; JavaScript; ['https://github.com/tandin2000/hash-multi-auth-fullstack/blob/2081ba3a4d57fbbb294113588a93caef0b25243f/ReadMe.md'];0;24;9;[]
https://github.com/project-akri/akri-docs ; None; ['https://github.com/project-akri/akri-docs/blob/210bbf2f0fea9eee7941b8ea98f7350c250a24fe/proposals/security.md'];8;274;9;[]
https://github.com/dapr-cn/docs ; Python; ['https://github.com/dapr-cn/docs/blob/ff5bf960c3c8dabf05463a85d53fd27a36e78a5e/src/translated_content/zh_CN/content/concepts/security-concept.md', 'https://github.com/dapr-cn/docs/blob/ff5bf960c3c8dabf05463a85d53fd27a36e78a5e/src/translated_content/zh_CN/translated_content/zh_CN/concepts/security-concept.md', 'https://github.com/dapr-cn/docs/blob/ff5bf960c3c8dabf05463a85d53fd27a36e78a5e/src/content/content/concepts/security-concept.md'];148;291;11;['dapr', 'docs', 'dapr-cn']
https://github.com/mirage/mirage-decks ; HTML; ['https://github.com/mirage/mirage-decks/blob/08174d6e30b13cfd02a9f859ae707a80b94510c1/slides/oscon13/index.html', 'https://github.com/mirage/mirage-decks/blob/08174d6e30b13cfd02a9f859ae707a80b94510c1/slides/fb13/index.html', 'https://github.com/mirage/mirage-decks/blob/08174d6e30b13cfd02a9f859ae707a80b94510c1/slides/fop13/index.html', 'https://github.com/mirage/mirage-decks/blob/08174d6e30b13cfd02a9f859ae707a80b94510c1/slides/jslondon13/index.html', 'https://github.com/mirage/mirage-decks/blob/08174d6e30b13cfd02a9f859ae707a80b94510c1/slides/qcon13/index.html', 'https://github.com/mirage/mirage-decks/blob/08174d6e30b13cfd02a9f859ae707a80b94510c1/slides/fosdem14/index.html', 'https://github.com/mirage/mirage-decks/blob/08174d6e30b13cfd02a9f859ae707a80b94510c1/slides/t2review14/index.html', 'https://github.com/mirage/mirage-decks/blob/08174d6e30b13cfd02a9f859ae707a80b94510c1/slides/xensummit13/index.html', 'https://github.com/mirage/mirage-decks/blob/08174d6e30b13cfd02a9f859ae707a80b94510c1/slides/cam13/index.html', 'https://github.com/mirage/mirage-decks/blob/08174d6e30b13cfd02a9f859ae707a80b94510c1/slides/ucamafp16/index.html', 'https://github.com/mirage/mirage-decks/blob/08174d6e30b13cfd02a9f859ae707a80b94510c1/slides/fpx14/index.html', 'https://github.com/mirage/mirage-decks/blob/08174d6e30b13cfd02a9f859ae707a80b94510c1/slides/clweds13/index.html'];13;554;10;[]
https://github.com/simple-login/website ; CSS; ['https://github.com/simple-login/website/blob/9fa2d6ee18d90dac2e896b42f9801ec15008a84f/content/blog/threat-models-how-to-establish-one-to-protect-your-privacy.md'];36;883;14;['simplelogin', 'privacy', 'email']
https://github.com/caioau/caioau-personal ; HTML; ['https://github.com/caioau/caioau-personal/blob/d2b05a8a748e442f19fc6f5de9a4ac969dd644fe/website/slides/eldPrivacySec.md', 'https://github.com/caioau/caioau-personal/blob/d2b05a8a748e442f19fc6f5de9a4ac969dd644fe/website/slides/casaHacker2019ago.md'];8;106;13;[]
https://github.com/accuknox/k8sthreatmodeling ; HTML; ['https://github.com/accuknox/k8sthreatmodeling/blob/9f3813eae6a1ad4dbed080f67d1f976a38f16728/models/kubearmor/README.md', 'https://github.com/accuknox/k8sthreatmodeling/blob/9f3813eae6a1ad4dbed080f67d1f976a38f16728/howto-threatmodeling.md'];17;8;6;[]
https://github.com/mitmedialab/codesign-class-blog-archive ; HTML; ['https://github.com/mitmedialab/codesign-class-blog-archive/blob/b070b2cc29093ba1de8f34fca0c35a542da7f125/index.html%3Fp=1533.html', 'https://github.com/mitmedialab/codesign-class-blog-archive/blob/b070b2cc29093ba1de8f34fca0c35a542da7f125/page/26/index.html', 'https://github.com/mitmedialab/codesign-class-blog-archive/blob/b070b2cc29093ba1de8f34fca0c35a542da7f125/category/eff/index.html', 'https://github.com/mitmedialab/codesign-class-blog-archive/blob/b070b2cc29093ba1de8f34fca0c35a542da7f125/author/paulina/index.html', 'https://github.com/mitmedialab/codesign-class-blog-archive/blob/b070b2cc29093ba1de8f34fca0c35a542da7f125/2014/04/page/2/index.html', 'https://github.com/mitmedialab/codesign-class-blog-archive/blob/b070b2cc29093ba1de8f34fca0c35a542da7f125/2014/04/update-7-eff/index.html', 'https://github.com/mitmedialab/codesign-class-blog-archive/blob/b070b2cc29093ba1de8f34fca0c35a542da7f125/category/eff/feed/index.html', 'https://github.com/mitmedialab/codesign-class-blog-archive/blob/b070b2cc29093ba1de8f34fca0c35a542da7f125/author/paulina/feed/index.html'];0;1;561;[]
https://github.com/kubernetesdaily/kubernetesdaily.github.io ; HTML; ['https://github.com/kubernetesdaily/kubernetesdaily.github.io/blob/c695e84f23a4ba4c9139aa484c6804f94fec509c/content/en/containersecurity/b9.attack-surface.md', 'https://github.com/kubernetesdaily/kubernetesdaily.github.io/blob/c695e84f23a4ba4c9139aa484c6804f94fec509c/public/containersecurity/attack-surface-of-the-container-ecosystem/index.html'];3;245;19;['blog', 'docker', 'docker-compose', 'kubernetes', 'learning-by-doing', 'tools']
https://github.com/cobwebos/docs ; PowerShell; ['https://github.com/cobwebos/docs/blob/d4686fc43d4d58054e3c1fa41c26535210e21ba7/articles/security/blueprints/pcidss-dw-overview.md', 'https://github.com/cobwebos/docs/blob/d4686fc43d4d58054e3c1fa41c26535210e21ba7/articles/security/blueprints/ffiec-analytics-overview.md', 'https://github.com/cobwebos/docs/blob/d4686fc43d4d58054e3c1fa41c26535210e21ba7/articles/security/blueprints/nist171-analytics-overview.md', 'https://github.com/cobwebos/docs/blob/d4686fc43d4d58054e3c1fa41c26535210e21ba7/articles/security/blueprints/ukofficial-paaswa-overview.md', 'https://github.com/cobwebos/docs/blob/d4686fc43d4d58054e3c1fa41c26535210e21ba7/articles/security/blueprints/au-protected-iaaswa-overview.md', 'https://github.com/cobwebos/docs/blob/d4686fc43d4d58054e3c1fa41c26535210e21ba7/articles/security/blueprints/fedramp-datawarehouse-overview.md', 'https://github.com/cobwebos/docs/blob/d4686fc43d4d58054e3c1fa41c26535210e21ba7/articles/security/blueprints/nist171-datawarehouse-overview.md', 'https://github.com/cobwebos/docs/blob/d4686fc43d4d58054e3c1fa41c26535210e21ba7/articles/security/blueprints/fedramp-iaaswa-overview.md', 'https://github.com/cobwebos/docs/blob/d4686fc43d4d58054e3c1fa41c26535210e21ba7/articles/security/develop/secure-aad-app.md', 'https://github.com/cobwebos/docs/blob/d4686fc43d4d58054e3c1fa41c26535210e21ba7/articles/security/develop/secure-web-app.md', 'https://github.com/cobwebos/docs/blob/d4686fc43d4d58054e3c1fa41c26535210e21ba7/articles/security/develop/secure-pci-web-app.md', 'https://github.com/cobwebos/docs/blob/d4686fc43d4d58054e3c1fa41c26535210e21ba7/articles/security/blueprints/uknhs-paaswa-overview.md', 'https://github.com/cobwebos/docs/blob/d4686fc43d4d58054e3c1fa41c26535210e21ba7/articles/security/blueprints/ffiec-iaaswa-overview.md', 'https://github.com/cobwebos/docs/blob/d4686fc43d4d58054e3c1fa41c26535210e21ba7/articles/security/blueprints/ffiec-dw-overview.md', 'https://github.com/cobwebos/docs/blob/d4686fc43d4d58054e3c1fa41c26535210e21ba7/articles/security/blueprints/ffiec-paaswa-overview.md', 'https://github.com/cobwebos/docs/blob/d4686fc43d4d58054e3c1fa41c26535210e21ba7/articles/security/blueprints/au-protected-paaswa-overview.md', 'https://github.com/cobwebos/docs/blob/d4686fc43d4d58054e3c1fa41c26535210e21ba7/articles/security/blueprints/nist171-paaswa-overview.md', 'https://github.com/cobwebos/docs/blob/d4686fc43d4d58054e3c1fa41c26535210e21ba7/articles/security/blueprints/fedramp-paaswa-overview.md', 'https://github.com/cobwebos/docs/blob/d4686fc43d4d58054e3c1fa41c26535210e21ba7/articles/security/blueprints/pcidss-iaaswa-overview.md', 'https://github.com/cobwebos/docs/blob/d4686fc43d4d58054e3c1fa41c26535210e21ba7/articles/security/blueprints/uknhs-iaaswa-overview.md', 'https://github.com/cobwebos/docs/blob/d4686fc43d4d58054e3c1fa41c26535210e21ba7/articles/security/blueprints/nist171-iaaswa-overview.md', 'https://github.com/cobwebos/docs/blob/d4686fc43d4d58054e3c1fa41c26535210e21ba7/articles/security/blueprints/uknhs-datawarehouse-overview.md', 'https://github.com/cobwebos/docs/blob/d4686fc43d4d58054e3c1fa41c26535210e21ba7/articles/security/blueprints/pcidss-paaswa-overview.md', 'https://github.com/cobwebos/docs/blob/d4686fc43d4d58054e3c1fa41c26535210e21ba7/articles/security/blueprints/uknhs-analytics-overview.md', 'https://github.com/cobwebos/docs/blob/d4686fc43d4d58054e3c1fa41c26535210e21ba7/articles/security/blueprints/pcidss-analytics-overview.md'];2;8953;19;[]
https://github.com/TP73/azure-docs ; PowerShell; ['https://github.com/TP73/azure-docs/blob/088e1afa3acc84b26fd4f9038afc4708bece5644/articles/security/blueprints/ffiec-dw-overview.md', 'https://github.com/TP73/azure-docs/blob/088e1afa3acc84b26fd4f9038afc4708bece5644/articles/security/blueprints/ffiec-paaswa-overview.md', 'https://github.com/TP73/azure-docs/blob/088e1afa3acc84b26fd4f9038afc4708bece5644/articles/security/blueprints/pcidss-iaaswa-overview.md', 'https://github.com/TP73/azure-docs/blob/088e1afa3acc84b26fd4f9038afc4708bece5644/articles/security/blueprints/fedramp-iaaswa-overview.md', 'https://github.com/TP73/azure-docs/blob/088e1afa3acc84b26fd4f9038afc4708bece5644/articles/security/blueprints/pcidss-paaswa-overview.md', 'https://github.com/TP73/azure-docs/blob/088e1afa3acc84b26fd4f9038afc4708bece5644/articles/security/blueprints/nist171-paaswa-overview.md', 'https://github.com/TP73/azure-docs/blob/088e1afa3acc84b26fd4f9038afc4708bece5644/articles/security/blueprints/uknhs-analytics-overview.md', 'https://github.com/TP73/azure-docs/blob/088e1afa3acc84b26fd4f9038afc4708bece5644/articles/security/blueprints/ffiec-analytics-overview.md', 'https://github.com/TP73/azure-docs/blob/088e1afa3acc84b26fd4f9038afc4708bece5644/articles/security/blueprints/nist171-analytics-overview.md', 'https://github.com/TP73/azure-docs/blob/088e1afa3acc84b26fd4f9038afc4708bece5644/articles/security/blueprints/ukofficial-paaswa-overview.md', 'https://github.com/TP73/azure-docs/blob/088e1afa3acc84b26fd4f9038afc4708bece5644/articles/security/blueprints/uknhs-datawarehouse-overview.md', 'https://github.com/TP73/azure-docs/blob/088e1afa3acc84b26fd4f9038afc4708bece5644/articles/security/blueprints/au-protected-iaaswa-overview.md', 'https://github.com/TP73/azure-docs/blob/088e1afa3acc84b26fd4f9038afc4708bece5644/articles/security/blueprints/au-protected-paaswa-overview.md', 'https://github.com/TP73/azure-docs/blob/088e1afa3acc84b26fd4f9038afc4708bece5644/articles/security/blueprints/fedramp-datawarehouse-overview.md', 'https://github.com/TP73/azure-docs/blob/088e1afa3acc84b26fd4f9038afc4708bece5644/articles/security/blueprints/nist171-datawarehouse-overview.md', 'https://github.com/TP73/azure-docs/blob/088e1afa3acc84b26fd4f9038afc4708bece5644/articles/security/blueprints/pcidss-dw-overview.md', 'https://github.com/TP73/azure-docs/blob/088e1afa3acc84b26fd4f9038afc4708bece5644/articles/security/blueprints/ffiec-iaaswa-overview.md', 'https://github.com/TP73/azure-docs/blob/088e1afa3acc84b26fd4f9038afc4708bece5644/articles/security/blueprints/uknhs-iaaswa-overview.md', 'https://github.com/TP73/azure-docs/blob/088e1afa3acc84b26fd4f9038afc4708bece5644/articles/security/blueprints/pcidss-analytics-overview.md', 'https://github.com/TP73/azure-docs/blob/088e1afa3acc84b26fd4f9038afc4708bece5644/articles/security/blueprints/nist171-iaaswa-overview.md'];3;390117;19;[]
https://github.com/ishasahni1/Loc-markdig-azuredocs-test ; PowerShell; ['https://github.com/ishasahni1/Loc-markdig-azuredocs-test/blob/2c2dfe04a0af718cf058445467fa407ead5f45a4/articles/security/blueprints/payment-processing-blueprint.md', 'https://github.com/ishasahni1/Loc-markdig-azuredocs-test/blob/2c2dfe04a0af718cf058445467fa407ead5f45a4/articles/security/blueprints/financial-services-regulated-workloads.md'];0;7;19;[]
https://github.com/iosifache/iosifache.me ; HTML; ['https://github.com/iosifache/iosifache.me/blob/9b47103aa6141b88a252f13b54ef918453968f09/content/owasp-global-appsec-23.md', 'https://github.com/iosifache/iosifache.me/blob/9b47103aa6141b88a252f13b54ef918453968f09/output/owasp-global-appsec-23.html'];1;41;12;[]
https://github.com/OpenLocalizationTestOrg/azure-docs-pr-test.fr-FR ; None; ['https://github.com/OpenLocalizationTestOrg/azure-docs-pr-test.fr-FR/blob/e8ac8067a510f2cba1577aa901e0201e01308c55/articles/security/blueprints/financial-services-regulated-workloads.md', 'https://github.com/OpenLocalizationTestOrg/azure-docs-pr-test.fr-FR/blob/e8ac8067a510f2cba1577aa901e0201e01308c55/articles/security/blueprints/payment-processing-blueprint.md'];0;56;6;[]
https://github.com/iArcanic/hbcs-cw1 ; TeX; ['https://github.com/iArcanic/hbcs-cw1/blob/825c4927d14c94de4776b0f88188e9234882dec0/security-and-usability-trade-offs-report.md'];0;52;6;[]
https://github.com/OWASP/kstg ; CSS; ['https://github.com/OWASP/kstg/blob/5c79461b37798f85bb70380f80e611dd235d1220/mdbook/src/threat-model/introduction.md'];26;22;5;[]
https://github.com/wunderwuzzi23/huskyai ; Jupyter Notebook; ['https://github.com/wunderwuzzi23/huskyai/blob/7ef8fbb2a14e4ccda981beac461806c56a272fa1/README.md'];1;22;7;['adversarial-machine-learning', 'machine-learning', 'redteam']
https://github.com/DinisCruz/Book_Software_Quality ; None; ['https://github.com/DinisCruz/Book_Software_Quality/blob/3ac7a0773039219aa583dac355391fa183bcdc7d/manuscript/18.Threat-Modeling.md', 'https://github.com/DinisCruz/Book_Software_Quality/blob/3ac7a0773039219aa583dac355391fa183bcdc7d/content/8.Software-development/18.Threat-Modeling/18.Threat-Modeling.md'];38;413;7;[]
https://github.com/MoShrank/spacey-backend ; Go; ['https://github.com/MoShrank/spacey-backend/blob/e86ccf09f74c723826b2e279888ff32738deff69/README.md'];0;207;12;[]
https://github.com/kelvin-ap/CSA-PKI ; Shell; ['https://github.com/kelvin-ap/CSA-PKI/blob/12e79145c8cfa77e14c10280061230b76c8a77a0/README.md'];0;51;9;[]
https://github.com/ossf/security-insights-spec ; None; ['https://github.com/ossf/security-insights-spec/blob/cafa1b9d8a0b82c9f6155577466426297e34e409/docs/threat-model/README.md', 'https://github.com/ossf/security-insights-spec/blob/cafa1b9d8a0b82c9f6155577466426297e34e409/SECURITY-INSIGHTS.yml'];41;74;9;[]
https://github.com/kubeedge/community ; Python; ['https://github.com/kubeedge/community/blob/6245b6577900a562986aa3f1a569232b96dfd548/sig-security/sig-security-audit/KubeEdge-threat-model-and-security-protection-analysis.md'];60;172;28;[]
https://github.com/raesene/www.mccune.org.uk ; SCSS; ['https://github.com/raesene/www.mccune.org.uk/blob/1b048d65c41945bbc3bbc272ccfed245c38ebc5e/_projects/admission-controller-threat-model.md'];1;45;28;[]
https://github.com/c4pr1c3/cuc-ns ; Python; ['https://github.com/c4pr1c3/cuc-ns/blob/517e4d74b5408497bfb4525af187b8dff4faeb76/chap0x01/main.md'];62;53;24;['cybersecurity', 'textbook', 'gitbook']
https://github.com/gschrijvers/azure-docs.nl-nl ; PowerShell; ['https://github.com/gschrijvers/azure-docs.nl-nl/blob/e46af0b9c1e4bb7cb8088835a8104c5d972bfb78/articles/security/develop/secure-aad-app.md', 'https://github.com/gschrijvers/azure-docs.nl-nl/blob/e46af0b9c1e4bb7cb8088835a8104c5d972bfb78/articles/security/develop/secure-web-app.md', 'https://github.com/gschrijvers/azure-docs.nl-nl/blob/e46af0b9c1e4bb7cb8088835a8104c5d972bfb78/articles/security/develop/secure-pci-web-app.md'];0;8526;19;[]
https://github.com/Lissy93/secure-coding-deck ; JavaScript; ['https://github.com/Lissy93/secure-coding-deck/blob/ddf9482b73b78560a3ac0843966ca60c70bde23e/index.html'];12;9;19;[]
https://github.com/squillace/akri ; Rust; ['https://github.com/squillace/akri/blob/20c53fadd445dcbfbb3c0a5f5bc641c03ccb8c96/docs/proposals/security.md'];5;198;33;[]
https://github.com/Alevsk/alevsk.com ; Python; ['https://github.com/Alevsk/alevsk.com/blob/9fd338a129d78534159ff0118eef20d02d825b63/content/posts/2023-09-04-this-website-is-no-longer-running-as-the-root-user.md'];0;50;19;[]
https://github.com/wunderwuzzi23/mlattacks ; Jupyter Notebook; ['https://github.com/wunderwuzzi23/mlattacks/blob/6f33149be89dac2cc4c492b2da5708f116cc45e0/README.md'];41;12;2;['adversarial-machine-learning', 'adversarial-examples', 'redteam', 'machinelearning', 'adversarial-defense']
https://github.com/jinzhao-dev/jinzhao-disk ; C; ['https://github.com/jinzhao-dev/jinzhao-disk/blob/23ab6d380445e16727573de80ef94fc70518bb42/README.md'];36;39;7;['linux', 'security', 'storage', 'tee']
https://github.com/JaimeStill/learning-dapr ; C#; ['https://github.com/JaimeStill/learning-dapr/blob/a22312bd54e4a0cf552b22349c66e6fe5729e92b/dapr/concepts/security.md'];0;18;6;[]
https://github.com/dapr/docs ; HTML; ['https://github.com/dapr/docs/blob/28a97e1dbd5f4a84d7eb92882c39ba009a57595a/daprdocs/content/en/concepts/security-concept.md'];982;6105;9;[]
https://github.com/365614269/CNCF-Incubating ; None; ['https://github.com/365614269/CNCF-Incubating/blob/49a732d586a2465476a2992c10120287410d5647/modules/dapr-docs/daprdocs/content/en/concepts/security-concept.md', 'https://github.com/365614269/CNCF-Incubating/blob/49a732d586a2465476a2992c10120287410d5647/modules/backstage/docs/auth/index.md', 'https://github.com/365614269/CNCF-Incubating/blob/49a732d586a2465476a2992c10120287410d5647/modules/kyverno/content/en/docs/security/_index.md', 'https://github.com/365614269/CNCF-Incubating/blob/49a732d586a2465476a2992c10120287410d5647/modules/notaryproject.dev/content/en/community/meeting-notes/meeting-notes-2020.md', 'https://github.com/365614269/CNCF-Incubating/blob/49a732d586a2465476a2992c10120287410d5647/modules/backstage/docs/backend-system/building-backends/01-index.md', 'https://github.com/365614269/CNCF-Incubating/blob/49a732d586a2465476a2992c10120287410d5647/modules/backstage/mkdocs.yml', 'https://github.com/365614269/CNCF-Incubating/blob/49a732d586a2465476a2992c10120287410d5647/modules/knative/docs/reference/security/README.md'];1;122;6;[]
https://github.com/osresearch/safeboot ; Shell; ['https://github.com/osresearch/safeboot/blob/fd0aef40912948711986e2e4132c4ba8e30e170d/docs/threats.md'];259;519;31;[]
https://github.com/ckaestne/seai ; Jupyter Notebook; ['https://github.com/ckaestne/seai/blob/1a86c1511eea1c15ba0a6b9b7bd306d7a17e15d1/lectures/21_security/security.md'];342;1070;14;['machine-learning', 'education', 'course-materials', 'software-engineering', 'carnegie-mellon-university']
https://github.com/raesene/kubeconeu-presentation ; JavaScript; ['https://github.com/raesene/kubeconeu-presentation/blob/2d7c4bf9f967753009501c9344a0d9c01b06b7fa/_posts/0000-01-02-threat-modelling.md'];6;11;15;[]
https://github.com/raesene/kubernetes-presentation ; JavaScript; ['https://github.com/raesene/kubernetes-presentation/blob/0c824cf5d2f3661993e2143088872781d2b18d14/_posts/0000-01-04-threat-models.md'];1;56;15;[]
https://github.com/mlip-cmu/s2023 ; HTML; ['https://github.com/mlip-cmu/s2023/blob/abd28373ca53e0363501235d69fd54726781db4a/lectures/22_security/security.md'];12;162;13;['education', 'machine-learning', 'mlops', 'software-engineering']
https://github.com/getlantern/lantern ; Go; ['https://github.com/getlantern/lantern/blob/e8b859953cbd37547eef4bc1517c7020b9321cfb/archive/src/github.com/Yawning/obfs4/doc/obfs4-spec.txt', 'https://github.com/getlantern/lantern/blob/e8b859953cbd37547eef4bc1517c7020b9321cfb/archive/src/git.torproject.org/pluggable-transports/obfs4.git/doc/obfs4-spec.txt'];13760;6168;5;['lantern', 'vpn', 'censorship', 'circumvention', 'gfw', 'accelerator', 'router']
https://github.com/iSECPartners/LibTech-Auditing-Cheatsheet ; Python; ['https://github.com/iSECPartners/LibTech-Auditing-Cheatsheet/blob/476feb58b5c6067a1aacfaf752c22f5b21179e93/README.md', 'https://github.com/iSECPartners/LibTech-Auditing-Cheatsheet/blob/476feb58b5c6067a1aacfaf752c22f5b21179e93/guidelines.html'];199;13;5;[]
https://github.com/isislovecruft/obfsproxy-legacy ; C; ['https://github.com/isislovecruft/obfsproxy-legacy/blob/8d0a7f63bbfff8cde850d537a7c61fe88b3c6634/Makefile.am'];9;365;12;[]
https://github.com/DLR-SC/repository-synergy ; Jupyter Notebook; ['https://github.com/DLR-SC/repository-synergy/blob/115e48c37e659b144b2c3b89695483fd1d6dc788/data/readme_files/iSECPartners.LibTech-Auditing-Cheatsheet.md'];10;8;6;[]
https://github.com/Mondego/pyreco ; Python; ['https://github.com/Mondego/pyreco/blob/0ac6653219c2701c13c508c5c4fc9bc3437eea06/repoData/iSECPartners-LibTech-Auditing-Cheatsheet/description.txt'];22;95;26;[]
https://github.com/getlantern/lantern-docs ; HTML; ['https://github.com/getlantern/lantern-docs/blob/62ac00bfab0ad4d4151f141f8cc4996fa8a67d08/lantern/_build/html/en/developer/Threat-Model.html'];8;95;16;[]
https://github.com/Yawning/obfs4 ; Go; ['https://github.com/Yawning/obfs4/blob/c3e2d44b1033e03645cc971565175e56d86a8200/doc/obfs4-spec.txt'];1028;202;13;[]
https://github.com/OperatorFoundation/shapeshifter-dispatcher ; Go; ['https://github.com/OperatorFoundation/shapeshifter-dispatcher/blob/4f0a60fb1448f7f474e13e4a75e4d5699e885413/doc/obfs4-spec.txt'];166;492;17;['censorship-circumvention', 'anticensorship', 'internet-freedom', 'pluggable-transports', 'golang']
https://github.com/madeye/obfs4-tunnel ; Go; ['https://github.com/madeye/obfs4-tunnel/blob/6ab3d0377ccd0ebddf9f1afbbed8db3cbaec7039/src/git.torproject.org/pluggable-transports/obfs4.git/doc/obfs4-spec.txt'];49;6;4;[]
https://github.com/leapcode/shapeshifter-dispatcher ; Go; ['https://github.com/leapcode/shapeshifter-dispatcher/blob/21adeaf94cc3b4be9f2aa95987d09255e1943320/doc/obfs4-spec.txt'];0;243;13;[]
https://github.com/lavabit/pahoehoe ; C; ['https://github.com/lavabit/pahoehoe/blob/dc305191ece7babf8a905854a7437b052d344078/android/go/src/github.com/OperatorFoundation/obfs4/doc/obfs4-spec.txt', 'https://github.com/lavabit/pahoehoe/blob/dc305191ece7babf8a905854a7437b052d344078/android/go/src/github.com/OperatorFoundation/shapeshifter-transports/doc/obfs4-spec.txt', 'https://github.com/lavabit/pahoehoe/blob/dc305191ece7babf8a905854a7437b052d344078/android/go/src/github.com/OperatorFoundation/shapeshifter-dispatcher/doc/obfs4-spec.txt'];29;167;29;[]
https://github.com/srxzr/GameAnonBridge ; Go; ['https://github.com/srxzr/GameAnonBridge/blob/6f0ac8a6de708c57331fe04afad30260522eef5c/doc/obfs4-spec.txt'];1;161;10;[]
https://github.com/yangchunjian/lantern ; Go; ['https://github.com/yangchunjian/lantern/blob/d1c78d2b1895f58209382fdf4815ccb8abc10c9b/src/github.com/Yawning/obfs4/doc/obfs4-spec.txt', 'https://github.com/yangchunjian/lantern/blob/d1c78d2b1895f58209382fdf4815ccb8abc10c9b/src/git.torproject.org/pluggable-transports/obfs4.git/doc/obfs4-spec.txt'];2;5;28;[]
https://github.com/uk0/tor_dev ; Go; ['https://github.com/uk0/tor_dev/blob/1040d906474d1da463f4de57b3c5f72ae14f550d/obfs4/doc/obfs4-spec.txt'];1;2;13;[]
https://github.com/cllanjim/getlantern ; Go; ['https://github.com/cllanjim/getlantern/blob/0fff8056b4a17567f555afe031bc6103809b232a/src/github.com/Yawning/obfs4/doc/obfs4-spec.txt', 'https://github.com/cllanjim/getlantern/blob/0fff8056b4a17567f555afe031bc6103809b232a/src/git.torproject.org/pluggable-transports/obfs4.git/doc/obfs4-spec.txt'];2;5259;26;[]
https://github.com/adambregenzer/obfsproxy_android ; C; ['https://github.com/adambregenzer/obfsproxy_android/blob/fd19d00b2089c8efc48514a70f6c16f587cd95fb/Makefile.am'];2;364;16;[]
https://github.com/asn-d6/obfsproxy-legacy ; C; ['https://github.com/asn-d6/obfsproxy-legacy/blob/94ebc4c3edf1e3e5f313444e59981ac557578df5/Makefile.am'];0;362;12;[]
https://github.com/websitefingerprinting/surakav-imp ; Go; ['https://github.com/websitefingerprinting/surakav-imp/blob/d7a64b62fb3b021745d59535c0143a04cf088e89/doc/obfs4-spec.txt'];15;118;13;[]
https://github.com/RACECAR-GU/obfsX ; Go; ['https://github.com/RACECAR-GU/obfsX/blob/1add4680bcda1b8c829a0f0c2c344033333b6e31/doc/obfs4-spec.txt'];1;277;13;[]
https://github.com/websitefingerprinting/wfdef ; Go; ['https://github.com/websitefingerprinting/wfdef/blob/bec680eacca62ffef9e93ed289c8eff0fcff750c/doc/obfs4-spec.txt'];2;127;13;[]
https://github.com/manifoldfinance/obfs4 ; Go; ['https://github.com/manifoldfinance/obfs4/blob/336a71d6e4cfd2d33e9c57797828007ad74975e9/doc/obfs4-spec.txt'];0;197;12;[]
https://github.com/saltfish-dev/obfs4 ; Go; ['https://github.com/saltfish-dev/obfs4/blob/77af0cba934d73c4baeb709560bcfc9a9fbc661c/doc/obfs4-spec.txt'];0;192;12;[]
https://github.com/refraction-networking/obfs4 ; Go; ['https://github.com/refraction-networking/obfs4/blob/99f48abed7931734f37b9f59a2ccfa6e4a4547e8/doc/obfs4-spec.txt'];1;169;11;[]
https://github.com/RACECAR-GU/lyrebird ; Go; ['https://github.com/RACECAR-GU/lyrebird/blob/3e4defbcb6c6b692f6ca126c56eaaa40aae8492f/doc/obfs4-spec.txt'];0;211;14;[]
https://github.com/external-secrets/external-secrets ; Go; ['https://github.com/external-secrets/external-secrets/blob/632071d95441d5cc1ddaf16670566e5894eabe7e/docs/guides/threat-model.md', 'https://github.com/external-secrets/external-secrets/blob/632071d95441d5cc1ddaf16670566e5894eabe7e/hack/api-docs/mkdocs.yml'];3342;2468;36;['external-secrets', 'kubernetes', 'kubernetes-secrets', 'secrets-manager', 'hacktoberfest']
https://github.com/backstage/backstage ; TypeScript; ['https://github.com/backstage/backstage/blob/94632030957f064c55cdd1f7ea4fcdd7062f201a/docs/auth/index.md', 'https://github.com/backstage/backstage/blob/94632030957f064c55cdd1f7ea4fcdd7062f201a/docs/backend-system/building-backends/01-index.md', 'https://github.com/backstage/backstage/blob/94632030957f064c55cdd1f7ea4fcdd7062f201a/mkdocs.yml'];24417;48267;44;['infrastructure', 'dx', 'developer-experience', 'developer-portal', 'service-catalog', 'microservices', 'cncf', 'backstage', 'hacktoberfest']
https://github.com/CodeverDotDev/bookmarks ; None; ['https://github.com/CodeverDotDev/bookmarks/blob/8ed80e068d8d46825ca4678c73e3eba1e4d3aaab/tagged/threat-model.md', 'https://github.com/CodeverDotDev/bookmarks/blob/8ed80e068d8d46825ca4678c73e3eba1e4d3aaab/tags-by-size.md', 'https://github.com/CodeverDotDev/bookmarks/blob/8ed80e068d8d46825ca4678c73e3eba1e4d3aaab/tagged/security-tools.md', 'https://github.com/CodeverDotDev/bookmarks/blob/8ed80e068d8d46825ca4678c73e3eba1e4d3aaab/README.md', 'https://github.com/CodeverDotDev/bookmarks/blob/8ed80e068d8d46825ca4678c73e3eba1e4d3aaab/tagged/security.md'];399;141;7;['books', 'programming', 'education', 'open-source', 'java', 'javascript', 'nodejs', 'angular', 'awesome', 'awesome-lists', 'bookmarks', 'python', 'golang', 'awesome-list', 'react', 'computer-science']
https://github.com/kata-containers/kata-containers ; Rust; ['https://github.com/kata-containers/kata-containers/blob/7f611dfe8408116736d502677aa135ad1e9f6229/docs/README.md'];4431;12390;19;['kvm', 'virtualization', 'containers', 'kubernetes', 'k8s', 'virtual-machine', 'qemu', 'firecracker', 'acrn', 'oci', 'cri-o', 'cri', 'security', 'docker']
https://github.com/jaegertracing/jaeger ; Go; ['https://github.com/jaegertracing/jaeger/blob/b5f73aede2d76249cbd6d9855d46ed158c0419f9/SECURITY-INSIGHTS.yml'];18746;2352;46;['distributed-tracing', 'cncf', 'tracing', 'observability', 'jaeger', 'opentelemetry', 'hacktoberfest']
https://github.com/chromium/chromium ; None; ['https://github.com/chromium/chromium/blob/e71e48fdd9724f9db71e9ae81a4dbaa0e3b881e0/docs/security/post-spectre-webdev.md', 'https://github.com/chromium/chromium/blob/0c702f3bf9caf242e0eebcaf0f788be769bb1ce5/services/network/public/cpp/corb/README.md'];16566;1358810;84;[]
https://github.com/privly/privly-applications ; JavaScript; ['https://github.com/privly/privly-applications/blob/67c7aeb2e61ac261651633a3fa6abb9ab1c0c886/PlainPost/docs/Plain-Posts-Posting-Threat-Model.md', 'https://github.com/privly/privly-applications/blob/67c7aeb2e61ac261651633a3fa6abb9ab1c0c886/PlainPost/docs/Plain-Posts-Reading-Threat-Model.md'];19;899;22;[]
https://github.com/authelia/authelia ; Go; ['https://github.com/authelia/authelia/blob/cb813bbbd8b01eacb8a15229dbe9a26d35c82ed8/docs/content/en/integration/prologue/get-started.md'];18117;5067;38;['totp', 'u2f', 'ldap', 'sso-authentication', 'yubikey', 'two-factor-authentication', 'docker', 'kubernetes', 'sso', 'multifactor', 'push-notifications', 'mfa', 'two-factor', 'authentication', 'security', 'golang', '2fa', 'oauth2', 'openid-connect', 'webauthn']
https://github.com/google/kctf ; Go; ['https://github.com/google/kctf/blob/4382f9119a873a0d4064de6137348dcde61e137b/SECURITY.md', 'https://github.com/google/kctf/blob/4382f9119a873a0d4064de6137348dcde61e137b/docs/index.md'];609;510;11;[]
https://github.com/rootsongjc/kubernetes-hardening-guidance ; Shell; ['https://github.com/rootsongjc/kubernetes-hardening-guidance/blob/9bf2725f507d8cf080087bee3220ac30609c7844/SUMMARY.md'];478;31;27;[]
https://github.com/pendulum-project/ntpd-rs ; Rust; ['https://github.com/pendulum-project/ntpd-rs/blob/8e5da83d00bcaced1a58635d4e40e57dfc4b10d1/mkdocs.yml'];440;2243;29;[]
https://github.com/cncf/tag-security ; HTML; ['https://github.com/cncf/tag-security/blob/06147d504e7ca9373894c3231db3c03b3623d377/assessments/projects/kyverno/self-assessment.md', 'https://github.com/cncf/tag-security/blob/06147d504e7ca9373894c3231db3c03b3623d377/assessments/projects/custodian/joint-review.md'];1862;1729;37;['cloud-native', 'security', 'access-control', 'safety', 'secure-access', 'cncf', 'assessment']
https://github.com/w3c/wot-architecture ; HTML; ['https://github.com/w3c/wot-architecture/blob/270d6d21ce7927d88e06a5192c12b0040745d538/Overview.html'];102;1971;26;[]
https://github.com/OWASP/owasp-summit-2017 ; CSS; ['https://github.com/OWASP/owasp-summit-2017/blob/8e48306e53317857206835e46b8bfc52060ebd6f/Logistics/emails/3.threat-model-invite.md'];124;5798;23;[]
https://github.com/fanf2/regpg ; Perl; ['https://github.com/fanf2/regpg/blob/0329b978b111b5c37169eba33e96d0366eafac00/Makefile', 'https://github.com/fanf2/regpg/blob/0329b978b111b5c37169eba33e96d0366eafac00/README.md'];9;461;14;[]
https://github.com/zaproxy/zap-extensions ; Java; ['https://github.com/zaproxy/zap-extensions/blob/3628b8dc497e5b862283b7f7dff25bb1f3258232/addOns/pscanrulesBeta/src/main/java/org/zaproxy/zap/extension/pscanrulesBeta/SiteIsolationScanRule.java'];772;11907;17;['zap', 'zaproxy', 'dast', 'appsec', 'security', 'security-scanner', 'hacktoberfest']
https://github.com/intel/dffml ; Python; ['https://github.com/intel/dffml/blob/04649129ed9cd7e827a26cdf417cb8bbc2577ac2/docs/discussions/alice_engineering_comms/0170/reply_0001.md'];233;3973;39;['machine-learning', 'data-flow', 'asyncio', 'event-based', 'flow-based-programming', 'dag', 'hyperautomation', 'dataflows', 'datasets', 'dffml', 'swrepo', 'ai-inference', 'ai-training', 'analytics', 'ai-machine-learning', 'frameworks', 'libraries', 'models', 'pipelines', 'python']
https://github.com/DinisCruz/Book_SecDevOps_Risk_Workflow_Build ; None; ['https://github.com/DinisCruz/Book_SecDevOps_Risk_Workflow_Build/blob/9ca8aa9e0c5c31fd344485b9d07c75e49c032077/manuscript/Book.txt'];3;114;3;[]
https://github.com/apache/incubator-teaclave ; Rust; ['https://github.com/apache/incubator-teaclave/blob/cd5d1a874f3e02643ce96268b6f3b146797bbb94/docs/README.md', 'https://github.com/apache/incubator-teaclave/blob/cd5d1a874f3e02643ce96268b6f3b146797bbb94/config/README.md', 'https://github.com/apache/incubator-teaclave/blob/cd5d1a874f3e02643ce96268b6f3b146797bbb94/README.md'];712;763;43;['rust', 'sgx', 'faas', 'universal-secure-computing', 'trusted-execution-environment', 'function-as-a-service', 'secure-multiparty-computation', 'tee', 'confidential-computing', 'trustzone']
https://github.com/madaidans-insecurities/madaidans-insecurities.github.io ; HTML; ['https://github.com/madaidans-insecurities/madaidans-insecurities.github.io/blob/2507c625aa7386b6a4882248d239166ab356b127/firefox-chromium.html'];128;169;20;[]
https://github.com/XuanwuLab/XuanwuLab.github.io ; HTML; ['https://github.com/XuanwuLab/XuanwuLab.github.io/blob/1fb11f473fcdc5cf53d0a551edf5d2180542e15e/cn/secnews/2018/05/31/index.html'];89;664;4;[]
https://github.com/securityfirst/Umbrella_web ; JavaScript; ['https://github.com/securityfirst/Umbrella_web/blob/dd4610a5a57abc2afd7b9c3723ac597d8910953e/mock/content.js'];7;456;22;['security', 'safety', 'risk', 'activism', 'humanitarian', 'reactjs']
https://github.com/piscisaureus/slurp-logs ; None; ['https://github.com/piscisaureus/slurp-logs/blob/711cc50c24f863b95b1f97d925c5e7d9c6abb66a/v8/2018-06-14.txt'];7;9043;27;[]
https://github.com/MicrosoftDocs/well-architected ; None; ['https://github.com/MicrosoftDocs/well-architected/blob/43c369bcdd9ee4906bb0802c7826243de8cb2898/well-architected/security/index.yml', 'https://github.com/MicrosoftDocs/well-architected/blob/43c369bcdd9ee4906bb0802c7826243de8cb2898/well-architected/security/checklist.md', 'https://github.com/MicrosoftDocs/well-architected/blob/43c369bcdd9ee4906bb0802c7826243de8cb2898/well-architected/TOC.yml', 'https://github.com/MicrosoftDocs/well-architected/blob/43c369bcdd9ee4906bb0802c7826243de8cb2898/.openpublishing.redirection.json', 'https://github.com/MicrosoftDocs/well-architected/blob/43c369bcdd9ee4906bb0802c7826243de8cb2898/well-architected/security/establish-baseline.md', 'https://github.com/MicrosoftDocs/well-architected/blob/43c369bcdd9ee4906bb0802c7826243de8cb2898/well-architected/security/secure-development-lifecycle.md'];52;5586;14;[]
https://github.com/valory-xyz/liquidity-rebalancing ; Python; ['https://github.com/valory-xyz/liquidity-rebalancing/blob/4261fbecb677cda5a76700d42e3e861ac4d2167c/.spelling'];0;8437;20;[]
https://github.com/valory-xyz/decentralized-watchtower ; Python; ['https://github.com/valory-xyz/decentralized-watchtower/blob/3fa198938ee9559acc48afde724a332d386bb8ad/.spelling'];0;103;25;[]
https://github.com/pythonone/irresistibleforceCrawl ; Python; ['https://github.com/pythonone/irresistibleforceCrawl/blob/374d0c0d7c238f844ca4eca50401ffd442062b50/360daily.txt'];5;4;5;[]
https://github.com/fluidattacks/makes ; Nix; ['https://github.com/fluidattacks/makes/blob/fbc4ab71f3f2aeb715343719c59b283303d65c24/docs/mkdocs.yaml'];364;1179;20;['devops', 'build', 'nix', 'ci', 'cd', 'devsecops']
https://github.com/kyverno/website ; JavaScript; ['https://github.com/kyverno/website/blob/fcc2b93b119c7d4b4e26367ec671d71bd52b1621/content/en/docs/security/_index.md'];28;1423;20;[]
https://github.com/lkml-likexu/kde ; C; ['https://github.com/lkml-likexu/kde/blob/bc416a34c15c1ccaa183f30606e656d170fcc2d0/kde_daily_news/2018/2018-05.md'];186;1527;13;[]
https://github.com/BitDevsNYC/BitDevsNYC.github.io ; HTML; ['https://github.com/BitDevsNYC/BitDevsNYC.github.io/blob/1e3a31d60ce803e15fe73c22fb75475fc25d540b/_posts/2018-06-12-socratic-seminar-81.md'];33;317;21;['bitdevs', 'static', 'jekyll', 'bitcoin', 'ligh']
https://github.com/EC528-Fall-2023/Kata-Containers-for-SPARK ; Shell; ['https://github.com/EC528-Fall-2023/Kata-Containers-for-SPARK/blob/4213e5253fdb03a51972331ac3b2a5058a518dc1/docs/References.md'];7;129;11;[]
https://github.com/ten-protocol/ten-whitepaper ; CSS; ['https://github.com/ten-protocol/ten-whitepaper/blob/3ecfeb77f36dbdd1f56693e06517350b38603f7c/manifest.yaml', 'https://github.com/ten-protocol/ten-whitepaper/blob/3ecfeb77f36dbdd1f56693e06517350b38603f7c/amalgamated.md', 'https://github.com/ten-protocol/ten-whitepaper/blob/3ecfeb77f36dbdd1f56693e06517350b38603f7c/index.md'];5;258;35;[]
https://github.com/tymyrddin/blue-devsecops ; CSS; ['https://github.com/tymyrddin/blue-devsecops/blob/0558ef8fb8270a738105631d679eeae3f6c84cbe/source/index.rst', 'https://github.com/tymyrddin/blue-devsecops/blob/0558ef8fb8270a738105631d679eeae3f6c84cbe/source/docs/notes/implement.md', 'https://github.com/tymyrddin/blue-devsecops/blob/0558ef8fb8270a738105631d679eeae3f6c84cbe/source/docs/notes/README.md'];0;51;8;[]
https://github.com/SDA-SE/cluster-image-scanner ; Shell; ['https://github.com/SDA-SE/cluster-image-scanner/blob/6a279df84da036b30a1406bd22f8def8ab6adfb5/mkdocs.yml', 'https://github.com/SDA-SE/cluster-image-scanner/blob/6a279df84da036b30a1406bd22f8def8ab6adfb5/docs/architecture/README.md'];50;955;17;['kubernetes', 'image', 'security', 'scanning', 'security-tools']
https://github.com/w3c/webappsec-post-spectre-webdev ; HTML; ['https://github.com/w3c/webappsec-post-spectre-webdev/blob/7e2d1d4e062cbebb51c7174e6cc927065a65b554/index.bs', 'https://github.com/w3c/webappsec-post-spectre-webdev/blob/7e2d1d4e062cbebb51c7174e6cc927065a65b554/fpwd.html'];16;47;9;[]
https://github.com/gaocegege/csp-final-paper-2016 ; TeX; ['https://github.com/gaocegege/csp-final-paper-2016/blob/f1bd21628a1e2db86528c014aff6503020093733/content/gaocegege/outline.md'];5;52;7;[]
https://github.com/microsoft/ipe ; None; ['https://github.com/microsoft/ipe/blob/55977a126f129391d8ac3e99086decf736ffa7e3/mkdocs.yml'];52;16;7;[]
https://github.com/mikewest/coop ; HTML; ['https://github.com/mikewest/coop/blob/9483bb496c3116b408d4d8810b25a595adf10aca/index.bs', 'https://github.com/mikewest/coop/blob/9483bb496c3116b408d4d8810b25a595adf10aca/index.html'];1;1;3;[]
https://github.com/Ma3k4H3d/XuanWu_SecNews ; HTML; ['https://github.com/Ma3k4H3d/XuanWu_SecNews/blob/ddf0003ff2a694905bd444868a00150c9d0d2380/2018/05/xuanwu-2018-05-31.md'];16;101;4;[]
https://github.com/mikewest/consider-deploying-corp ; HTML; ['https://github.com/mikewest/consider-deploying-corp/blob/880e436528f16c8c03808967aec41d94acfad08c/index.html'];4;24;4;[]
https://github.com/valory-xyz/price-oracle ; Python; ['https://github.com/valory-xyz/price-oracle/blob/06b05ac1af8b869e5d64f43ec058c9796367337e/.spelling'];2;8881;22;[]
https://github.com/paradite/hn-ratio ; JavaScript; ['https://github.com/paradite/hn-ratio/blob/b9291f18aa63f54a9ef68f9574b5c559a01af576/results/2018-may-30.json'];24;2044;18;['hacker-news', 'top-stories', 'hn-ratio', 'd3', 'score-ratio', 'hn-api']
https://github.com/Jxck/jxck.io ; HTML; ['https://github.com/Jxck/jxck.io/blob/e304c8be224f2602b92167a88432ecc305761527/mozaic.fm/episodes/63/cross-origin-info-leaks.html', 'https://github.com/Jxck/jxck.io/blob/e304c8be224f2602b92167a88432ecc305761527/mozaic.fm/episodes/63/cross-origin-info-leaks.md'];34;6471;34;[]
https://github.com/scriptingxss/embeddedappsec ; None; ['https://github.com/scriptingxss/embeddedappsec/blob/80a2d3217034c21c7d338a00855e892ded29c534/SUMMARY.md'];38;68;23;['embedded', 'appsec', 'iot', 'security', 'iotsecurity', 'scada-security', 'device-security', 'medical-device-security', 'automotive-security', 'automotive-grade-linux', 'ics-security', 'firmware', 'embedded-systems']
https://github.com/forthy42/net2o ; Forth; ['https://github.com/forthy42/net2o/blob/d6b7e923b3c6469b0f87ff2d894fc4d2009ce5bb/wiki/net2o.md'];7;4812;105;['forth', 'network', 'security']
https://github.com/boltlabs-inc/key-mgmt-spec ; None; ['https://github.com/boltlabs-inc/key-mgmt-spec/blob/64006ccc071437a55452a5b476dffdd58be2429e/design-extension-notes.md', 'https://github.com/boltlabs-inc/key-mgmt-spec/blob/64006ccc071437a55452a5b476dffdd58be2429e/README.md'];3;115;13;[]
https://github.com/Nieuport/-Infosec_Reference- ; None; ['https://github.com/Nieuport/-Infosec_Reference-/blob/a7fc3ce9d3afd70dff112143d80440052d56b534/Draft/Web.md'];7;342;7;[]
https://github.com/Saidul-M-Khan/Infosec_Reference ; None; ['https://github.com/Saidul-M-Khan/Infosec_Reference/blob/44e209c9c95accf53fea42b05fd0cc4500a6b306/Draft/Web.md'];5;4;4;[]
https://github.com/mikewest/mikewest.org ; HTML; ['https://github.com/mikewest/mikewest.org/blob/c406bcab67376a582194c5b5418939ce1db7a5ca/docs/2020/02/cms-security-summit-2020/index.html', 'https://github.com/mikewest/mikewest.org/blob/c406bcab67376a582194c5b5418939ce1db7a5ca/docs/rss/index.xml', 'https://github.com/mikewest/mikewest.org/blob/c406bcab67376a582194c5b5418939ce1db7a5ca/_posts/2020/2020-02-10-cms-security-summit-2020.markdown'];3;136;22;[]
https://github.com/notaryproject/notaryproject.dev ; HTML; ['https://github.com/notaryproject/notaryproject.dev/blob/abd80bc16d73d78c465a083a0017258117c86cbe/content/en/community/meeting-notes/meeting-notes-2020.md'];23;272;23;[]
https://github.com/camillelamy/explainers ; None; ['https://github.com/camillelamy/explainers/blob/ba70ae1c34daa0f9a4cbebf7cf8dacc5ce028b16/api_side_channel_model.md', 'https://github.com/camillelamy/explainers/blob/ba70ae1c34daa0f9a4cbebf7cf8dacc5ce028b16/cross-origin-isolation-deployment.md'];7;64;15;[]
https://github.com/htoooth/hacker-news-tracer ; JavaScript; ['https://github.com/htoooth/hacker-news-tracer/blob/ef602d81ef051ec3278ea9a8b299d6c835002d86/md/2018-05-30.md'];3;553;8;[]
https://github.com/encointer/book ; MATLAB; ['https://github.com/encointer/book/blob/5cc8bd570def0d76f10b2d3203132d36e0eea6fe/src/protocol-reputation.md', 'https://github.com/encointer/book/blob/5cc8bd570def0d76f10b2d3203132d36e0eea6fe/src/SUMMARY.md'];0;63;6;[]
https://github.com/k8s-docs/knative-docs ; HTML; ['https://github.com/k8s-docs/knative-docs/blob/5d7124f856ab6e66a523f68a0e4607532a8f805b/docs/reference/security/index.html', 'https://github.com/k8s-docs/knative-docs/blob/5d7124f856ab6e66a523f68a0e4607532a8f805b/source/reference/security/README.md'];0;17;37;[]
https://github.com/notaryproject/meeting-notes ; None; ['https://github.com/notaryproject/meeting-notes/blob/0de07a1890d9972349fbe089934824092d45fbea/meeting-notes-2020.md'];2;17;8;[]
https://github.com/MicrosoftDocs/architecture-sandbox ; PowerShell; ['https://github.com/MicrosoftDocs/architecture-sandbox/blob/e3789355f219ff3bf605a41d04e1c2df0c7bfebf/architecture-sandbox/framework/security/design-regulatory-compliance.md', 'https://github.com/MicrosoftDocs/architecture-sandbox/blob/e3789355f219ff3bf605a41d04e1c2df0c7bfebf/architecture-sandbox/framework/security/design-app-dependencies.md', 'https://github.com/MicrosoftDocs/architecture-sandbox/blob/e3789355f219ff3bf605a41d04e1c2df0c7bfebf/architecture-sandbox/framework/security/design-apps-services.md', 'https://github.com/MicrosoftDocs/architecture-sandbox/blob/e3789355f219ff3bf605a41d04e1c2df0c7bfebf/architecture-sandbox/framework/security/design-apps-considerations.md', 'https://github.com/MicrosoftDocs/architecture-sandbox/blob/e3789355f219ff3bf605a41d04e1c2df0c7bfebf/architecture-sandbox/framework/security/monitor-test.md'];4;10;10;[]
https://github.com/alexdhand/Infosec_Ref ; None; ['https://github.com/alexdhand/Infosec_Ref/blob/906ebe2352d17fcc51b2f3cf0945bf5416974570/Draft/Web.md'];3;396;8;[]
https://github.com/GoogleCloudPlatform/berglas ; Go; ['https://github.com/GoogleCloudPlatform/berglas/blob/22a0cfe42cfe76ef1bdf033bcb6d7642a09fb972/README.md'];1213;336;16;['google-cloud', 'gsecrets', 'secrets-management', 'secret-management', 'google-cloud-storage', 'google-cloud-kms']
https://github.com/apachecn/itnext-blog-zh ; JavaScript; ['https://github.com/apachecn/itnext-blog-zh/blob/c8427003e718f44019da202b9ca8f09a821a4d52/docs/a-few-steps-to-protect-your-k8s-cluster-87f339557fc6.md'];1;7;14;[]
https://github.com/valory-xyz/agent-academy-2 ; Python; ['https://github.com/valory-xyz/agent-academy-2/blob/ee248a904fe499606db356bb693458935f10a840/.spelling'];3;1099;21;[]
https://github.com/negibokken/bokken.io ; HTML; ['https://github.com/negibokken/bokken.io/blob/9091255c928ec75eee511aed56817ca946069ec2/sites/blog.bokken.io/articles/2022-09-27/about-anonymous-iframe.html', 'https://github.com/negibokken/bokken.io/blob/9091255c928ec75eee511aed56817ca946069ec2/sites/blog.bokken.io/articles/2022-09-27/about-anonymous-iframe.md'];1;589;10;[]
https://github.com/rootsongjc/cloud-native-library ; SCSS; ['https://github.com/rootsongjc/cloud-native-library/blob/2621c472cf0e4139e9f10c695f714f2d113ec09c/content/kubernetes-hardening-guidance/summary.list'];264;417;16;['cloud-native']
https://github.com/OSH-2021/x-KATA-Unikernel ; Go; ['https://github.com/OSH-2021/x-KATA-Unikernel/blob/57a6ac6487d0cd2eda60735d25e56191c3a33e7d/doc/feasibility/feasibility.md'];1;85;10;[]
https://github.com/tuananh/backstage-techdocs-example ; None; ['https://github.com/tuananh/backstage-techdocs-example/blob/0ebd52cb602ee58251c7556b0094cfd4c64c680c/docs/backend-system/building-backends/01-index.md', 'https://github.com/tuananh/backstage-techdocs-example/blob/0ebd52cb602ee58251c7556b0094cfd4c64c680c/mkdocs.yml'];2;1;3;[]
https://github.com/explodinggradients/notes ; Jupyter Notebook; ['https://github.com/explodinggradients/notes/blob/6526d69dbbad3275e6da054f6765583babf3dd92/rag-playground/gitlab-handbook/data/handbook/security/threat-modeling/howto.md'];11;50;8;[]
https://github.com/LedgerHQ/app-streaming ; C; ['https://github.com/LedgerHQ/app-streaming/blob/c519bda73794c46b942f155266232946a346efab/docs/README.md'];22;495;15;[]
https://github.com/raulrobinson/backstage ; TypeScript; ['https://github.com/raulrobinson/backstage/blob/7272ab57615f41db8adf2b0544b07103f8f93c08/docs/backend-system/building-backends/01-index.md', 'https://github.com/raulrobinson/backstage/blob/7272ab57615f41db8adf2b0544b07103f8f93c08/mkdocs.yml'];0;2;43;[]
https://github.com/adityasneo/Backstage.io ; TypeScript; ['https://github.com/adityasneo/Backstage.io/blob/06cb0eca90103493d602a76096ddb0fa25c7cd28/docs/backend-system/building-backends/01-index.md', 'https://github.com/adityasneo/Backstage.io/blob/06cb0eca90103493d602a76096ddb0fa25c7cd28/mkdocs.yml'];0;39625;43;[]
https://github.com/open-energy-transition/handbook ; HTML; ['https://github.com/open-energy-transition/handbook/blob/6ef87ce9da9feb24aa573a022f92075fe2428449/content/handbook/security/threat-modeling/howto.md'];0;54938;26;[]
https://github.com/Santhosh-Janardhan-we45/FEDEX ; None; ['https://github.com/Santhosh-Janardhan-we45/FEDEX/blob/fe72a550f604743a4beeefdffaa7586e44a7b531/SUMMARY.md'];0;8;13;[]
https://github.com/paragonie/libgossamer ; PHP; ['https://github.com/paragonie/libgossamer/blob/de7a433debd5a207efbc7fa68f6595c5660596fb/docs/security/README.md'];31;141;14;['gossamer', 'wordpress', 'php', 'security', 'cryptography', 'digital-signature', 'ed25519', 'blake2', 'sha384', 'secure-code-delivery', 'pki', 'crypto']
https://github.com/mco-gh/notes ; Python; ['https://github.com/mco-gh/notes/blob/b3116fd71b663b0b99476bcdd3b62579773d734d/articles/GoogleCloudPlatform_berglas.md'];4;12;4;[]
https://github.com/osnr/otron ; JavaScript; ['https://github.com/osnr/otron/blob/3d0b7716495e88d2375b7655914857774dd5e634/README.md', 'https://github.com/osnr/otron/blob/3d0b7716495e88d2375b7655914857774dd5e634/doc/intro.md'];16;29;12;[]
https://github.com/NDevTK/writeups ; HTML; ['https://github.com/NDevTK/writeups/blob/dc9d31caf1578bec183e5a7d03cd382b210c5b35/_posts/2023-08-18-extensions.md'];0;342;17;[]
https://github.com/dmose/mc-nodejs-docs ; None; ['https://github.com/dmose/mc-nodejs-docs/blob/d8db8f625b7dba4f4e1a0ed8697d452128104f6f/index.md'];0;55;4;[]
https://github.com/radicallyopensecurity/Nonprofit-Ventures ; None; ['https://github.com/radicallyopensecurity/Nonprofit-Ventures/blob/5682a782a59ff7fc6361182821cb1dede64e8f51/course-materials/README.md'];23;563;5;[]
https://github.com/sam123-eng/external-secrets ; Go; ['https://github.com/sam123-eng/external-secrets/blob/59bf53e7a3cdd38dd0d742f0950b731d89cc50e6/docs/guides/threat-model.md', 'https://github.com/sam123-eng/external-secrets/blob/59bf53e7a3cdd38dd0d742f0950b731d89cc50e6/hack/api-docs/mkdocs.yml'];0;2301;35;[]
https://github.com/snir911/temp-kata ; Go; ['https://github.com/snir911/temp-kata/blob/bc9358bf120828088c0a0fd3019315d0071e113e/docs/README.md'];0;8710;18;[]
https://github.com/ZirongCai/funky-unikernel ; Go; ['https://github.com/ZirongCai/funky-unikernel/blob/df369af4230d0ff54e20ef5a39fa741772e8ec80/docs/README.md'];1;8476;18;[]
https://github.com/nwjs/chromium.src ; None; ['https://github.com/nwjs/chromium.src/blob/f671d3ddc12ee77594001eda1544c1aecb095527/docs/security/post-spectre-webdev.md', 'https://github.com/nwjs/chromium.src/blob/f671d3ddc12ee77594001eda1544c1aecb095527/services/network/public/cpp/corb/README.md'];144;709218;83;[]
https://github.com/starfive-tech/chromium.src ; None; ['https://github.com/starfive-tech/chromium.src/blob/89659060321c7a20b8001d798db5a0eafc0a9e2c/docs/security/post-spectre-webdev.md', 'https://github.com/starfive-tech/chromium.src/blob/89659060321c7a20b8001d798db5a0eafc0a9e2c/services/network/public/cpp/corb/README.md'];6;27;77;[]
https://github.com/jason5122/chromium ; None; ['https://github.com/jason5122/chromium/blob/a27482b23eb77c6437e3d4c985d752825ade72d0/docs/security/post-spectre-webdev.md', 'https://github.com/jason5122/chromium/blob/a27482b23eb77c6437e3d4c985d752825ade72d0/services/network/public/cpp/corb/README.md'];0;25;78;[]
https://github.com/visnix/chromium-clean ; None; ['https://github.com/visnix/chromium-clean/blob/c1ef4a35b3d0b6e5f6bcff09405770a89eae7fcf/docs/security/post-spectre-webdev.md', 'https://github.com/visnix/chromium-clean/blob/c1ef4a35b3d0b6e5f6bcff09405770a89eae7fcf/services/network/public/cpp/corb/README.md'];0;6;57;[]
https://github.com/cpaula03/authelia ; Go; ['https://github.com/cpaula03/authelia/blob/93ec1de0b35c552ac40cb93c2af1b0e842eb53a0/docs/content/en/integration/prologue/get-started.md'];0;4617;38;[]
https://github.com/ep-infosec/50_google_kctf ; Go; ['https://github.com/ep-infosec/50_google_kctf/blob/dd282f970cb4cdcc7cc3793c3a32e57abe6fc153/SECURITY.md', 'https://github.com/ep-infosec/50_google_kctf/blob/dd282f970cb4cdcc7cc3793c3a32e57abe6fc153/docs/index.md'];0;1;8;[]
https://github.com/bobomanme/tag-security ; HTML; ['https://github.com/bobomanme/tag-security/blob/76221cb3d0a60deff4354793f519e1659b063ac8/assessments/projects/kyverno/self-assessment.md', 'https://github.com/bobomanme/tag-security/blob/76221cb3d0a60deff4354793f519e1659b063ac8/assessments/projects/custodian/joint-review.md'];0;1676;34;[]
https://github.com/Raul1718/sec_profile ; HTML; ['https://github.com/Raul1718/sec_profile/blob/355ce78a2cad2c5927ba97c31dcfae8150200ebb/data/xuanwu/2018/05/31/index.html'];6;1;8;[]
https://github.com/OpenDocCN/itnext-blog-zh ; JavaScript; ['https://github.com/OpenDocCN/itnext-blog-zh/blob/ca4fe96a9bbb3d4460e8a3be1a49139f14b4ecbc/docs/a-few-steps-to-protect-your-k8s-cluster-87f339557fc6.md'];0;14;14;[]
https://github.com/valory-xyz/apy-oracle ; Python; ['https://github.com/valory-xyz/apy-oracle/blob/c2239a795ea881a01f5f4d17ee79b28c521f9de4/.spelling'];3;8774;21;[]
https://github.com/davidosantos/backstage ; TypeScript; ['https://github.com/davidosantos/backstage/blob/d820584c6df4aa66c927622f86898aa2c1a4fc3f/docs/backend-system/building-backends/01-index.md', 'https://github.com/davidosantos/backstage/blob/d820584c6df4aa66c927622f86898aa2c1a4fc3f/mkdocs.yml'];0;42224;45;[]
https://github.com/isehuetdk/backstage ; TypeScript; ['https://github.com/isehuetdk/backstage/blob/22eca5b841b8c3b7e6029ea120786f437a3cca04/docs/backend-system/building-backends/01-index.md', 'https://github.com/isehuetdk/backstage/blob/22eca5b841b8c3b7e6029ea120786f437a3cca04/mkdocs.yml'];0;2;41;[]
https://github.com/knative/docs ; HTML; ['https://github.com/knative/docs/blob/ae88a5eb793e7e3c0a0ffa457dede83670be7f0d/docs/reference/security/README.md'];4191;3208;39;['kubernetes', 'istio', 'serverless', 'faas', 'paas', 'documentation', 'knative', 'hacktoberfest']
https://github.com/tiny-engines-code/tiny-engines-docs ; None; ['https://github.com/tiny-engines-code/tiny-engines-docs/blob/c9f7af0b6205841103ed9f01f999b2d571264f8a/SUMMARY.md'];0;98;13;[]
https://github.com/blockspacer/chromium_base_conan ; C++; ['https://github.com/blockspacer/chromium_base_conan/blob/726d2a446eb926f694e04ab166c0bbfdb40850f2/extensions/docs/chromium_docs/security/post-spectre-webdev.md'];17;108;22;[]
https://github.com/barrage/zap-extensions ; Java; ['https://github.com/barrage/zap-extensions/blob/ead4a969b091ba48bfe49a426756a2c99e032047/addOns/pscanrulesAlpha/src/main/java/org/zaproxy/zap/extension/pscanrulesAlpha/SiteIsolationScanRule.java'];0;10557;17;[]
https://github.com/roman0204/Auth-SSO ; Go; ['https://github.com/roman0204/Auth-SSO/blob/02a1b4f79f87c25759d05412b761a69c02469153/docs/content/en/integration/prologue/get-started.md'];0;56;20;[]
https://github.com/sshumaker/fhl ; HTML; ['https://github.com/sshumaker/fhl/blob/1d53a90a4f86e4f5cc68a9a61cb66cdcf41538ac/data/handbook/security/threat_modeling/howto.html.md'];0;6;5;[]
https://github.com/webosose/chromium108 ; None; ['https://github.com/webosose/chromium108/blob/544878ceda97caa1de945439e744ce7426ee75a5/src/docs/website/site/Home/chromium-security/ssca/index.md', 'https://github.com/webosose/chromium108/blob/544878ceda97caa1de945439e744ce7426ee75a5/src/docs/website/site/Home/chromium-security/site-isolation/index.md', 'https://github.com/webosose/chromium108/blob/544878ceda97caa1de945439e744ce7426ee75a5/src/services/network/public/cpp/corb/README.md'];0;67;9;[]
https://github.com/evernym/verity ; Scala; ['https://github.com/evernym/verity/blob/71ab68c0fa26dfc33aa6cada7cb47feef375f987/docs/deprecated/README.md'];20;2627;17;['self-sovereign-identity', 'digital-identity', 'hyperledger-indy', 'verifiable-credentials', 'ssi', 'evernym-verity']
https://github.com/prasaria/forked_backstage ; TypeScript; ['https://github.com/prasaria/forked_backstage/blob/459b84290a1800e8ce1a63bcf7ae266f59dd5326/mkdocs.yml'];0;30890;41;[]
https://github.com/broadinstitute/dsp-appsec-seckb ; Python; ['https://github.com/broadinstitute/dsp-appsec-seckb/blob/c175a4a1e859607678c77ae711c8e72449fb43d8/security-kb-gitbook/SUMMARY.md', 'https://github.com/broadinstitute/dsp-appsec-seckb/blob/c175a4a1e859607678c77ae711c8e72449fb43d8/security-kb-gitbook/platform-security-categories/docker/README.md'];2;345;5;[]
https://github.com/cezary-sec/awesome-browser-security ; None; ['https://github.com/cezary-sec/awesome-browser-security/blob/7615d34829a3808a3e79e5f24d1028f9912dc34f/README.md'];116;14;2;[]
https://github.com/LedgerHQ/vanadium ; C; ['https://github.com/LedgerHQ/vanadium/blob/505a54b935c49cd4866fc974ad5ab930b24e492f/docs/README.md'];8;624;16;[]
https://github.com/MVR-Kumar/Backsatge_simple_app ; JavaScript; ['https://github.com/MVR-Kumar/Backsatge_simple_app/blob/ca3aa3b84a1abc469efb35ed8658446cdabb4a3f/mkdocs.yml'];0;2;29;[]
https://github.com/mikewest/deprecating-document-domain ; None; ['https://github.com/mikewest/deprecating-document-domain/blob/b549d6d0897935afde0c9d0cb69ac11721a1becf/README.md'];16;15;3;[]
https://github.com/mikewest/securer-contexts ; None; ['https://github.com/mikewest/securer-contexts/blob/2267daf2a649d7940204a779f5ebb7b30e2acb67/README.md'];18;5;1;[]
https://github.com/IBM/dap-blueprint ; Python; ['https://github.com/IBM/dap-blueprint/blob/07009c6a3a4b434d74318a6606626b5ad394dc04/README.md'];0;78;34;[]
https://github.com/ep-infosec/33_apache_incubator-teaclave ; Rust; ['https://github.com/ep-infosec/33_apache_incubator-teaclave/blob/86219aa81e8eccaf5446b99d888f46035308ea05/docs/README.md', 'https://github.com/ep-infosec/33_apache_incubator-teaclave/blob/86219aa81e8eccaf5446b99d888f46035308ea05/config/README.md', 'https://github.com/ep-infosec/33_apache_incubator-teaclave/blob/86219aa81e8eccaf5446b99d888f46035308ea05/README.md'];0;1;35;[]
https://github.com/speced/bikeshed ; HTML; ['https://github.com/speced/bikeshed/blob/fbc1bf1005788299b4966ff6c8a858bce646e2fb/tests/github/w3c/webappsec-post-spectre-webdev/index.bs', 'https://github.com/speced/bikeshed/blob/fbc1bf1005788299b4966ff6c8a858bce646e2fb/tests/github/w3c/webappsec-post-spectre-webdev/index.html'];978;4977;29;[]
https://github.com/stefanmore/chromium-experiments ; None; ['https://github.com/stefanmore/chromium-experiments/blob/3e7a21303502ff3c024cc0d13b6f36397f415e87/services/network/public/cpp/corb/README.md'];0;2;84;[]
https://github.com/webosose/chromium91 ; None; ['https://github.com/webosose/chromium91/blob/b28e2ae83ee2e4907a36a49a4c0f054aa386dbfa/src/docs/security/post-spectre-webdev.md'];1;220;8;[]
https://github.com/merlinepedra/zap-extensions ; Java; ['https://github.com/merlinepedra/zap-extensions/blob/0dc37e9181c0cc93bcefaae5c6df1140d0096198/addOns/pscanrulesAlpha/src/main/java/org/zaproxy/zap/extension/pscanrulesAlpha/SiteIsolationScanRule.java'];1;10249;17;[]
https://github.com/mesatee/incubator-teaclave ; Rust; ['https://github.com/mesatee/incubator-teaclave/blob/097393da5fa7a0dc87312a704ad9a35abb1fa110/docs/README.md', 'https://github.com/mesatee/incubator-teaclave/blob/097393da5fa7a0dc87312a704ad9a35abb1fa110/config/README.md', 'https://github.com/mesatee/incubator-teaclave/blob/097393da5fa7a0dc87312a704ad9a35abb1fa110/README.md'];0;716;45;[]
https://github.com/Uvacoder/uva-tips-cheatsheets-collection ; HTML; ['https://github.com/Uvacoder/uva-tips-cheatsheets-collection/blob/8b30365be0239d930e16b3430f494fe925fde803/bookmarks-codeverland/readme.md'];9;1063;238;['readme', 'snippets', 'scripts', 'cheatsheet', 'myrepos', 'tips', 'curated', 'collection', 'mywip']
https://github.com/photon-sdk/photon-lib ; JavaScript; ['https://github.com/photon-sdk/photon-lib/blob/da5007ff97de4c74f81831fc043707da04ec4765/README.md'];46;382;13;[]
https://github.com/cranelab/webapp-tech ; None; ['https://github.com/cranelab/webapp-tech/blob/55f7ac7f98ec6cae4ae361ca22a37d936a239c3c/README.md'];43;4;1;[]
https://github.com/aeekayy/backstage ; TypeScript; ['https://github.com/aeekayy/backstage/blob/299a483600e2ecaef30d098f5eb7df013984e0bd/mkdocs.yml'];0;33360;42;[]
https://github.com/C-EO/edgevr ; HTML; ['https://github.com/C-EO/edgevr/blob/6c548a06998c3063f60423ffdb6244691c710d7f/_posts/2020-12-28-deep-dive-into-site-isolation-part-2.md'];0;154;27;[]
https://github.com/phrappuccino/sqlmap-zap-addon ; Java; ['https://github.com/phrappuccino/sqlmap-zap-addon/blob/18b88218c41527b22d226b07584a099535825bb4/addOns/pscanrulesAlpha/src/main/java/org/zaproxy/zap/extension/pscanrulesAlpha/SiteIsolationScanRule.java'];0;7289;16;[]
https://github.com/weq/miaka-backstage ; TypeScript; ['https://github.com/weq/miaka-backstage/blob/92da92756d64561ab8df9b6a05b505116f30b09f/mkdocs.yml'];0;162;10;[]
https://github.com/chris-wood/geolocation-threat-model ; Makefile; ['https://github.com/chris-wood/geolocation-threat-model/blob/9c73230967994287f8f83e9e9bd7744636eadb7e/.github/CODEOWNERS'];8;10;9;[]
https://github.com/SumoLogic/sumologic-documentation ; TypeScript; ['https://github.com/SumoLogic/sumologic-documentation/blob/749ea7cc290f3ffd6849680651b2e7b1b798ffd5/docs/integrations/saas-cloud/sentinelone.md', 'https://github.com/SumoLogic/sumologic-documentation/blob/749ea7cc290f3ffd6849680651b2e7b1b798ffd5/docs/integrations/web-servers/iis-10.md', 'https://github.com/SumoLogic/sumologic-documentation/blob/749ea7cc290f3ffd6849680651b2e7b1b798ffd5/docs/integrations/web-servers/haproxy.md', 'https://github.com/SumoLogic/sumologic-documentation/blob/749ea7cc290f3ffd6849680651b2e7b1b798ffd5/docs/integrations/app-development/jfrog-xray.md', 'https://github.com/SumoLogic/sumologic-documentation/blob/749ea7cc290f3ffd6849680651b2e7b1b798ffd5/docs/integrations/web-servers/opentelemetry/apache-opentelemetry.md', 'https://github.com/SumoLogic/sumologic-documentation/blob/749ea7cc290f3ffd6849680651b2e7b1b798ffd5/docs/integrations/web-servers/opentelemetry/haproxy-opentelemetry.md', 'https://github.com/SumoLogic/sumologic-documentation/blob/749ea7cc290f3ffd6849680651b2e7b1b798ffd5/docs/integrations/security-threat-detection/palo-alto-networks-9.md', 'https://github.com/SumoLogic/sumologic-documentation/blob/749ea7cc290f3ffd6849680651b2e7b1b798ffd5/docs/integrations/security-threat-detection/palo-alto-networks-8.md', 'https://github.com/SumoLogic/sumologic-documentation/blob/749ea7cc290f3ffd6849680651b2e7b1b798ffd5/docs/integrations/security-threat-detection/palo-alto-networks-6.md', 'https://github.com/SumoLogic/sumologic-documentation/blob/749ea7cc290f3ffd6849680651b2e7b1b798ffd5/docs/integrations/web-servers/opentelemetry/iis-10-opentelemetry.md', 'https://github.com/SumoLogic/sumologic-documentation/blob/749ea7cc290f3ffd6849680651b2e7b1b798ffd5/docs/integrations/saas-cloud/cato-networks.md', 'https://github.com/SumoLogic/sumologic-documentation/blob/749ea7cc290f3ffd6849680651b2e7b1b798ffd5/docs/integrations/web-servers/apache.md', 'https://github.com/SumoLogic/sumologic-documentation/blob/749ea7cc290f3ffd6849680651b2e7b1b798ffd5/docs/integrations/security-threat-detection/barracuda-waf.md'];23;3065;26;['documentation']
https://github.com/tymyrddin/blue-dfir ; CSS; ['https://github.com/tymyrddin/blue-dfir/blob/382f120cd6e8bc54cd1f286f318982bb7c26c0cf/source/docs/thm/android.md'];0;122;9;['dfir', 'volatility', 'autopsy', 'linux-forensics', 'windows-forensics', 'kape', 'redline', 'thehive', 'velociraptor', 'writeups']
https://github.com/kinlane/journey ; JavaScript; ['https://github.com/kinlane/journey/blob/9b39e604bc3de6904a614096945ba37d4896e3ca/_journey/dns/security/threat-analysis.md', 'https://github.com/kinlane/journey/blob/9b39e604bc3de6904a614096945ba37d4896e3ca/_journey/security/threats/threat-analysis.md'];3;21;25;[]
https://github.com/kmesh-net/kmesh ; C; ['https://github.com/kmesh-net/kmesh/blob/0d708d8a56b010f988e2afa4a5fb541d8cf2eec6/docs/kmesh_development_guide.md'];146;494;28;['ebpf', 'kernel', 'networking', 'traffic-management']
https://github.com/openeuler-mirror/Kmesh ; C; ['https://github.com/openeuler-mirror/Kmesh/blob/33290654ea888024be762215f0e4c88fb4c0ddc1/docs/kmesh_development_guide.md'];1;405;26;[]
https://github.com/comp9447-team4/soar ; Python; ['https://github.com/comp9447-team4/soar/blob/1f98560b51d57dc056b10733c5e901a0c90d5b01/services/WAF/README.md'];3;167;13;[]
https://github.com/SAFETAG/SAFETAG ; JavaScript; ['https://github.com/SAFETAG/SAFETAG/blob/19ef6801c4b86b85badd7cfd0f4ccad31c32b30b/content/methods/threat_assessment.md'];74;655;25;['risk-assessment', 'organizational-security']
https://github.com/forkwikiman/enha ; None; ['https://github.com/forkwikiman/enha/blob/4742b600191923863638e57877136dcd7e799948/mirror/%EC%97%91%EC%8A%A4%EC%BB%B4:%20%EB%A1%B1%20%EC%9B%8C/%ED%99%94%EA%B8%B0%EB%B3%91%EA%B3%BC.md', 'https://github.com/forkwikiman/enha/blob/4742b600191923863638e57877136dcd7e799948/mirror/%EC%97%91%EC%8A%A4%EC%BB%B4:%20%EB%A1%B1%20%EC%9B%8C/%EC%A7%80%EC%9B%90%EB%B3%91%EA%B3%BC.md', 'https://github.com/forkwikiman/enha/blob/4742b600191923863638e57877136dcd7e799948/mirror/%EC%97%91%EC%8A%A4%EC%BB%B4:%20%EB%A1%B1%20%EC%9B%8C/%EC%A0%95%EC%B0%B0-%EC%A0%80%EA%B2%A9%EB%B3%91%EA%B3%BC.md', 'https://github.com/forkwikiman/enha/blob/4742b600191923863638e57877136dcd7e799948/mirror/%EC%97%91%EC%8A%A4%EC%BB%B4:%20%EB%A1%B1%20%EC%9B%8C/%EC%A0%84%EC%88%A0%EB%B3%91%EA%B3%BC.md'];88;5;2;[]
https://github.com/ktneely/irwiki ; None; ['https://github.com/ktneely/irwiki/blob/544dffa38e4b8e1bea0213e252eb21652eb79024/pages/ir/dos.txt'];12;5;3;[]
https://github.com/chrishayesmu/XCOM-Companion ; JavaScript; ['https://github.com/chrishayesmu/XCOM-Companion/blob/9832d753c94546d5cb9a6e61df09c5f24a3bdbc4/assets/data/perks.json'];15;223;17;[]
https://github.com/atkinscyberacademy/Intrusions-and-Impacts ; JavaScript; ['https://github.com/atkinscyberacademy/Intrusions-and-Impacts/blob/c6bbabb868c5d6c372891a5a6bc7c5e7c4098057/app/static/defences.json'];4;20;9;[]
https://github.com/pde/tosback2-data ; JavaScript; ['https://github.com/pde/tosback2-data/blob/15c5d28f3bd989e235ccf5b0135c73950a02dd30/crawls/rollingstone.com/Privacy-Policy/wget.log'];19;191;9;[]
https://github.com/forkwikiman/enha_monimarkup ; None; ['https://github.com/forkwikiman/enha_monimarkup/blob/4f42347f38d7bc190acc1517637bc4d57b172ed3/%EC%97%91%EC%8A%A4%EC%BB%B4:%20%EB%A1%B1%20%EC%9B%8C/%ED%99%94%EA%B8%B0%EB%B3%91%EA%B3%BC.wiki', 'https://github.com/forkwikiman/enha_monimarkup/blob/4f42347f38d7bc190acc1517637bc4d57b172ed3/%EC%97%91%EC%8A%A4%EC%BB%B4:%20%EB%A1%B1%20%EC%9B%8C/%EC%A0%95%EC%B0%B0-%EC%A0%80%EA%B2%A9%EB%B3%91%EA%B3%BC.wiki'];31;1;1000;[]
https://github.com/madarasz/knowthemeta-old ; HTML; ['https://github.com/madarasz/knowthemeta-old/blob/8c33c6aac841c65e22cf2c7525ab4ad57ba31c72/Cards/Threat%20Assessment/index.html'];0;32;44;[]
https://github.com/MicrosoftDocs/win32 ; PowerShell; ['https://github.com/MicrosoftDocs/win32/blob/252da1c5cd7e28e97a39284fe3fafaff498e9abb/desktop-src/SecBP/handling-passwords.md', 'https://github.com/MicrosoftDocs/win32/blob/252da1c5cd7e28e97a39284fe3fafaff498e9abb/desktop-src/SecBP/toc.yml'];910;10065;14;[]
https://github.com/dylan-alexander/write-guide ; None; ['https://github.com/dylan-alexander/write-guide/blob/d3f57088ce6aa109d7a020e18018f6dc577253e1/desktop-src/SecBP/handling-passwords.md', 'https://github.com/dylan-alexander/write-guide/blob/d3f57088ce6aa109d7a020e18018f6dc577253e1/desktop-src/SecBP/toc.yml'];2;3;6;[]
https://github.com/Embodimentgeniuslm3/kkk ; PowerShell; ['https://github.com/Embodimentgeniuslm3/kkk/blob/95c48a25034a73cad66e53f433d4492685ed7e4c/desktop-src/SecBP/handling-passwords.md', 'https://github.com/Embodimentgeniuslm3/kkk/blob/95c48a25034a73cad66e53f433d4492685ed7e4c/desktop-src/SecBP/toc.yml'];0;1;11;[]
https://github.com/coffeeprogrammer/win32 ; PowerShell; ['https://github.com/coffeeprogrammer/win32/blob/1a3d206ac50e550760247f194824018cb9968d89/desktop-src/SecBP/toc.yml', 'https://github.com/coffeeprogrammer/win32/blob/1a3d206ac50e550760247f194824018cb9968d89/desktop-src/SecBP/handling-passwords.md'];0;2435;13;[]
