{
	"description": "Top 25 ontologies from fieldValueType and fieldValueMappings",
	"ontologies": [
		"http://ncicb.nci.nih.gov/xml/owl/EVS/Thesaurus.owl",
		"http://www.ebi.ac.uk/efo",
		"http://purl.bioontology.org/ontology/SNOMEDCT",
		"http://purl.bioontology.org/ontology/RCD",
		"http://purl.bioontology.org/ontology/CSP",
		"http://purl.bioontology.org/ontology/LNC",
		"http://purl.bioontology.org/ontology/MESH",
		"http://www.radlex.org/RID/",
		"http://purl.obolibrary.org/obo/UBERON",
		"http://purl.obolibrary.org/obo/BTO",
		"http://doe-generated-ontology.com/OntoAD",
		"http://purl.obolibrary.org/obo/MAT",
		"http://purl.obolibrary.org/obo/TAO",
		"http://purl.jp/bio/11/meo",
		"http://purl.org/sig/ont/fma",
		"http://purl.obolibrary.org/obo/MONDO",
		"http://www.ifomis.org/acgt/1.0",
		"http://purl.obolibrary.org/obo/EHDA",
		"http://purl.obolibrary.org/obo/EHDAA",
		"http://www.owl-ontologies.com/unnamed.owl",
		"http://phenomebrowser.net/ontologies/mesh/mesh.owl",
		"http://www.semanticweb.org/pallabi.d/ontologies/2014/2/untitled-ontology-11",
		"http://purl.bioontology.org/ontology/MEDDRA",
		"http://localhost/plosthes.2017-1",
		"http://www.semanticweb.org/ontologies/2010/10/BPO.owl"
	]
}
