{
	"description": "This file contains top 3 ontology URIs for which rules will be extracted.",
	"ontologies": [
		"http://www.ebi.ac.uk/efo",
		"http://purl.obolibrary.org/obo/BTO",
		"http://ncicb.nci.nih.gov/xml/owl/EVS/Thesaurus.owl"
	]
}
