{
	"name": "SuSe API Config 1",
	"description": "Using Suggestion Service per API",
	"config": {
		"rulerepo": {
			"name": "in-memory",
			"config": {
				"example": "animals"
			}
		},
		"relatedness_provider": {
			"name": "binary",
			"config": {
			}
		},
		"pipeline": {
			"field_aggregation_method": "median",
			"score_aggregation_method": "mean"
		}
	}
}
