{
	"name": "SuSe API Config 2 for Evaluation",
	"description": "Use Suggestion Service per API with evaluation mode",
	"config": {
		"rulerepo": {
			"name": "in-memory",
			"config": {
				"example": "animals"
			}
		},
		"relatedness_provider": {
			"name": "binary",
			"config": {
			}
		},
		"pipeline": {
			"field_aggregation_method": "median",
			"score_aggregation_method": "mean",
			"evaluation": true
		},
		"gather_stats": true
	}
}
