{
  "rules": [
    {
      "lhs": [
        {
          "field": "tags",
          "value": [
            "http://dbpedia.org/resource/Fur"
          ]
        }
      ],
      "rhs": [
        {
          "field": "type",
          "value": [
            "http://dbpedia.org/ontology/Mammal"
          ]
        }
      ],
      "sup": 0.6363636363636364,
      "con": 1.0
    },
    {
      "lhs": [
        {
          "field": "type",
          "value": [
            "http://dbpedia.org/ontology/Mammal"
          ]
        }
      ],
      "rhs": [
        {
          "field": "tags",
          "value": [
            "http://dbpedia.org/resource/Fur"
          ]
        }
      ],
      "sup": 0.6363636363636364,
      "con": 0.875
    },
    {
      "lhs": [
        {
          "field": "tags",
          "value": [
            "http://dbpedia.org/resource/Claw"
          ]
        }
      ],
      "rhs": [
        {
          "field": "type",
          "value": [
            "http://dbpedia.org/ontology/Mammal"
          ]
        }
      ],
      "sup": 0.45454545454545453,
      "con": 1.0
    },
    {
      "lhs": [
        {
          "field": "type",
          "value": [
            "http://dbpedia.org/ontology/Mammal"
          ]
        }
      ],
      "rhs": [
        {
          "field": "tags",
          "value": [
            "http://dbpedia.org/resource/Claw"
          ]
        }
      ],
      "sup": 0.45454545454545453,
      "con": 0.625
    },
    {
      "lhs": [
        {
          "field": "tags",
          "value": [
            "http://dbpedia.org/resource/Tail"
          ]
        }
      ],
      "rhs": [
        {
          "field": "type",
          "value": [
            "http://dbpedia.org/ontology/Mammal"
          ]
        }
      ],
      "sup": 0.6363636363636364,
      "con": 1.0
    },
    {
      "lhs": [
        {
          "field": "type",
          "value": [
            "http://dbpedia.org/ontology/Mammal"
          ]
        }
      ],
      "rhs": [
        {
          "field": "tags",
          "value": [
            "http://dbpedia.org/resource/Tail"
          ]
        }
      ],
      "sup": 0.6363636363636364,
      "con": 0.875
    },
    {
      "lhs": [
        {
          "field": "tags",
          "value": [
            "http://dbpedia.org/resource/Claw"
          ]
        }
      ],
      "rhs": [
        {
          "field": "tags",
          "value": [
            "http://dbpedia.org/resource/Fur"
          ]
        }
      ],
      "sup": 0.45454545454545453,
      "con": 1.0
    },
    {
      "lhs": [
        {
          "field": "tags",
          "value": [
            "http://dbpedia.org/resource/Fur"
          ]
        }
      ],
      "rhs": [
        {
          "field": "tags",
          "value": [
            "http://dbpedia.org/resource/Claw"
          ]
        }
      ],
      "sup": 0.45454545454545453,
      "con": 0.7142857142857143
    },
    {
      "lhs": [
        {
          "field": "tags",
          "value": [
            "http://dbpedia.org/resource/Tail"
          ]
        }
      ],
      "rhs": [
        {
          "field": "tags",
          "value": [
            "http://dbpedia.org/resource/Fur"
          ]
        }
      ],
      "sup": 0.5454545454545454,
      "con": 0.8571428571428571
    },
    {
      "lhs": [
        {
          "field": "tags",
          "value": [
            "http://dbpedia.org/resource/Fur"
          ]
        }
      ],
      "rhs": [
        {
          "field": "tags",
          "value": [
            "http://dbpedia.org/resource/Tail"
          ]
        }
      ],
      "sup": 0.5454545454545454,
      "con": 0.8571428571428571
    },
    {
      "lhs": [
        {
          "field": "tags",
          "value": [
            "http://dbpedia.org/resource/Fur",
            "http://dbpedia.org/resource/Claw"
          ]
        }
      ],
      "rhs": [
        {
          "field": "type",
          "value": [
            "http://dbpedia.org/ontology/Mammal"
          ]
        }
      ],
      "sup": 0.45454545454545453,
      "con": 1.0
    },
    {
      "lhs": [
        {
          "field": "type",
          "value": [
            "http://dbpedia.org/ontology/Mammal"
          ]
        },
        {
          "field": "tags",
          "value": [
            "http://dbpedia.org/resource/Claw"
          ]
        }
      ],
      "rhs": [
        {
          "field": "tags",
          "value": [
            "http://dbpedia.org/resource/Fur"
          ]
        }
      ],
      "sup": 0.45454545454545453,
      "con": 1.0
    },
    {
      "lhs": [
        {
          "field": "type",
          "value": [
            "http://dbpedia.org/ontology/Mammal"
          ]
        },
        {
          "field": "tags",
          "value": [
            "http://dbpedia.org/resource/Fur"
          ]
        }
      ],
      "rhs": [
        {
          "field": "tags",
          "value": [
            "http://dbpedia.org/resource/Claw"
          ]
        }
      ],
      "sup": 0.45454545454545453,
      "con": 0.7142857142857143
    },
    {
      "lhs": [
        {
          "field": "tags",
          "value": [
            "http://dbpedia.org/resource/Claw"
          ]
        }
      ],
      "rhs": [
        {
          "field": "type",
          "value": [
            "http://dbpedia.org/ontology/Mammal"
          ]
        },
        {
          "field": "tags",
          "value": [
            "http://dbpedia.org/resource/Fur"
          ]
        }
      ],
      "sup": 0.45454545454545453,
      "con": 1.0
    },
    {
      "lhs": [
        {
          "field": "tags",
          "value": [
            "http://dbpedia.org/resource/Fur"
          ]
        }
      ],
      "rhs": [
        {
          "field": "type",
          "value": [
            "http://dbpedia.org/ontology/Mammal"
          ]
        },
        {
          "field": "tags",
          "value": [
            "http://dbpedia.org/resource/Claw"
          ]
        }
      ],
      "sup": 0.45454545454545453,
      "con": 0.7142857142857143
    },
    {
      "lhs": [
        {
          "field": "type",
          "value": [
            "http://dbpedia.org/ontology/Mammal"
          ]
        }
      ],
      "rhs": [
        {
          "field": "tags",
          "value": [
            "http://dbpedia.org/resource/Fur",
            "http://dbpedia.org/resource/Claw"
          ]
        }
      ],
      "sup": 0.45454545454545453,
      "con": 0.625
    },
    {
      "lhs": [
        {
          "field": "tags",
          "value": [
            "http://dbpedia.org/resource/Fur",
            "http://dbpedia.org/resource/Tail"
          ]
        }
      ],
      "rhs": [
        {
          "field": "type",
          "value": [
            "http://dbpedia.org/ontology/Mammal"
          ]
        }
      ],
      "sup": 0.5454545454545454,
      "con": 1.0
    },
    {
      "lhs": [
        {
          "field": "type",
          "value": [
            "http://dbpedia.org/ontology/Mammal"
          ]
        },
        {
          "field": "tags",
          "value": [
            "http://dbpedia.org/resource/Tail"
          ]
        }
      ],
      "rhs": [
        {
          "field": "tags",
          "value": [
            "http://dbpedia.org/resource/Fur"
          ]
        }
      ],
      "sup": 0.5454545454545454,
      "con": 0.8571428571428571
    },
    {
      "lhs": [
        {
          "field": "type",
          "value": [
            "http://dbpedia.org/ontology/Mammal"
          ]
        },
        {
          "field": "tags",
          "value": [
            "http://dbpedia.org/resource/Fur"
          ]
        }
      ],
      "rhs": [
        {
          "field": "tags",
          "value": [
            "http://dbpedia.org/resource/Tail"
          ]
        }
      ],
      "sup": 0.5454545454545454,
      "con": 0.8571428571428571
    },
    {
      "lhs": [
        {
          "field": "tags",
          "value": [
            "http://dbpedia.org/resource/Tail"
          ]
        }
      ],
      "rhs": [
        {
          "field": "type",
          "value": [
            "http://dbpedia.org/ontology/Mammal"
          ]
        },
        {
          "field": "tags",
          "value": [
            "http://dbpedia.org/resource/Fur"
          ]
        }
      ],
      "sup": 0.5454545454545454,
      "con": 0.8571428571428571
    },
    {
      "lhs": [
        {
          "field": "tags",
          "value": [
            "http://dbpedia.org/resource/Fur"
          ]
        }
      ],
      "rhs": [
        {
          "field": "type",
          "value": [
            "http://dbpedia.org/ontology/Mammal"
          ]
        },
        {
          "field": "tags",
          "value": [
            "http://dbpedia.org/resource/Tail"
          ]
        }
      ],
      "sup": 0.5454545454545454,
      "con": 0.8571428571428571
    },
    {
      "lhs": [
        {
          "field": "type",
          "value": [
            "http://dbpedia.org/ontology/Mammal"
          ]
        }
      ],
      "rhs": [
        {
          "field": "tags",
          "value": [
            "http://dbpedia.org/resource/Fur",
            "http://dbpedia.org/resource/Tail"
          ]
        }
      ],
      "sup": 0.5454545454545454,
      "con": 0.75
    }
  ]
}