{
    "stats":
    {
        "num_rules_total": 17,
        "skipped_jaccard": 8,
        "skipped_semanticscorer": 0,
        "skipped_rulescorer": 0,
        "multi_field_agg": 0,
        "entity_pairs_nouri": 0,
        "entity_pairs_total": 9,
        "lds_requests": 1
    },
    "suggestions":
    {
        "http://dbpedia.org/resource/Claw":
        {
            "median":
            {
                "median": 0.548956,
                "mean": 0.470534,
                "min": 0.313689,
                "max": 0.548956,
                "product": 0.094531,
                "random": 0.548956
            },
            "mean":
            {
                "median": 0.548956,
                "mean": 0.470534,
                "min": 0.313689,
                "max": 0.548956,
                "product": 0.094531,
                "random": 0.548956
            },
            "min":
            {
                "median": 0.548956,
                "mean": 0.470534,
                "min": 0.313689,
                "max": 0.548956,
                "product": 0.094531,
                "random": 0.313689
            },
            "max":
            {
                "median": 0.548956,
                "mean": 0.470534,
                "min": 0.313689,
                "max": 0.548956,
                "product": 0.094531,
                "random": 0.548956
            },
            "product":
            {
                "median": 0.548956,
                "mean": 0.470534,
                "min": 0.313689,
                "max": 0.548956,
                "product": 0.094531,
                "random": 0.313689
            },
            "random":
            {
                "median": 0.548956,
                "mean": 0.470534,
                "min": 0.313689,
                "max": 0.548956,
                "product": 0.094531,
                "random": 0.548956
            }
        },
        "http://dbpedia.org/resource/Fur":
        {
            "median":
            {
                "median": 0.548956,
                "mean": 0.558367,
                "min": 0.376427,
                "max": 0.768539,
                "product": 0.045944,
                "random": 0.658748
            },
            "mean":
            {
                "median": 0.548956,
                "mean": 0.558367,
                "min": 0.376427,
                "max": 0.768539,
                "product": 0.045944,
                "random": 0.376427
            },
            "min":
            {
                "median": 0.548956,
                "mean": 0.558367,
                "min": 0.376427,
                "max": 0.768539,
                "product": 0.045944,
                "random": 0.658748
            },
            "max":
            {
                "median": 0.548956,
                "mean": 0.558367,
                "min": 0.376427,
                "max": 0.768539,
                "product": 0.045944,
                "random": 0.376427
            },
            "product":
            {
                "median": 0.548956,
                "mean": 0.558367,
                "min": 0.376427,
                "max": 0.768539,
                "product": 0.045944,
                "random": 0.658748
            },
            "random":
            {
                "median": 0.548956,
                "mean": 0.558367,
                "min": 0.376427,
                "max": 0.768539,
                "product": 0.045944,
                "random": 0.376427
            }
        },
        "http://dbpedia.org/resource/Tail":
        {
            "median":
            {
                "median": 0.658748,
                "mean": 0.601238,
                "min": 0.376427,
                "max": 0.768539,
                "product": 0.190575,
                "random": 0.658748
            },
            "mean":
            {
                "median": 0.658748,
                "mean": 0.601238,
                "min": 0.376427,
                "max": 0.768539,
                "product": 0.190575,
                "random": 0.376427
            },
            "min":
            {
                "median": 0.658748,
                "mean": 0.601238,
                "min": 0.376427,
                "max": 0.768539,
                "product": 0.190575,
                "random": 0.768539
            },
            "max":
            {
                "median": 0.658748,
                "mean": 0.601238,
                "min": 0.376427,
                "max": 0.768539,
                "product": 0.190575,
                "random": 0.658748
            },
            "product":
            {
                "median": 0.658748,
                "mean": 0.601238,
                "min": 0.376427,
                "max": 0.768539,
                "product": 0.190575,
                "random": 0.768539
            },
            "random":
            {
                "median": 0.658748,
                "mean": 0.601238,
                "min": 0.376427,
                "max": 0.768539,
                "product": 0.190575,
                "random": 0.658748
            }
        }
    }
}