{
	"name": "Suggestion Service API Config for Evaluation 2",
	"description": "Example config for testing evaluation. Remember to use flag -cvr when starting the API and to unzip the rules!",
	"config": {
		"rulerepo": {
			"name": "file",
			"config": {
				"filepath": "data/evaluation/rules/extracted-rules_ncbi.jsonl",
				"save_on_close": false
			}
		},
		"relatedness_provider": {
			"name": "lds",
			"config": {
				"endpoint_url": "http://localhost:8050/api/relatedness/ldsd",
				"cache": {
					"type": "lru",
					"maxsize": 20000
				},
				"request_timeout": 120
			}
		},
		"pipeline": {
			"field_aggregation_method": "median",
			"score_aggregation_method": "mean",
			"evaluation": true,
			"jaccard_threshold": 0.6
		},
		"gather_stats": true
	}
}
