{"lhs": [{"field": "tags", "value": ["http://dbpedia.org/resource/Fur"]}], "rhs": [{"field": "type", "value": ["http://dbpedia.org/ontology/Mammal"]}], "sup": 0.6363636363636364, "con": 1.0}
{"lhs": [{"field": "type", "value": ["http://dbpedia.org/ontology/Mammal"]}], "rhs": [{"field": "tags", "value": ["http://dbpedia.org/resource/Fur"]}], "sup": 0.6363636363636364, "con": 0.875}
{"lhs": [{"field": "tags", "value": ["http://dbpedia.org/resource/Claw"]}], "rhs": [{"field": "type", "value": ["http://dbpedia.org/ontology/Mammal"]}], "sup": 0.45454545454545453, "con": 1.0}
{"lhs": [{"field": "type", "value": ["http://dbpedia.org/ontology/Mammal"]}], "rhs": [{"field": "tags", "value": ["http://dbpedia.org/resource/Claw"]}], "sup": 0.45454545454545453, "con": 0.625}
{"lhs": [{"field": "tags", "value": ["http://dbpedia.org/resource/Tail"]}], "rhs": [{"field": "type", "value": ["http://dbpedia.org/ontology/Mammal"]}], "sup": 0.6363636363636364, "con": 1.0}
{"lhs": [{"field": "type", "value": ["http://dbpedia.org/ontology/Mammal"]}], "rhs": [{"field": "tags", "value": ["http://dbpedia.org/resource/Tail"]}], "sup": 0.6363636363636364, "con": 0.875}
{"lhs": [{"field": "name", "value": ["http://dbpedia.org/resource/Horse"]}], "rhs": [{"field": "type", "value": ["http://dbpedia.org/ontology/Mammal"]}], "sup": 0.2727272727272727, "con": 1.0}
{"lhs": [{"field": "eats", "value": ["http://dbpedia.org/resource/Grain"]}], "rhs": [{"field": "type", "value": ["http://dbpedia.org/ontology/Mammal"]}], "sup": 0.2727272727272727, "con": 1.0}
{"lhs": [{"field": "eats", "value": ["http://dbpedia.org/resource/Hay"]}], "rhs": [{"field": "type", "value": ["http://dbpedia.org/ontology/Mammal"]}], "sup": 0.2727272727272727, "con": 1.0}
{"lhs": [{"field": "tags", "value": ["http://dbpedia.org/resource/Claw"]}], "rhs": [{"field": "tags", "value": ["http://dbpedia.org/resource/Fur"]}], "sup": 0.45454545454545453, "con": 1.0}
{"lhs": [{"field": "tags", "value": ["http://dbpedia.org/resource/Fur"]}], "rhs": [{"field": "tags", "value": ["http://dbpedia.org/resource/Claw"]}], "sup": 0.45454545454545453, "con": 0.7142857142857143}
{"lhs": [{"field": "tags", "value": ["http://dbpedia.org/resource/Tail"]}], "rhs": [{"field": "tags", "value": ["http://dbpedia.org/resource/Fur"]}], "sup": 0.5454545454545454, "con": 0.8571428571428571}
{"lhs": [{"field": "tags", "value": ["http://dbpedia.org/resource/Fur"]}], "rhs": [{"field": "tags", "value": ["http://dbpedia.org/resource/Tail"]}], "sup": 0.5454545454545454, "con": 0.8571428571428571}
{"lhs": [{"field": "tags", "value": ["http://dbpedia.org/resource/Claw"]}], "rhs": [{"field": "tags", "value": ["http://dbpedia.org/resource/Tail"]}], "sup": 0.36363636363636365, "con": 0.8}
{"lhs": [{"field": "name", "value": ["http://dbpedia.org/resource/Horse"]}], "rhs": [{"field": "tags", "value": ["http://dbpedia.org/resource/Tail"]}], "sup": 0.2727272727272727, "con": 1.0}
{"lhs": [{"field": "eats", "value": ["http://dbpedia.org/resource/Grain"]}], "rhs": [{"field": "tags", "value": ["http://dbpedia.org/resource/Tail"]}], "sup": 0.2727272727272727, "con": 1.0}
{"lhs": [{"field": "eats", "value": ["http://dbpedia.org/resource/Hay"]}], "rhs": [{"field": "tags", "value": ["http://dbpedia.org/resource/Tail"]}], "sup": 0.2727272727272727, "con": 1.0}
{"lhs": [{"field": "eats", "value": ["http://dbpedia.org/resource/Grain"]}], "rhs": [{"field": "name", "value": ["http://dbpedia.org/resource/Horse"]}], "sup": 0.2727272727272727, "con": 1.0}
{"lhs": [{"field": "name", "value": ["http://dbpedia.org/resource/Horse"]}], "rhs": [{"field": "eats", "value": ["http://dbpedia.org/resource/Grain"]}], "sup": 0.2727272727272727, "con": 1.0}
{"lhs": [{"field": "eats", "value": ["http://dbpedia.org/resource/Hay"]}], "rhs": [{"field": "name", "value": ["http://dbpedia.org/resource/Horse"]}], "sup": 0.2727272727272727, "con": 1.0}
{"lhs": [{"field": "name", "value": ["http://dbpedia.org/resource/Horse"]}], "rhs": [{"field": "eats", "value": ["http://dbpedia.org/resource/Hay"]}], "sup": 0.2727272727272727, "con": 1.0}
{"lhs": [{"field": "eats", "value": ["http://dbpedia.org/resource/Hay"]}], "rhs": [{"field": "eats", "value": ["http://dbpedia.org/resource/Grain"]}], "sup": 0.2727272727272727, "con": 1.0}
{"lhs": [{"field": "eats", "value": ["http://dbpedia.org/resource/Grain"]}], "rhs": [{"field": "eats", "value": ["http://dbpedia.org/resource/Hay"]}], "sup": 0.2727272727272727, "con": 1.0}
{"lhs": [{"field": "tags", "value": ["http://dbpedia.org/resource/Fur", "http://dbpedia.org/resource/Claw"]}], "rhs": [{"field": "type", "value": ["http://dbpedia.org/ontology/Mammal"]}], "sup": 0.45454545454545453, "con": 1.0}
{"lhs": [{"field": "type", "value": ["http://dbpedia.org/ontology/Mammal"]}, {"field": "tags", "value": ["http://dbpedia.org/resource/Claw"]}], "rhs": [{"field": "tags", "value": ["http://dbpedia.org/resource/Fur"]}], "sup": 0.45454545454545453, "con": 1.0}
{"lhs": [{"field": "type", "value": ["http://dbpedia.org/ontology/Mammal"]}, {"field": "tags", "value": ["http://dbpedia.org/resource/Fur"]}], "rhs": [{"field": "tags", "value": ["http://dbpedia.org/resource/Claw"]}], "sup": 0.45454545454545453, "con": 0.7142857142857143}
{"lhs": [{"field": "tags", "value": ["http://dbpedia.org/resource/Claw"]}], "rhs": [{"field": "type", "value": ["http://dbpedia.org/ontology/Mammal"]}, {"field": "tags", "value": ["http://dbpedia.org/resource/Fur"]}], "sup": 0.45454545454545453, "con": 1.0}
{"lhs": [{"field": "tags", "value": ["http://dbpedia.org/resource/Fur"]}], "rhs": [{"field": "type", "value": ["http://dbpedia.org/ontology/Mammal"]}, {"field": "tags", "value": ["http://dbpedia.org/resource/Claw"]}], "sup": 0.45454545454545453, "con": 0.7142857142857143}
{"lhs": [{"field": "type", "value": ["http://dbpedia.org/ontology/Mammal"]}], "rhs": [{"field": "tags", "value": ["http://dbpedia.org/resource/Fur", "http://dbpedia.org/resource/Claw"]}], "sup": 0.45454545454545453, "con": 0.625}
{"lhs": [{"field": "tags", "value": ["http://dbpedia.org/resource/Fur", "http://dbpedia.org/resource/Tail"]}], "rhs": [{"field": "type", "value": ["http://dbpedia.org/ontology/Mammal"]}], "sup": 0.5454545454545454, "con": 1.0}
{"lhs": [{"field": "type", "value": ["http://dbpedia.org/ontology/Mammal"]}, {"field": "tags", "value": ["http://dbpedia.org/resource/Tail"]}], "rhs": [{"field": "tags", "value": ["http://dbpedia.org/resource/Fur"]}], "sup": 0.5454545454545454, "con": 0.8571428571428571}
{"lhs": [{"field": "type", "value": ["http://dbpedia.org/ontology/Mammal"]}, {"field": "tags", "value": ["http://dbpedia.org/resource/Fur"]}], "rhs": [{"field": "tags", "value": ["http://dbpedia.org/resource/Tail"]}], "sup": 0.5454545454545454, "con": 0.8571428571428571}
{"lhs": [{"field": "tags", "value": ["http://dbpedia.org/resource/Tail"]}], "rhs": [{"field": "type", "value": ["http://dbpedia.org/ontology/Mammal"]}, {"field": "tags", "value": ["http://dbpedia.org/resource/Fur"]}], "sup": 0.5454545454545454, "con": 0.8571428571428571}
{"lhs": [{"field": "tags", "value": ["http://dbpedia.org/resource/Fur"]}], "rhs": [{"field": "type", "value": ["http://dbpedia.org/ontology/Mammal"]}, {"field": "tags", "value": ["http://dbpedia.org/resource/Tail"]}], "sup": 0.5454545454545454, "con": 0.8571428571428571}
{"lhs": [{"field": "type", "value": ["http://dbpedia.org/ontology/Mammal"]}], "rhs": [{"field": "tags", "value": ["http://dbpedia.org/resource/Fur", "http://dbpedia.org/resource/Tail"]}], "sup": 0.5454545454545454, "con": 0.75}
{"lhs": [{"field": "tags", "value": ["http://dbpedia.org/resource/Claw", "http://dbpedia.org/resource/Tail"]}], "rhs": [{"field": "type", "value": ["http://dbpedia.org/ontology/Mammal"]}], "sup": 0.36363636363636365, "con": 1.0}
{"lhs": [{"field": "type", "value": ["http://dbpedia.org/ontology/Mammal"]}, {"field": "tags", "value": ["http://dbpedia.org/resource/Claw"]}], "rhs": [{"field": "tags", "value": ["http://dbpedia.org/resource/Tail"]}], "sup": 0.36363636363636365, "con": 0.8}
{"lhs": [{"field": "tags", "value": ["http://dbpedia.org/resource/Claw"]}], "rhs": [{"field": "type", "value": ["http://dbpedia.org/ontology/Mammal"]}, {"field": "tags", "value": ["http://dbpedia.org/resource/Tail"]}], "sup": 0.36363636363636365, "con": 0.8}
{"lhs": [{"field": "tags", "value": ["http://dbpedia.org/resource/Tail"]}, {"field": "name", "value": ["http://dbpedia.org/resource/Horse"]}], "rhs": [{"field": "type", "value": ["http://dbpedia.org/ontology/Mammal"]}], "sup": 0.2727272727272727, "con": 1.0}
{"lhs": [{"field": "type", "value": ["http://dbpedia.org/ontology/Mammal"]}, {"field": "name", "value": ["http://dbpedia.org/resource/Horse"]}], "rhs": [{"field": "tags", "value": ["http://dbpedia.org/resource/Tail"]}], "sup": 0.2727272727272727, "con": 1.0}
{"lhs": [{"field": "name", "value": ["http://dbpedia.org/resource/Horse"]}], "rhs": [{"field": "type", "value": ["http://dbpedia.org/ontology/Mammal"]}, {"field": "tags", "value": ["http://dbpedia.org/resource/Tail"]}], "sup": 0.2727272727272727, "con": 1.0}
{"lhs": [{"field": "tags", "value": ["http://dbpedia.org/resource/Tail"]}, {"field": "eats", "value": ["http://dbpedia.org/resource/Grain"]}], "rhs": [{"field": "type", "value": ["http://dbpedia.org/ontology/Mammal"]}], "sup": 0.2727272727272727, "con": 1.0}
{"lhs": [{"field": "type", "value": ["http://dbpedia.org/ontology/Mammal"]}, {"field": "eats", "value": ["http://dbpedia.org/resource/Grain"]}], "rhs": [{"field": "tags", "value": ["http://dbpedia.org/resource/Tail"]}], "sup": 0.2727272727272727, "con": 1.0}
{"lhs": [{"field": "eats", "value": ["http://dbpedia.org/resource/Grain"]}], "rhs": [{"field": "type", "value": ["http://dbpedia.org/ontology/Mammal"]}, {"field": "tags", "value": ["http://dbpedia.org/resource/Tail"]}], "sup": 0.2727272727272727, "con": 1.0}
{"lhs": [{"field": "tags", "value": ["http://dbpedia.org/resource/Tail"]}, {"field": "eats", "value": ["http://dbpedia.org/resource/Hay"]}], "rhs": [{"field": "type", "value": ["http://dbpedia.org/ontology/Mammal"]}], "sup": 0.2727272727272727, "con": 1.0}
{"lhs": [{"field": "type", "value": ["http://dbpedia.org/ontology/Mammal"]}, {"field": "eats", "value": ["http://dbpedia.org/resource/Hay"]}], "rhs": [{"field": "tags", "value": ["http://dbpedia.org/resource/Tail"]}], "sup": 0.2727272727272727, "con": 1.0}
{"lhs": [{"field": "eats", "value": ["http://dbpedia.org/resource/Hay"]}], "rhs": [{"field": "type", "value": ["http://dbpedia.org/ontology/Mammal"]}, {"field": "tags", "value": ["http://dbpedia.org/resource/Tail"]}], "sup": 0.2727272727272727, "con": 1.0}
{"lhs": [{"field": "name", "value": ["http://dbpedia.org/resource/Horse"]}, {"field": "eats", "value": ["http://dbpedia.org/resource/Grain"]}], "rhs": [{"field": "type", "value": ["http://dbpedia.org/ontology/Mammal"]}], "sup": 0.2727272727272727, "con": 1.0}
{"lhs": [{"field": "type", "value": ["http://dbpedia.org/ontology/Mammal"]}, {"field": "eats", "value": ["http://dbpedia.org/resource/Grain"]}], "rhs": [{"field": "name", "value": ["http://dbpedia.org/resource/Horse"]}], "sup": 0.2727272727272727, "con": 1.0}
{"lhs": [{"field": "type", "value": ["http://dbpedia.org/ontology/Mammal"]}, {"field": "name", "value": ["http://dbpedia.org/resource/Horse"]}], "rhs": [{"field": "eats", "value": ["http://dbpedia.org/resource/Grain"]}], "sup": 0.2727272727272727, "con": 1.0}
{"lhs": [{"field": "eats", "value": ["http://dbpedia.org/resource/Grain"]}], "rhs": [{"field": "type", "value": ["http://dbpedia.org/ontology/Mammal"]}, {"field": "name", "value": ["http://dbpedia.org/resource/Horse"]}], "sup": 0.2727272727272727, "con": 1.0}
{"lhs": [{"field": "name", "value": ["http://dbpedia.org/resource/Horse"]}], "rhs": [{"field": "type", "value": ["http://dbpedia.org/ontology/Mammal"]}, {"field": "eats", "value": ["http://dbpedia.org/resource/Grain"]}], "sup": 0.2727272727272727, "con": 1.0}
{"lhs": [{"field": "name", "value": ["http://dbpedia.org/resource/Horse"]}, {"field": "eats", "value": ["http://dbpedia.org/resource/Hay"]}], "rhs": [{"field": "type", "value": ["http://dbpedia.org/ontology/Mammal"]}], "sup": 0.2727272727272727, "con": 1.0}
{"lhs": [{"field": "type", "value": ["http://dbpedia.org/ontology/Mammal"]}, {"field": "eats", "value": ["http://dbpedia.org/resource/Hay"]}], "rhs": [{"field": "name", "value": ["http://dbpedia.org/resource/Horse"]}], "sup": 0.2727272727272727, "con": 1.0}
{"lhs": [{"field": "type", "value": ["http://dbpedia.org/ontology/Mammal"]}, {"field": "name", "value": ["http://dbpedia.org/resource/Horse"]}], "rhs": [{"field": "eats", "value": ["http://dbpedia.org/resource/Hay"]}], "sup": 0.2727272727272727, "con": 1.0}
{"lhs": [{"field": "eats", "value": ["http://dbpedia.org/resource/Hay"]}], "rhs": [{"field": "type", "value": ["http://dbpedia.org/ontology/Mammal"]}, {"field": "name", "value": ["http://dbpedia.org/resource/Horse"]}], "sup": 0.2727272727272727, "con": 1.0}
{"lhs": [{"field": "name", "value": ["http://dbpedia.org/resource/Horse"]}], "rhs": [{"field": "type", "value": ["http://dbpedia.org/ontology/Mammal"]}, {"field": "eats", "value": ["http://dbpedia.org/resource/Hay"]}], "sup": 0.2727272727272727, "con": 1.0}
{"lhs": [{"field": "eats", "value": ["http://dbpedia.org/resource/Grain", "http://dbpedia.org/resource/Hay"]}], "rhs": [{"field": "type", "value": ["http://dbpedia.org/ontology/Mammal"]}], "sup": 0.2727272727272727, "con": 1.0}
{"lhs": [{"field": "type", "value": ["http://dbpedia.org/ontology/Mammal"]}, {"field": "eats", "value": ["http://dbpedia.org/resource/Hay"]}], "rhs": [{"field": "eats", "value": ["http://dbpedia.org/resource/Grain"]}], "sup": 0.2727272727272727, "con": 1.0}
{"lhs": [{"field": "type", "value": ["http://dbpedia.org/ontology/Mammal"]}, {"field": "eats", "value": ["http://dbpedia.org/resource/Grain"]}], "rhs": [{"field": "eats", "value": ["http://dbpedia.org/resource/Hay"]}], "sup": 0.2727272727272727, "con": 1.0}
{"lhs": [{"field": "eats", "value": ["http://dbpedia.org/resource/Hay"]}], "rhs": [{"field": "type", "value": ["http://dbpedia.org/ontology/Mammal"]}, {"field": "eats", "value": ["http://dbpedia.org/resource/Grain"]}], "sup": 0.2727272727272727, "con": 1.0}
{"lhs": [{"field": "eats", "value": ["http://dbpedia.org/resource/Grain"]}], "rhs": [{"field": "type", "value": ["http://dbpedia.org/ontology/Mammal"]}, {"field": "eats", "value": ["http://dbpedia.org/resource/Hay"]}], "sup": 0.2727272727272727, "con": 1.0}
{"lhs": [{"field": "tags", "value": ["http://dbpedia.org/resource/Claw", "http://dbpedia.org/resource/Tail"]}], "rhs": [{"field": "tags", "value": ["http://dbpedia.org/resource/Fur"]}], "sup": 0.36363636363636365, "con": 1.0}
{"lhs": [{"field": "tags", "value": ["http://dbpedia.org/resource/Fur", "http://dbpedia.org/resource/Tail"]}], "rhs": [{"field": "tags", "value": ["http://dbpedia.org/resource/Claw"]}], "sup": 0.36363636363636365, "con": 0.6666666666666666}
{"lhs": [{"field": "tags", "value": ["http://dbpedia.org/resource/Fur", "http://dbpedia.org/resource/Claw"]}], "rhs": [{"field": "tags", "value": ["http://dbpedia.org/resource/Tail"]}], "sup": 0.36363636363636365, "con": 0.8}
{"lhs": [{"field": "tags", "value": ["http://dbpedia.org/resource/Claw"]}], "rhs": [{"field": "tags", "value": ["http://dbpedia.org/resource/Fur", "http://dbpedia.org/resource/Tail"]}], "sup": 0.36363636363636365, "con": 0.8}
{"lhs": [{"field": "name", "value": ["http://dbpedia.org/resource/Horse"]}, {"field": "eats", "value": ["http://dbpedia.org/resource/Grain"]}], "rhs": [{"field": "tags", "value": ["http://dbpedia.org/resource/Tail"]}], "sup": 0.2727272727272727, "con": 1.0}
{"lhs": [{"field": "tags", "value": ["http://dbpedia.org/resource/Tail"]}, {"field": "eats", "value": ["http://dbpedia.org/resource/Grain"]}], "rhs": [{"field": "name", "value": ["http://dbpedia.org/resource/Horse"]}], "sup": 0.2727272727272727, "con": 1.0}
{"lhs": [{"field": "tags", "value": ["http://dbpedia.org/resource/Tail"]}, {"field": "name", "value": ["http://dbpedia.org/resource/Horse"]}], "rhs": [{"field": "eats", "value": ["http://dbpedia.org/resource/Grain"]}], "sup": 0.2727272727272727, "con": 1.0}
{"lhs": [{"field": "eats", "value": ["http://dbpedia.org/resource/Grain"]}], "rhs": [{"field": "tags", "value": ["http://dbpedia.org/resource/Tail"]}, {"field": "name", "value": ["http://dbpedia.org/resource/Horse"]}], "sup": 0.2727272727272727, "con": 1.0}
{"lhs": [{"field": "name", "value": ["http://dbpedia.org/resource/Horse"]}], "rhs": [{"field": "tags", "value": ["http://dbpedia.org/resource/Tail"]}, {"field": "eats", "value": ["http://dbpedia.org/resource/Grain"]}], "sup": 0.2727272727272727, "con": 1.0}
{"lhs": [{"field": "name", "value": ["http://dbpedia.org/resource/Horse"]}, {"field": "eats", "value": ["http://dbpedia.org/resource/Hay"]}], "rhs": [{"field": "tags", "value": ["http://dbpedia.org/resource/Tail"]}], "sup": 0.2727272727272727, "con": 1.0}
{"lhs": [{"field": "tags", "value": ["http://dbpedia.org/resource/Tail"]}, {"field": "eats", "value": ["http://dbpedia.org/resource/Hay"]}], "rhs": [{"field": "name", "value": ["http://dbpedia.org/resource/Horse"]}], "sup": 0.2727272727272727, "con": 1.0}
{"lhs": [{"field": "tags", "value": ["http://dbpedia.org/resource/Tail"]}, {"field": "name", "value": ["http://dbpedia.org/resource/Horse"]}], "rhs": [{"field": "eats", "value": ["http://dbpedia.org/resource/Hay"]}], "sup": 0.2727272727272727, "con": 1.0}
{"lhs": [{"field": "eats", "value": ["http://dbpedia.org/resource/Hay"]}], "rhs": [{"field": "tags", "value": ["http://dbpedia.org/resource/Tail"]}, {"field": "name", "value": ["http://dbpedia.org/resource/Horse"]}], "sup": 0.2727272727272727, "con": 1.0}
{"lhs": [{"field": "name", "value": ["http://dbpedia.org/resource/Horse"]}], "rhs": [{"field": "tags", "value": ["http://dbpedia.org/resource/Tail"]}, {"field": "eats", "value": ["http://dbpedia.org/resource/Hay"]}], "sup": 0.2727272727272727, "con": 1.0}
{"lhs": [{"field": "eats", "value": ["http://dbpedia.org/resource/Grain", "http://dbpedia.org/resource/Hay"]}], "rhs": [{"field": "tags", "value": ["http://dbpedia.org/resource/Tail"]}], "sup": 0.2727272727272727, "con": 1.0}
{"lhs": [{"field": "tags", "value": ["http://dbpedia.org/resource/Tail"]}, {"field": "eats", "value": ["http://dbpedia.org/resource/Hay"]}], "rhs": [{"field": "eats", "value": ["http://dbpedia.org/resource/Grain"]}], "sup": 0.2727272727272727, "con": 1.0}
{"lhs": [{"field": "tags", "value": ["http://dbpedia.org/resource/Tail"]}, {"field": "eats", "value": ["http://dbpedia.org/resource/Grain"]}], "rhs": [{"field": "eats", "value": ["http://dbpedia.org/resource/Hay"]}], "sup": 0.2727272727272727, "con": 1.0}
{"lhs": [{"field": "eats", "value": ["http://dbpedia.org/resource/Hay"]}], "rhs": [{"field": "tags", "value": ["http://dbpedia.org/resource/Tail"]}, {"field": "eats", "value": ["http://dbpedia.org/resource/Grain"]}], "sup": 0.2727272727272727, "con": 1.0}
{"lhs": [{"field": "eats", "value": ["http://dbpedia.org/resource/Grain"]}], "rhs": [{"field": "tags", "value": ["http://dbpedia.org/resource/Tail"]}, {"field": "eats", "value": ["http://dbpedia.org/resource/Hay"]}], "sup": 0.2727272727272727, "con": 1.0}
{"lhs": [{"field": "eats", "value": ["http://dbpedia.org/resource/Grain", "http://dbpedia.org/resource/Hay"]}], "rhs": [{"field": "name", "value": ["http://dbpedia.org/resource/Horse"]}], "sup": 0.2727272727272727, "con": 1.0}
{"lhs": [{"field": "name", "value": ["http://dbpedia.org/resource/Horse"]}, {"field": "eats", "value": ["http://dbpedia.org/resource/Hay"]}], "rhs": [{"field": "eats", "value": ["http://dbpedia.org/resource/Grain"]}], "sup": 0.2727272727272727, "con": 1.0}
{"lhs": [{"field": "name", "value": ["http://dbpedia.org/resource/Horse"]}, {"field": "eats", "value": ["http://dbpedia.org/resource/Grain"]}], "rhs": [{"field": "eats", "value": ["http://dbpedia.org/resource/Hay"]}], "sup": 0.2727272727272727, "con": 1.0}
{"lhs": [{"field": "eats", "value": ["http://dbpedia.org/resource/Hay"]}], "rhs": [{"field": "name", "value": ["http://dbpedia.org/resource/Horse"]}, {"field": "eats", "value": ["http://dbpedia.org/resource/Grain"]}], "sup": 0.2727272727272727, "con": 1.0}
{"lhs": [{"field": "eats", "value": ["http://dbpedia.org/resource/Grain"]}], "rhs": [{"field": "name", "value": ["http://dbpedia.org/resource/Horse"]}, {"field": "eats", "value": ["http://dbpedia.org/resource/Hay"]}], "sup": 0.2727272727272727, "con": 1.0}
{"lhs": [{"field": "name", "value": ["http://dbpedia.org/resource/Horse"]}], "rhs": [{"field": "eats", "value": ["http://dbpedia.org/resource/Grain", "http://dbpedia.org/resource/Hay"]}], "sup": 0.2727272727272727, "con": 1.0}
{"lhs": [{"field": "tags", "value": ["http://dbpedia.org/resource/Fur", "http://dbpedia.org/resource/Claw", "http://dbpedia.org/resource/Tail"]}], "rhs": [{"field": "type", "value": ["http://dbpedia.org/ontology/Mammal"]}], "sup": 0.36363636363636365, "con": 1.0}
{"lhs": [{"field": "type", "value": ["http://dbpedia.org/ontology/Mammal"]}, {"field": "tags", "value": ["http://dbpedia.org/resource/Claw", "http://dbpedia.org/resource/Tail"]}], "rhs": [{"field": "tags", "value": ["http://dbpedia.org/resource/Fur"]}], "sup": 0.36363636363636365, "con": 1.0}
{"lhs": [{"field": "type", "value": ["http://dbpedia.org/ontology/Mammal"]}, {"field": "tags", "value": ["http://dbpedia.org/resource/Fur", "http://dbpedia.org/resource/Tail"]}], "rhs": [{"field": "tags", "value": ["http://dbpedia.org/resource/Claw"]}], "sup": 0.36363636363636365, "con": 0.6666666666666666}
{"lhs": [{"field": "type", "value": ["http://dbpedia.org/ontology/Mammal"]}, {"field": "tags", "value": ["http://dbpedia.org/resource/Fur", "http://dbpedia.org/resource/Claw"]}], "rhs": [{"field": "tags", "value": ["http://dbpedia.org/resource/Tail"]}], "sup": 0.36363636363636365, "con": 0.8}
{"lhs": [{"field": "tags", "value": ["http://dbpedia.org/resource/Claw", "http://dbpedia.org/resource/Tail"]}], "rhs": [{"field": "type", "value": ["http://dbpedia.org/ontology/Mammal"]}, {"field": "tags", "value": ["http://dbpedia.org/resource/Fur"]}], "sup": 0.36363636363636365, "con": 1.0}
{"lhs": [{"field": "tags", "value": ["http://dbpedia.org/resource/Fur", "http://dbpedia.org/resource/Tail"]}], "rhs": [{"field": "type", "value": ["http://dbpedia.org/ontology/Mammal"]}, {"field": "tags", "value": ["http://dbpedia.org/resource/Claw"]}], "sup": 0.36363636363636365, "con": 0.6666666666666666}
{"lhs": [{"field": "tags", "value": ["http://dbpedia.org/resource/Fur", "http://dbpedia.org/resource/Claw"]}], "rhs": [{"field": "type", "value": ["http://dbpedia.org/ontology/Mammal"]}, {"field": "tags", "value": ["http://dbpedia.org/resource/Tail"]}], "sup": 0.36363636363636365, "con": 0.8}
{"lhs": [{"field": "type", "value": ["http://dbpedia.org/ontology/Mammal"]}, {"field": "tags", "value": ["http://dbpedia.org/resource/Claw"]}], "rhs": [{"field": "tags", "value": ["http://dbpedia.org/resource/Fur", "http://dbpedia.org/resource/Tail"]}], "sup": 0.36363636363636365, "con": 0.8}
{"lhs": [{"field": "tags", "value": ["http://dbpedia.org/resource/Claw"]}], "rhs": [{"field": "type", "value": ["http://dbpedia.org/ontology/Mammal"]}, {"field": "tags", "value": ["http://dbpedia.org/resource/Fur", "http://dbpedia.org/resource/Tail"]}], "sup": 0.36363636363636365, "con": 0.8}
{"lhs": [{"field": "tags", "value": ["http://dbpedia.org/resource/Tail"]}, {"field": "name", "value": ["http://dbpedia.org/resource/Horse"]}, {"field": "eats", "value": ["http://dbpedia.org/resource/Grain"]}], "rhs": [{"field": "type", "value": ["http://dbpedia.org/ontology/Mammal"]}], "sup": 0.2727272727272727, "con": 1.0}
{"lhs": [{"field": "type", "value": ["http://dbpedia.org/ontology/Mammal"]}, {"field": "name", "value": ["http://dbpedia.org/resource/Horse"]}, {"field": "eats", "value": ["http://dbpedia.org/resource/Grain"]}], "rhs": [{"field": "tags", "value": ["http://dbpedia.org/resource/Tail"]}], "sup": 0.2727272727272727, "con": 1.0}
{"lhs": [{"field": "type", "value": ["http://dbpedia.org/ontology/Mammal"]}, {"field": "tags", "value": ["http://dbpedia.org/resource/Tail"]}, {"field": "eats", "value": ["http://dbpedia.org/resource/Grain"]}], "rhs": [{"field": "name", "value": ["http://dbpedia.org/resource/Horse"]}], "sup": 0.2727272727272727, "con": 1.0}
{"lhs": [{"field": "type", "value": ["http://dbpedia.org/ontology/Mammal"]}, {"field": "tags", "value": ["http://dbpedia.org/resource/Tail"]}, {"field": "name", "value": ["http://dbpedia.org/resource/Horse"]}], "rhs": [{"field": "eats", "value": ["http://dbpedia.org/resource/Grain"]}], "sup": 0.2727272727272727, "con": 1.0}
{"lhs": [{"field": "name", "value": ["http://dbpedia.org/resource/Horse"]}, {"field": "eats", "value": ["http://dbpedia.org/resource/Grain"]}], "rhs": [{"field": "type", "value": ["http://dbpedia.org/ontology/Mammal"]}, {"field": "tags", "value": ["http://dbpedia.org/resource/Tail"]}], "sup": 0.2727272727272727, "con": 1.0}
{"lhs": [{"field": "tags", "value": ["http://dbpedia.org/resource/Tail"]}, {"field": "eats", "value": ["http://dbpedia.org/resource/Grain"]}], "rhs": [{"field": "type", "value": ["http://dbpedia.org/ontology/Mammal"]}, {"field": "name", "value": ["http://dbpedia.org/resource/Horse"]}], "sup": 0.2727272727272727, "con": 1.0}
{"lhs": [{"field": "tags", "value": ["http://dbpedia.org/resource/Tail"]}, {"field": "name", "value": ["http://dbpedia.org/resource/Horse"]}], "rhs": [{"field": "type", "value": ["http://dbpedia.org/ontology/Mammal"]}, {"field": "eats", "value": ["http://dbpedia.org/resource/Grain"]}], "sup": 0.2727272727272727, "con": 1.0}
{"lhs": [{"field": "type", "value": ["http://dbpedia.org/ontology/Mammal"]}, {"field": "eats", "value": ["http://dbpedia.org/resource/Grain"]}], "rhs": [{"field": "tags", "value": ["http://dbpedia.org/resource/Tail"]}, {"field": "name", "value": ["http://dbpedia.org/resource/Horse"]}], "sup": 0.2727272727272727, "con": 1.0}
{"lhs": [{"field": "type", "value": ["http://dbpedia.org/ontology/Mammal"]}, {"field": "name", "value": ["http://dbpedia.org/resource/Horse"]}], "rhs": [{"field": "tags", "value": ["http://dbpedia.org/resource/Tail"]}, {"field": "eats", "value": ["http://dbpedia.org/resource/Grain"]}], "sup": 0.2727272727272727, "con": 1.0}
{"lhs": [{"field": "eats", "value": ["http://dbpedia.org/resource/Grain"]}], "rhs": [{"field": "type", "value": ["http://dbpedia.org/ontology/Mammal"]}, {"field": "tags", "value": ["http://dbpedia.org/resource/Tail"]}, {"field": "name", "value": ["http://dbpedia.org/resource/Horse"]}], "sup": 0.2727272727272727, "con": 1.0}
{"lhs": [{"field": "name", "value": ["http://dbpedia.org/resource/Horse"]}], "rhs": [{"field": "type", "value": ["http://dbpedia.org/ontology/Mammal"]}, {"field": "tags", "value": ["http://dbpedia.org/resource/Tail"]}, {"field": "eats", "value": ["http://dbpedia.org/resource/Grain"]}], "sup": 0.2727272727272727, "con": 1.0}
{"lhs": [{"field": "tags", "value": ["http://dbpedia.org/resource/Tail"]}, {"field": "name", "value": ["http://dbpedia.org/resource/Horse"]}, {"field": "eats", "value": ["http://dbpedia.org/resource/Hay"]}], "rhs": [{"field": "type", "value": ["http://dbpedia.org/ontology/Mammal"]}], "sup": 0.2727272727272727, "con": 1.0}
{"lhs": [{"field": "type", "value": ["http://dbpedia.org/ontology/Mammal"]}, {"field": "name", "value": ["http://dbpedia.org/resource/Horse"]}, {"field": "eats", "value": ["http://dbpedia.org/resource/Hay"]}], "rhs": [{"field": "tags", "value": ["http://dbpedia.org/resource/Tail"]}], "sup": 0.2727272727272727, "con": 1.0}
{"lhs": [{"field": "type", "value": ["http://dbpedia.org/ontology/Mammal"]}, {"field": "tags", "value": ["http://dbpedia.org/resource/Tail"]}, {"field": "eats", "value": ["http://dbpedia.org/resource/Hay"]}], "rhs": [{"field": "name", "value": ["http://dbpedia.org/resource/Horse"]}], "sup": 0.2727272727272727, "con": 1.0}
{"lhs": [{"field": "type", "value": ["http://dbpedia.org/ontology/Mammal"]}, {"field": "tags", "value": ["http://dbpedia.org/resource/Tail"]}, {"field": "name", "value": ["http://dbpedia.org/resource/Horse"]}], "rhs": [{"field": "eats", "value": ["http://dbpedia.org/resource/Hay"]}], "sup": 0.2727272727272727, "con": 1.0}
{"lhs": [{"field": "name", "value": ["http://dbpedia.org/resource/Horse"]}, {"field": "eats", "value": ["http://dbpedia.org/resource/Hay"]}], "rhs": [{"field": "type", "value": ["http://dbpedia.org/ontology/Mammal"]}, {"field": "tags", "value": ["http://dbpedia.org/resource/Tail"]}], "sup": 0.2727272727272727, "con": 1.0}
{"lhs": [{"field": "tags", "value": ["http://dbpedia.org/resource/Tail"]}, {"field": "eats", "value": ["http://dbpedia.org/resource/Hay"]}], "rhs": [{"field": "type", "value": ["http://dbpedia.org/ontology/Mammal"]}, {"field": "name", "value": ["http://dbpedia.org/resource/Horse"]}], "sup": 0.2727272727272727, "con": 1.0}
{"lhs": [{"field": "tags", "value": ["http://dbpedia.org/resource/Tail"]}, {"field": "name", "value": ["http://dbpedia.org/resource/Horse"]}], "rhs": [{"field": "type", "value": ["http://dbpedia.org/ontology/Mammal"]}, {"field": "eats", "value": ["http://dbpedia.org/resource/Hay"]}], "sup": 0.2727272727272727, "con": 1.0}
{"lhs": [{"field": "type", "value": ["http://dbpedia.org/ontology/Mammal"]}, {"field": "eats", "value": ["http://dbpedia.org/resource/Hay"]}], "rhs": [{"field": "tags", "value": ["http://dbpedia.org/resource/Tail"]}, {"field": "name", "value": ["http://dbpedia.org/resource/Horse"]}], "sup": 0.2727272727272727, "con": 1.0}
{"lhs": [{"field": "type", "value": ["http://dbpedia.org/ontology/Mammal"]}, {"field": "name", "value": ["http://dbpedia.org/resource/Horse"]}], "rhs": [{"field": "tags", "value": ["http://dbpedia.org/resource/Tail"]}, {"field": "eats", "value": ["http://dbpedia.org/resource/Hay"]}], "sup": 0.2727272727272727, "con": 1.0}
{"lhs": [{"field": "eats", "value": ["http://dbpedia.org/resource/Hay"]}], "rhs": [{"field": "type", "value": ["http://dbpedia.org/ontology/Mammal"]}, {"field": "tags", "value": ["http://dbpedia.org/resource/Tail"]}, {"field": "name", "value": ["http://dbpedia.org/resource/Horse"]}], "sup": 0.2727272727272727, "con": 1.0}
{"lhs": [{"field": "name", "value": ["http://dbpedia.org/resource/Horse"]}], "rhs": [{"field": "type", "value": ["http://dbpedia.org/ontology/Mammal"]}, {"field": "tags", "value": ["http://dbpedia.org/resource/Tail"]}, {"field": "eats", "value": ["http://dbpedia.org/resource/Hay"]}], "sup": 0.2727272727272727, "con": 1.0}
{"lhs": [{"field": "tags", "value": ["http://dbpedia.org/resource/Tail"]}, {"field": "eats", "value": ["http://dbpedia.org/resource/Grain", "http://dbpedia.org/resource/Hay"]}], "rhs": [{"field": "type", "value": ["http://dbpedia.org/ontology/Mammal"]}], "sup": 0.2727272727272727, "con": 1.0}
{"lhs": [{"field": "type", "value": ["http://dbpedia.org/ontology/Mammal"]}, {"field": "eats", "value": ["http://dbpedia.org/resource/Grain", "http://dbpedia.org/resource/Hay"]}], "rhs": [{"field": "tags", "value": ["http://dbpedia.org/resource/Tail"]}], "sup": 0.2727272727272727, "con": 1.0}
{"lhs": [{"field": "type", "value": ["http://dbpedia.org/ontology/Mammal"]}, {"field": "tags", "value": ["http://dbpedia.org/resource/Tail"]}, {"field": "eats", "value": ["http://dbpedia.org/resource/Hay"]}], "rhs": [{"field": "eats", "value": ["http://dbpedia.org/resource/Grain"]}], "sup": 0.2727272727272727, "con": 1.0}
{"lhs": [{"field": "type", "value": ["http://dbpedia.org/ontology/Mammal"]}, {"field": "tags", "value": ["http://dbpedia.org/resource/Tail"]}, {"field": "eats", "value": ["http://dbpedia.org/resource/Grain"]}], "rhs": [{"field": "eats", "value": ["http://dbpedia.org/resource/Hay"]}], "sup": 0.2727272727272727, "con": 1.0}
{"lhs": [{"field": "eats", "value": ["http://dbpedia.org/resource/Grain", "http://dbpedia.org/resource/Hay"]}], "rhs": [{"field": "type", "value": ["http://dbpedia.org/ontology/Mammal"]}, {"field": "tags", "value": ["http://dbpedia.org/resource/Tail"]}], "sup": 0.2727272727272727, "con": 1.0}
{"lhs": [{"field": "tags", "value": ["http://dbpedia.org/resource/Tail"]}, {"field": "eats", "value": ["http://dbpedia.org/resource/Hay"]}], "rhs": [{"field": "type", "value": ["http://dbpedia.org/ontology/Mammal"]}, {"field": "eats", "value": ["http://dbpedia.org/resource/Grain"]}], "sup": 0.2727272727272727, "con": 1.0}
{"lhs": [{"field": "tags", "value": ["http://dbpedia.org/resource/Tail"]}, {"field": "eats", "value": ["http://dbpedia.org/resource/Grain"]}], "rhs": [{"field": "type", "value": ["http://dbpedia.org/ontology/Mammal"]}, {"field": "eats", "value": ["http://dbpedia.org/resource/Hay"]}], "sup": 0.2727272727272727, "con": 1.0}
{"lhs": [{"field": "type", "value": ["http://dbpedia.org/ontology/Mammal"]}, {"field": "eats", "value": ["http://dbpedia.org/resource/Hay"]}], "rhs": [{"field": "tags", "value": ["http://dbpedia.org/resource/Tail"]}, {"field": "eats", "value": ["http://dbpedia.org/resource/Grain"]}], "sup": 0.2727272727272727, "con": 1.0}
{"lhs": [{"field": "type", "value": ["http://dbpedia.org/ontology/Mammal"]}, {"field": "eats", "value": ["http://dbpedia.org/resource/Grain"]}], "rhs": [{"field": "tags", "value": ["http://dbpedia.org/resource/Tail"]}, {"field": "eats", "value": ["http://dbpedia.org/resource/Hay"]}], "sup": 0.2727272727272727, "con": 1.0}
{"lhs": [{"field": "eats", "value": ["http://dbpedia.org/resource/Hay"]}], "rhs": [{"field": "type", "value": ["http://dbpedia.org/ontology/Mammal"]}, {"field": "tags", "value": ["http://dbpedia.org/resource/Tail"]}, {"field": "eats", "value": ["http://dbpedia.org/resource/Grain"]}], "sup": 0.2727272727272727, "con": 1.0}
{"lhs": [{"field": "eats", "value": ["http://dbpedia.org/resource/Grain"]}], "rhs": [{"field": "type", "value": ["http://dbpedia.org/ontology/Mammal"]}, {"field": "tags", "value": ["http://dbpedia.org/resource/Tail"]}, {"field": "eats", "value": ["http://dbpedia.org/resource/Hay"]}], "sup": 0.2727272727272727, "con": 1.0}
{"lhs": [{"field": "name", "value": ["http://dbpedia.org/resource/Horse"]}, {"field": "eats", "value": ["http://dbpedia.org/resource/Grain", "http://dbpedia.org/resource/Hay"]}], "rhs": [{"field": "type", "value": ["http://dbpedia.org/ontology/Mammal"]}], "sup": 0.2727272727272727, "con": 1.0}
{"lhs": [{"field": "type", "value": ["http://dbpedia.org/ontology/Mammal"]}, {"field": "eats", "value": ["http://dbpedia.org/resource/Grain", "http://dbpedia.org/resource/Hay"]}], "rhs": [{"field": "name", "value": ["http://dbpedia.org/resource/Horse"]}], "sup": 0.2727272727272727, "con": 1.0}
{"lhs": [{"field": "type", "value": ["http://dbpedia.org/ontology/Mammal"]}, {"field": "name", "value": ["http://dbpedia.org/resource/Horse"]}, {"field": "eats", "value": ["http://dbpedia.org/resource/Hay"]}], "rhs": [{"field": "eats", "value": ["http://dbpedia.org/resource/Grain"]}], "sup": 0.2727272727272727, "con": 1.0}
{"lhs": [{"field": "type", "value": ["http://dbpedia.org/ontology/Mammal"]}, {"field": "name", "value": ["http://dbpedia.org/resource/Horse"]}, {"field": "eats", "value": ["http://dbpedia.org/resource/Grain"]}], "rhs": [{"field": "eats", "value": ["http://dbpedia.org/resource/Hay"]}], "sup": 0.2727272727272727, "con": 1.0}
{"lhs": [{"field": "eats", "value": ["http://dbpedia.org/resource/Grain", "http://dbpedia.org/resource/Hay"]}], "rhs": [{"field": "type", "value": ["http://dbpedia.org/ontology/Mammal"]}, {"field": "name", "value": ["http://dbpedia.org/resource/Horse"]}], "sup": 0.2727272727272727, "con": 1.0}
{"lhs": [{"field": "name", "value": ["http://dbpedia.org/resource/Horse"]}, {"field": "eats", "value": ["http://dbpedia.org/resource/Hay"]}], "rhs": [{"field": "type", "value": ["http://dbpedia.org/ontology/Mammal"]}, {"field": "eats", "value": ["http://dbpedia.org/resource/Grain"]}], "sup": 0.2727272727272727, "con": 1.0}
{"lhs": [{"field": "name", "value": ["http://dbpedia.org/resource/Horse"]}, {"field": "eats", "value": ["http://dbpedia.org/resource/Grain"]}], "rhs": [{"field": "type", "value": ["http://dbpedia.org/ontology/Mammal"]}, {"field": "eats", "value": ["http://dbpedia.org/resource/Hay"]}], "sup": 0.2727272727272727, "con": 1.0}
{"lhs": [{"field": "type", "value": ["http://dbpedia.org/ontology/Mammal"]}, {"field": "eats", "value": ["http://dbpedia.org/resource/Hay"]}], "rhs": [{"field": "name", "value": ["http://dbpedia.org/resource/Horse"]}, {"field": "eats", "value": ["http://dbpedia.org/resource/Grain"]}], "sup": 0.2727272727272727, "con": 1.0}
{"lhs": [{"field": "type", "value": ["http://dbpedia.org/ontology/Mammal"]}, {"field": "eats", "value": ["http://dbpedia.org/resource/Grain"]}], "rhs": [{"field": "name", "value": ["http://dbpedia.org/resource/Horse"]}, {"field": "eats", "value": ["http://dbpedia.org/resource/Hay"]}], "sup": 0.2727272727272727, "con": 1.0}
{"lhs": [{"field": "type", "value": ["http://dbpedia.org/ontology/Mammal"]}, {"field": "name", "value": ["http://dbpedia.org/resource/Horse"]}], "rhs": [{"field": "eats", "value": ["http://dbpedia.org/resource/Grain", "http://dbpedia.org/resource/Hay"]}], "sup": 0.2727272727272727, "con": 1.0}
{"lhs": [{"field": "eats", "value": ["http://dbpedia.org/resource/Hay"]}], "rhs": [{"field": "type", "value": ["http://dbpedia.org/ontology/Mammal"]}, {"field": "name", "value": ["http://dbpedia.org/resource/Horse"]}, {"field": "eats", "value": ["http://dbpedia.org/resource/Grain"]}], "sup": 0.2727272727272727, "con": 1.0}
{"lhs": [{"field": "eats", "value": ["http://dbpedia.org/resource/Grain"]}], "rhs": [{"field": "type", "value": ["http://dbpedia.org/ontology/Mammal"]}, {"field": "name", "value": ["http://dbpedia.org/resource/Horse"]}, {"field": "eats", "value": ["http://dbpedia.org/resource/Hay"]}], "sup": 0.2727272727272727, "con": 1.0}
{"lhs": [{"field": "name", "value": ["http://dbpedia.org/resource/Horse"]}], "rhs": [{"field": "type", "value": ["http://dbpedia.org/ontology/Mammal"]}, {"field": "eats", "value": ["http://dbpedia.org/resource/Grain", "http://dbpedia.org/resource/Hay"]}], "sup": 0.2727272727272727, "con": 1.0}
{"lhs": [{"field": "name", "value": ["http://dbpedia.org/resource/Horse"]}, {"field": "eats", "value": ["http://dbpedia.org/resource/Grain", "http://dbpedia.org/resource/Hay"]}], "rhs": [{"field": "tags", "value": ["http://dbpedia.org/resource/Tail"]}], "sup": 0.2727272727272727, "con": 1.0}
{"lhs": [{"field": "tags", "value": ["http://dbpedia.org/resource/Tail"]}, {"field": "eats", "value": ["http://dbpedia.org/resource/Grain", "http://dbpedia.org/resource/Hay"]}], "rhs": [{"field": "name", "value": ["http://dbpedia.org/resource/Horse"]}], "sup": 0.2727272727272727, "con": 1.0}
{"lhs": [{"field": "tags", "value": ["http://dbpedia.org/resource/Tail"]}, {"field": "name", "value": ["http://dbpedia.org/resource/Horse"]}, {"field": "eats", "value": ["http://dbpedia.org/resource/Hay"]}], "rhs": [{"field": "eats", "value": ["http://dbpedia.org/resource/Grain"]}], "sup": 0.2727272727272727, "con": 1.0}
{"lhs": [{"field": "tags", "value": ["http://dbpedia.org/resource/Tail"]}, {"field": "name", "value": ["http://dbpedia.org/resource/Horse"]}, {"field": "eats", "value": ["http://dbpedia.org/resource/Grain"]}], "rhs": [{"field": "eats", "value": ["http://dbpedia.org/resource/Hay"]}], "sup": 0.2727272727272727, "con": 1.0}
{"lhs": [{"field": "eats", "value": ["http://dbpedia.org/resource/Grain", "http://dbpedia.org/resource/Hay"]}], "rhs": [{"field": "tags", "value": ["http://dbpedia.org/resource/Tail"]}, {"field": "name", "value": ["http://dbpedia.org/resource/Horse"]}], "sup": 0.2727272727272727, "con": 1.0}
{"lhs": [{"field": "name", "value": ["http://dbpedia.org/resource/Horse"]}, {"field": "eats", "value": ["http://dbpedia.org/resource/Hay"]}], "rhs": [{"field": "tags", "value": ["http://dbpedia.org/resource/Tail"]}, {"field": "eats", "value": ["http://dbpedia.org/resource/Grain"]}], "sup": 0.2727272727272727, "con": 1.0}
{"lhs": [{"field": "name", "value": ["http://dbpedia.org/resource/Horse"]}, {"field": "eats", "value": ["http://dbpedia.org/resource/Grain"]}], "rhs": [{"field": "tags", "value": ["http://dbpedia.org/resource/Tail"]}, {"field": "eats", "value": ["http://dbpedia.org/resource/Hay"]}], "sup": 0.2727272727272727, "con": 1.0}
{"lhs": [{"field": "tags", "value": ["http://dbpedia.org/resource/Tail"]}, {"field": "eats", "value": ["http://dbpedia.org/resource/Hay"]}], "rhs": [{"field": "name", "value": ["http://dbpedia.org/resource/Horse"]}, {"field": "eats", "value": ["http://dbpedia.org/resource/Grain"]}], "sup": 0.2727272727272727, "con": 1.0}
{"lhs": [{"field": "tags", "value": ["http://dbpedia.org/resource/Tail"]}, {"field": "eats", "value": ["http://dbpedia.org/resource/Grain"]}], "rhs": [{"field": "name", "value": ["http://dbpedia.org/resource/Horse"]}, {"field": "eats", "value": ["http://dbpedia.org/resource/Hay"]}], "sup": 0.2727272727272727, "con": 1.0}
{"lhs": [{"field": "tags", "value": ["http://dbpedia.org/resource/Tail"]}, {"field": "name", "value": ["http://dbpedia.org/resource/Horse"]}], "rhs": [{"field": "eats", "value": ["http://dbpedia.org/resource/Grain", "http://dbpedia.org/resource/Hay"]}], "sup": 0.2727272727272727, "con": 1.0}
{"lhs": [{"field": "eats", "value": ["http://dbpedia.org/resource/Hay"]}], "rhs": [{"field": "tags", "value": ["http://dbpedia.org/resource/Tail"]}, {"field": "name", "value": ["http://dbpedia.org/resource/Horse"]}, {"field": "eats", "value": ["http://dbpedia.org/resource/Grain"]}], "sup": 0.2727272727272727, "con": 1.0}
{"lhs": [{"field": "eats", "value": ["http://dbpedia.org/resource/Grain"]}], "rhs": [{"field": "tags", "value": ["http://dbpedia.org/resource/Tail"]}, {"field": "name", "value": ["http://dbpedia.org/resource/Horse"]}, {"field": "eats", "value": ["http://dbpedia.org/resource/Hay"]}], "sup": 0.2727272727272727, "con": 1.0}
{"lhs": [{"field": "name", "value": ["http://dbpedia.org/resource/Horse"]}], "rhs": [{"field": "tags", "value": ["http://dbpedia.org/resource/Tail"]}, {"field": "eats", "value": ["http://dbpedia.org/resource/Grain", "http://dbpedia.org/resource/Hay"]}], "sup": 0.2727272727272727, "con": 1.0}
{"lhs": [{"field": "tags", "value": ["http://dbpedia.org/resource/Tail"]}, {"field": "name", "value": ["http://dbpedia.org/resource/Horse"]}, {"field": "eats", "value": ["http://dbpedia.org/resource/Grain", "http://dbpedia.org/resource/Hay"]}], "rhs": [{"field": "type", "value": ["http://dbpedia.org/ontology/Mammal"]}], "sup": 0.2727272727272727, "con": 1.0}
{"lhs": [{"field": "type", "value": ["http://dbpedia.org/ontology/Mammal"]}, {"field": "name", "value": ["http://dbpedia.org/resource/Horse"]}, {"field": "eats", "value": ["http://dbpedia.org/resource/Grain", "http://dbpedia.org/resource/Hay"]}], "rhs": [{"field": "tags", "value": ["http://dbpedia.org/resource/Tail"]}], "sup": 0.2727272727272727, "con": 1.0}
{"lhs": [{"field": "type", "value": ["http://dbpedia.org/ontology/Mammal"]}, {"field": "tags", "value": ["http://dbpedia.org/resource/Tail"]}, {"field": "eats", "value": ["http://dbpedia.org/resource/Grain", "http://dbpedia.org/resource/Hay"]}], "rhs": [{"field": "name", "value": ["http://dbpedia.org/resource/Horse"]}], "sup": 0.2727272727272727, "con": 1.0}
{"lhs": [{"field": "type", "value": ["http://dbpedia.org/ontology/Mammal"]}, {"field": "tags", "value": ["http://dbpedia.org/resource/Tail"]}, {"field": "name", "value": ["http://dbpedia.org/resource/Horse"]}, {"field": "eats", "value": ["http://dbpedia.org/resource/Hay"]}], "rhs": [{"field": "eats", "value": ["http://dbpedia.org/resource/Grain"]}], "sup": 0.2727272727272727, "con": 1.0}
{"lhs": [{"field": "type", "value": ["http://dbpedia.org/ontology/Mammal"]}, {"field": "tags", "value": ["http://dbpedia.org/resource/Tail"]}, {"field": "name", "value": ["http://dbpedia.org/resource/Horse"]}, {"field": "eats", "value": ["http://dbpedia.org/resource/Grain"]}], "rhs": [{"field": "eats", "value": ["http://dbpedia.org/resource/Hay"]}], "sup": 0.2727272727272727, "con": 1.0}
{"lhs": [{"field": "name", "value": ["http://dbpedia.org/resource/Horse"]}, {"field": "eats", "value": ["http://dbpedia.org/resource/Grain", "http://dbpedia.org/resource/Hay"]}], "rhs": [{"field": "type", "value": ["http://dbpedia.org/ontology/Mammal"]}, {"field": "tags", "value": ["http://dbpedia.org/resource/Tail"]}], "sup": 0.2727272727272727, "con": 1.0}
{"lhs": [{"field": "tags", "value": ["http://dbpedia.org/resource/Tail"]}, {"field": "eats", "value": ["http://dbpedia.org/resource/Grain", "http://dbpedia.org/resource/Hay"]}], "rhs": [{"field": "type", "value": ["http://dbpedia.org/ontology/Mammal"]}, {"field": "name", "value": ["http://dbpedia.org/resource/Horse"]}], "sup": 0.2727272727272727, "con": 1.0}
{"lhs": [{"field": "tags", "value": ["http://dbpedia.org/resource/Tail"]}, {"field": "name", "value": ["http://dbpedia.org/resource/Horse"]}, {"field": "eats", "value": ["http://dbpedia.org/resource/Hay"]}], "rhs": [{"field": "type", "value": ["http://dbpedia.org/ontology/Mammal"]}, {"field": "eats", "value": ["http://dbpedia.org/resource/Grain"]}], "sup": 0.2727272727272727, "con": 1.0}
{"lhs": [{"field": "tags", "value": ["http://dbpedia.org/resource/Tail"]}, {"field": "name", "value": ["http://dbpedia.org/resource/Horse"]}, {"field": "eats", "value": ["http://dbpedia.org/resource/Grain"]}], "rhs": [{"field": "type", "value": ["http://dbpedia.org/ontology/Mammal"]}, {"field": "eats", "value": ["http://dbpedia.org/resource/Hay"]}], "sup": 0.2727272727272727, "con": 1.0}
{"lhs": [{"field": "type", "value": ["http://dbpedia.org/ontology/Mammal"]}, {"field": "eats", "value": ["http://dbpedia.org/resource/Grain", "http://dbpedia.org/resource/Hay"]}], "rhs": [{"field": "tags", "value": ["http://dbpedia.org/resource/Tail"]}, {"field": "name", "value": ["http://dbpedia.org/resource/Horse"]}], "sup": 0.2727272727272727, "con": 1.0}
{"lhs": [{"field": "type", "value": ["http://dbpedia.org/ontology/Mammal"]}, {"field": "name", "value": ["http://dbpedia.org/resource/Horse"]}, {"field": "eats", "value": ["http://dbpedia.org/resource/Hay"]}], "rhs": [{"field": "tags", "value": ["http://dbpedia.org/resource/Tail"]}, {"field": "eats", "value": ["http://dbpedia.org/resource/Grain"]}], "sup": 0.2727272727272727, "con": 1.0}
{"lhs": [{"field": "type", "value": ["http://dbpedia.org/ontology/Mammal"]}, {"field": "name", "value": ["http://dbpedia.org/resource/Horse"]}, {"field": "eats", "value": ["http://dbpedia.org/resource/Grain"]}], "rhs": [{"field": "tags", "value": ["http://dbpedia.org/resource/Tail"]}, {"field": "eats", "value": ["http://dbpedia.org/resource/Hay"]}], "sup": 0.2727272727272727, "con": 1.0}
{"lhs": [{"field": "type", "value": ["http://dbpedia.org/ontology/Mammal"]}, {"field": "tags", "value": ["http://dbpedia.org/resource/Tail"]}, {"field": "eats", "value": ["http://dbpedia.org/resource/Hay"]}], "rhs": [{"field": "name", "value": ["http://dbpedia.org/resource/Horse"]}, {"field": "eats", "value": ["http://dbpedia.org/resource/Grain"]}], "sup": 0.2727272727272727, "con": 1.0}
{"lhs": [{"field": "type", "value": ["http://dbpedia.org/ontology/Mammal"]}, {"field": "tags", "value": ["http://dbpedia.org/resource/Tail"]}, {"field": "eats", "value": ["http://dbpedia.org/resource/Grain"]}], "rhs": [{"field": "name", "value": ["http://dbpedia.org/resource/Horse"]}, {"field": "eats", "value": ["http://dbpedia.org/resource/Hay"]}], "sup": 0.2727272727272727, "con": 1.0}
{"lhs": [{"field": "type", "value": ["http://dbpedia.org/ontology/Mammal"]}, {"field": "tags", "value": ["http://dbpedia.org/resource/Tail"]}, {"field": "name", "value": ["http://dbpedia.org/resource/Horse"]}], "rhs": [{"field": "eats", "value": ["http://dbpedia.org/resource/Grain", "http://dbpedia.org/resource/Hay"]}], "sup": 0.2727272727272727, "con": 1.0}
{"lhs": [{"field": "eats", "value": ["http://dbpedia.org/resource/Grain", "http://dbpedia.org/resource/Hay"]}], "rhs": [{"field": "type", "value": ["http://dbpedia.org/ontology/Mammal"]}, {"field": "tags", "value": ["http://dbpedia.org/resource/Tail"]}, {"field": "name", "value": ["http://dbpedia.org/resource/Horse"]}], "sup": 0.2727272727272727, "con": 1.0}
{"lhs": [{"field": "name", "value": ["http://dbpedia.org/resource/Horse"]}, {"field": "eats", "value": ["http://dbpedia.org/resource/Hay"]}], "rhs": [{"field": "type", "value": ["http://dbpedia.org/ontology/Mammal"]}, {"field": "tags", "value": ["http://dbpedia.org/resource/Tail"]}, {"field": "eats", "value": ["http://dbpedia.org/resource/Grain"]}], "sup": 0.2727272727272727, "con": 1.0}
{"lhs": [{"field": "name", "value": ["http://dbpedia.org/resource/Horse"]}, {"field": "eats", "value": ["http://dbpedia.org/resource/Grain"]}], "rhs": [{"field": "type", "value": ["http://dbpedia.org/ontology/Mammal"]}, {"field": "tags", "value": ["http://dbpedia.org/resource/Tail"]}, {"field": "eats", "value": ["http://dbpedia.org/resource/Hay"]}], "sup": 0.2727272727272727, "con": 1.0}
{"lhs": [{"field": "tags", "value": ["http://dbpedia.org/resource/Tail"]}, {"field": "eats", "value": ["http://dbpedia.org/resource/Hay"]}], "rhs": [{"field": "type", "value": ["http://dbpedia.org/ontology/Mammal"]}, {"field": "name", "value": ["http://dbpedia.org/resource/Horse"]}, {"field": "eats", "value": ["http://dbpedia.org/resource/Grain"]}], "sup": 0.2727272727272727, "con": 1.0}
{"lhs": [{"field": "tags", "value": ["http://dbpedia.org/resource/Tail"]}, {"field": "eats", "value": ["http://dbpedia.org/resource/Grain"]}], "rhs": [{"field": "type", "value": ["http://dbpedia.org/ontology/Mammal"]}, {"field": "name", "value": ["http://dbpedia.org/resource/Horse"]}, {"field": "eats", "value": ["http://dbpedia.org/resource/Hay"]}], "sup": 0.2727272727272727, "con": 1.0}
{"lhs": [{"field": "tags", "value": ["http://dbpedia.org/resource/Tail"]}, {"field": "name", "value": ["http://dbpedia.org/resource/Horse"]}], "rhs": [{"field": "type", "value": ["http://dbpedia.org/ontology/Mammal"]}, {"field": "eats", "value": ["http://dbpedia.org/resource/Grain", "http://dbpedia.org/resource/Hay"]}], "sup": 0.2727272727272727, "con": 1.0}
{"lhs": [{"field": "type", "value": ["http://dbpedia.org/ontology/Mammal"]}, {"field": "eats", "value": ["http://dbpedia.org/resource/Hay"]}], "rhs": [{"field": "tags", "value": ["http://dbpedia.org/resource/Tail"]}, {"field": "name", "value": ["http://dbpedia.org/resource/Horse"]}, {"field": "eats", "value": ["http://dbpedia.org/resource/Grain"]}], "sup": 0.2727272727272727, "con": 1.0}
{"lhs": [{"field": "type", "value": ["http://dbpedia.org/ontology/Mammal"]}, {"field": "eats", "value": ["http://dbpedia.org/resource/Grain"]}], "rhs": [{"field": "tags", "value": ["http://dbpedia.org/resource/Tail"]}, {"field": "name", "value": ["http://dbpedia.org/resource/Horse"]}, {"field": "eats", "value": ["http://dbpedia.org/resource/Hay"]}], "sup": 0.2727272727272727, "con": 1.0}
{"lhs": [{"field": "type", "value": ["http://dbpedia.org/ontology/Mammal"]}, {"field": "name", "value": ["http://dbpedia.org/resource/Horse"]}], "rhs": [{"field": "tags", "value": ["http://dbpedia.org/resource/Tail"]}, {"field": "eats", "value": ["http://dbpedia.org/resource/Grain", "http://dbpedia.org/resource/Hay"]}], "sup": 0.2727272727272727, "con": 1.0}
{"lhs": [{"field": "eats", "value": ["http://dbpedia.org/resource/Hay"]}], "rhs": [{"field": "type", "value": ["http://dbpedia.org/ontology/Mammal"]}, {"field": "tags", "value": ["http://dbpedia.org/resource/Tail"]}, {"field": "name", "value": ["http://dbpedia.org/resource/Horse"]}, {"field": "eats", "value": ["http://dbpedia.org/resource/Grain"]}], "sup": 0.2727272727272727, "con": 1.0}
{"lhs": [{"field": "eats", "value": ["http://dbpedia.org/resource/Grain"]}], "rhs": [{"field": "type", "value": ["http://dbpedia.org/ontology/Mammal"]}, {"field": "tags", "value": ["http://dbpedia.org/resource/Tail"]}, {"field": "name", "value": ["http://dbpedia.org/resource/Horse"]}, {"field": "eats", "value": ["http://dbpedia.org/resource/Hay"]}], "sup": 0.2727272727272727, "con": 1.0}
{"lhs": [{"field": "name", "value": ["http://dbpedia.org/resource/Horse"]}], "rhs": [{"field": "type", "value": ["http://dbpedia.org/ontology/Mammal"]}, {"field": "tags", "value": ["http://dbpedia.org/resource/Tail"]}, {"field": "eats", "value": ["http://dbpedia.org/resource/Grain", "http://dbpedia.org/resource/Hay"]}], "sup": 0.2727272727272727, "con": 1.0}
