{
	"timeout": 10,
	"source": {
		"directories": [
			"./src"
		]
	},
	"phpUnit": {
		"customPath": "./tools/phpunit.phar"
	},
	"logs": {
		"text": "php://stdout"
	},
	"mutators": {
		"@default": true
	},
	"bootstrap": "./tests/bootstrap.php"
}
