{
	"name": "FocusedWindowMonitor",
	"description": "Track currently focused window title",
	"uuid": "focused-window-monitor@kudera.dev",
	"url": "https://gitlab.com/dkx/gnome/focused-window-monitor",
	"shell-version": [
		"45"
	]
}
