{
	"$schema": "../../schema/config-02.json",
	"connection": {
		"driver": "sqlite",
		"string": "Data Source=db.sqlite"
	},
	"groups": {
		"structure": {
			"path": "./Migrations/structure"
		},
		"basic-data": {
			"path": "./Migrations/basic-data"
		},
		"dummy-data": {
			"path": "./Migrations/dummy-data",
			"enabled": false
		}
	}
}
