{
    "web": {
        "client_id": "477101283354-fq4q97movsd5q1p2qi75jh4t6dhue1h5.apps.googleusercontent.com",
        "project_id": "superb-ethos-346206",
        "auth_uri": "https://accounts.google.com/o/oauth2/auth",
        "token_uri": "https://oauth2.googleapis.com/token",
        "auth_provider_x509_cert_url": "https://www.googleapis.com/oauth2/v1/certs",
        "client_secret": "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",
        "redirect_uris": [
            "http://localhost:8001/redirect.php"
        ],
        "javascript_origins": [
            "http://localhost:8001"
        ]
    }
}