[
    {
        "id": 0,
        "name": "Song 2",
        "duration": 121000,
        "genre": "Indie",
        "hearts": 2,
        "artist": {
            "name": "Blur"
        },
        "album": {
            "name": "Blur",
            "year": 1997,
            "genre": "Indie"
        }
    },
    {
        "id": 1,
        "name": "Lonesome Street",
        "duration": 262000,
        "genre": "Alternative/Indie",
        "hearts": 0,
        "artist": {
            "name": "Blur"
        },
        "album": {
            "name": "The Magic Whip",
            "year": 2015,
            "genre": "Alternative/Indie"
        }
    },
    {
        "id": 2,
        "name": "I Am The Walrus",
        "duration": 275000,
        "genre": "Rock",
        "hearts": 1,
        "artist": {
            "name": "The Beatles"
        },
        "album": {
            "name": "Magical Mystery Tour",
            "year": 1967,
            "genre": "Rock"
        }
    },
    {
        "id": 3,
        "name": "Come Together",
        "duration": 259000,
        "genre": "Rock",
        "hearts": 2,
        "artist": {
            "name": "The Beatles"
        },
        "album": {
            "name": "Abbey Road",
            "year": 1969,
            "genre": "Rock"
        }
    },
    {
        "id": 4,
        "name": "Purple Haze",
        "duration": 170000,
        "genre": "Classic Rock",
        "hearts": 3,
        "artist": {
            "name": "The Jimi Hendrix Experience"
        },
        "album": {
            "name": "Are You Experienced",
            "year": 1967,
            "genre": "Classic Rock"
        }
    },
    {
        "id": 5,
        "name": "Bright Lights",
        "duration": 324000,
        "genre": "Blues",
        "hearts": 3,
        "artist": {
            "name": "Gary Clark Jr."
        },
        "album": {
            "name": "Blak And Blu",
            "year": 2012,
            "genre": "Blues"
        }
    },
    {
        "id": 6,
        "name": "Ain't Messin 'Round",
        "duration": 249000,
        "genre": "Blues",
        "hearts": 2,
        "artist": {
            "name": "Gary Clark Jr."
        },
        "album": {
            "name": "Blak And Blu",
            "year": 2012,
            "genre": "Blues"
        }
    },
    {
        "id": 7,
        "name": "The Healing",
        "duration": 288000,
        "genre": "Rock",
        "hearts": 3,
        "artist": {
            "name": "Gary Clark Jr."
        },
        "album": {
            "name": "The Story of Sunny Boy Slim",
            "year": 2015,
            "genre": "Rock"
        }
    },
    {
        "id": 8,
        "name": "Act I",
        "duration": 288000,
        "genre": "Classic",
        "hearts": 3,
        "artist": {
            "name": "Pyotr Ilyich Tchaikovsky"
        },
        "album": {
            "name": "Swan lake",
            "year": 1876,
            "genre": "Rock"
        }
    }
]
