[gd_scene load_steps=5 format=2]

[ext_resource path="res://img/star.svg" type="Texture" id=2]

[sub_resource type="Curve" id=1]
_data = [ Vector2( 0, 0 ), 0.0, 0.0, 0, 0, Vector2( 0.25, 1 ), 0.0, 0.0, 0, 0, Vector2( 0.493976, 0 ), 0.0, 0.0, 0, 0, Vector2( 0.737952, 1 ), 0.0, 0.0, 0, 0, Vector2( 1, 0 ), 0.0, 0.0, 0, 0 ]

[sub_resource type="CurveTexture" id=2]
curve = SubResource( 1 )

[sub_resource type="ParticlesMaterial" id=3]
emission_shape = 2
emission_box_extents = Vector3( 1000, 500, 1 )
flag_disable_z = true
gravity = Vector3( 0, 0, 0 )
angular_velocity = 50.0
angular_velocity_random = 1.0
orbit_velocity = 0.0
orbit_velocity_random = 0.0
scale = 0.5
scale_random = 0.5
scale_curve = SubResource( 2 )

[node name="StarField" type="Particles2D"]
lifetime = 6.0
preprocess = 6.0
process_material = SubResource( 3 )
texture = ExtResource( 2 )
