[gd_scene load_steps=4 format=2]

[ext_resource path="res://img/spaceShooter2_spritesheet.png" type="Texture" id=1]
[ext_resource path="res://code/SlowEnemy.gd" type="Script" id=2]
[ext_resource path="res://scene/Explosion.tscn" type="PackedScene" id=3]

[node name="SlowEnemy" type="Area2D"]
script = ExtResource( 2 )
velocity = Vector2( 100, 100 )
rotation_speed = 2.0

[node name="Sprite" type="Sprite" parent="."]
texture = ExtResource( 1 )
region_enabled = true
region_rect = Rect2( 215, 688, 172, 52 )

[node name="CollisionPolygon2D" type="CollisionPolygon2D" parent="."]
polygon = PoolVector2Array( -85.8172, -25.7373, 85.9495, -25.9126, 85.863, 25.8484, -85.6812, 25.7613 )

[node name="Explosion" parent="." instance=ExtResource( 3 )]
