[gd_scene load_steps=4 format=2]

[ext_resource path="res://img/powerupRed_star.png" type="Texture" id=1]
[ext_resource path="res://code/PowerDownBigger.gd" type="Script" id=2]

[sub_resource type="RectangleShape2D" id=1]
extents = Vector2( 16, 16 )

[node name="PowerDownBigger" type="Area2D"]
z_index = 5
script = ExtResource( 2 )

[node name="Sprite" type="Sprite" parent="."]
texture = ExtResource( 1 )

[node name="CollisionShape2D" type="CollisionShape2D" parent="."]
shape = SubResource( 1 )
