[gd_scene load_steps=6 format=2]

[ext_resource path="res://actors/GUI/Inventory.gd" type="Script" id=1]
[ext_resource path="res://assets/others/DraggableBar.gd" type="Script" id=2]
[ext_resource path="res://assets/fonts/WildstarFont.ttf" type="DynamicFontData" id=3]

[sub_resource type="StyleBoxFlat" id=1]
bg_color = Color( 0.337255, 0.282353, 0.282353, 1 )

[sub_resource type="DynamicFont" id=2]
outline_size = 1
outline_color = Color( 0, 0, 0, 1 )
use_filter = true
font_data = ExtResource( 3 )

[node name="Inventory" type="Panel"]
margin_right = 256.0
margin_bottom = 256.0
script = ExtResource( 1 )
__meta__ = {
"_edit_use_anchors_": false
}

[node name="TopBar" type="Panel" parent="."]
margin_right = 256.0
margin_bottom = 24.0
custom_styles/panel = SubResource( 1 )
script = ExtResource( 2 )
__meta__ = {
"_edit_group_": true,
"_edit_use_anchors_": false
}

[node name="HBoxContainer" type="HBoxContainer" parent="TopBar"]
anchor_right = 1.0
anchor_bottom = 1.0
__meta__ = {
"_edit_use_anchors_": false
}

[node name="Label" type="Label" parent="TopBar/HBoxContainer"]
margin_right = 232.0
margin_bottom = 24.0
size_flags_horizontal = 3
size_flags_vertical = 7
custom_fonts/font = SubResource( 2 )
text = "Inventory"
valign = 1

[node name="Button" type="Button" parent="TopBar/HBoxContainer"]
margin_left = 236.0
margin_right = 256.0
margin_bottom = 24.0
size_flags_vertical = 3
text = "X"

[node name="SlotsContainer" type="ScrollContainer" parent="."]
anchor_right = 1.0
anchor_bottom = 1.0
margin_top = 24.0
scroll_horizontal_enabled = false
__meta__ = {
"_edit_use_anchors_": false
}

[node name="Slots" type="GridContainer" parent="SlotsContainer"]
margin_right = 256.0
margin_bottom = 232.0
size_flags_horizontal = 3
size_flags_vertical = 3
custom_constants/vseparation = 1
custom_constants/hseparation = 1
columns = 8
