[gd_scene load_steps=3 format=2]

[ext_resource path="res://actors/Enemies/Enemy.tscn" type="PackedScene" id=1]
[ext_resource path="res://actors/Enemies/MediumDemon/MediumDemon.gd" type="Script" id=2]

[node name="MediumDemon" instance=ExtResource( 1 )]
script = ExtResource( 2 )
base_max_health = 300.0
base_max_shield = 100.0
base_interrupt_armor = 2
experience_on_death = 2

[node name="CollisionShape2D" parent="." index="0"]
position = Vector2( 0, 7 )

[node name="CollisionBoxSprite" parent="CollisionShape2D" index="0"]
rotation = 1.5708

[node name="ActorSprite" parent="." index="1"]
region_rect = Rect2( 435, 330, 11, 23 )

[node name="SmallShotTimer" type="Timer" parent="." index="11"]
wait_time = 0.75
autostart = true

[node name="FrontSwingTimer" type="Timer" parent="." index="15"]
wait_time = 2.0
autostart = true
[connection signal="timeout" from="SmallShotTimer" to="." method="_on_SmallShotTimer_timeout"]
[connection signal="timeout" from="FrontSwingTimer" to="." method="_on_FrontSwingTimer_timeout"]
