[gd_scene load_steps=6 format=2]

[ext_resource path="res://Assets/img/0x72_DungeonTilesetII_v1.3.png" type="Texture" id=1]
[ext_resource path="res://Scenes/SupportScenes/SmallDemon.gd" type="Script" id=2]

[sub_resource type="CircleShape2D" id=1]
radius = 7.0

[sub_resource type="StyleBoxFlat" id=2]
bg_color = Color( 1, 0, 0, 1 )

[sub_resource type="StyleBoxFlat" id=3]
bg_color = Color( 1, 0, 0, 0.258824 )

[node name="SmallDemon" type="KinematicBody2D"]
collision_layer = 2
script = ExtResource( 2 )

[node name="Sprite" type="Sprite" parent="."]
texture = ExtResource( 1 )
region_enabled = true
region_rect = Rect2( 371, 334, 11, 18 )

[node name="CollisionShape2D" type="CollisionShape2D" parent="."]
position = Vector2( 0, 5 )
shape = SubResource( 1 )

[node name="Bar" type="Node2D" parent="."]

[node name="HealthBar" type="ProgressBar" parent="Bar"]
margin_left = -31.0
margin_top = -19.0
margin_right = 31.0
margin_bottom = -15.0
custom_styles/fg = SubResource( 2 )
custom_styles/bg = SubResource( 3 )
value = 50.0
__meta__ = {
"_edit_use_anchors_": false
}

[node name="Tween" type="Tween" parent="Bar/HealthBar"]

[node name="DeadTimer" type="Timer" parent="."]
wait_time = 2.0
one_shot = true
[connection signal="timeout" from="DeadTimer" to="." method="_on_DeadTimer_timeout"]
