[gd_scene load_steps=73 format=2]

[ext_resource path="res://level/Battlefield/BattlefieldTemplate.tscn" type="PackedScene" id=1]
[ext_resource path="res://level/Battlefield/Tutorial/TutorialBattlefield.gd" type="Script" id=2]
[ext_resource path="res://level/Battlefield/CollectibleResource.tscn" type="PackedScene" id=3]
[ext_resource path="res://assets/img/level/snow/bg.png" type="Texture" id=4]
[ext_resource path="res://assets/img/level/snow/roads1.tres" type="TileSet" id=5]
[ext_resource path="res://assets/img/level/snow/land_17.png" type="Texture" id=6]
[ext_resource path="res://assets/img/level/snow/land_16.png" type="Texture" id=7]
[ext_resource path="res://assets/img/level/snow/land_11.png" type="Texture" id=8]
[ext_resource path="res://assets/img/level/snow/land_3.png" type="Texture" id=9]
[ext_resource path="res://assets/img/level/snow/land_14.png" type="Texture" id=10]
[ext_resource path="res://assets/img/level/snow/land_18.png" type="Texture" id=11]
[ext_resource path="res://assets/img/level/snow/land_1.png" type="Texture" id=12]
[ext_resource path="res://assets/img/level/snow/land_5.png" type="Texture" id=13]
[ext_resource path="res://assets/img/level/snow/land_2.png" type="Texture" id=14]
[ext_resource path="res://assets/img/level/snow/land_9.png" type="Texture" id=15]
[ext_resource path="res://assets/img/level/snow/land_7.png" type="Texture" id=16]
[ext_resource path="res://assets/img/level/snow/land_10.png" type="Texture" id=17]
[ext_resource path="res://assets/img/level/snow/land_12.png" type="Texture" id=18]
[ext_resource path="res://assets/img/level/snow/land_15.png" type="Texture" id=19]
[ext_resource path="res://assets/img/level/snow/land_6.png" type="Texture" id=20]
[ext_resource path="res://assets/img/level/snow/tree_8.png" type="Texture" id=21]
[ext_resource path="res://assets/img/level/snow/tree_4.png" type="Texture" id=22]
[ext_resource path="res://assets/img/level/snow/tree_7.png" type="Texture" id=23]
[ext_resource path="res://assets/img/level/snow/tree_5.png" type="Texture" id=24]
[ext_resource path="res://assets/img/level/snow/tree_9.png" type="Texture" id=25]
[ext_resource path="res://assets/img/level/snow/tree_6.png" type="Texture" id=26]
[ext_resource path="res://assets/img/level/snow/greenery_2.png" type="Texture" id=27]
[ext_resource path="res://assets/img/level/snow/greenery_3.png" type="Texture" id=28]
[ext_resource path="res://assets/img/level/snow/greeneries.tres" type="TileSet" id=29]
[ext_resource path="res://assets/img/level/snow/greenery_8.png" type="Texture" id=30]
[ext_resource path="res://assets/img/level/snow/greenery_9.png" type="Texture" id=31]
[ext_resource path="res://assets/img/level/snow/stones_1.png" type="Texture" id=32]
[ext_resource path="res://assets/img/level/snow/stones_2.png" type="Texture" id=33]
[ext_resource path="res://assets/img/level/snow/greenery_1.png" type="Texture" id=34]
[ext_resource path="res://assets/img/level/snow/stones_3.png" type="Texture" id=35]
[ext_resource path="res://assets/img/level/snow/greenery_4.png" type="Texture" id=36]
[ext_resource path="res://assets/img/level/snow/greenery_5.png" type="Texture" id=37]
[ext_resource path="res://assets/img/level/snow/greenery_7.png" type="Texture" id=38]
[ext_resource path="res://assets/img/level/snow/tree_11.png" type="Texture" id=39]
[ext_resource path="res://assets/img/level/snow/tree_10.png" type="Texture" id=40]
[ext_resource path="res://assets/img/level/snow/tree_15.png" type="Texture" id=41]
[ext_resource path="res://assets/img/level/snow/tree_3.png" type="Texture" id=42]
[ext_resource path="res://assets/img/level/snow/tree_13.png" type="Texture" id=43]
[ext_resource path="res://assets/img/level/snow/tree_1.png" type="Texture" id=44]
[ext_resource path="res://assets/img/level/snow/tree_14.png" type="Texture" id=45]
[ext_resource path="res://assets/img/level/snow/stones_4.png" type="Texture" id=46]
[ext_resource path="res://assets/img/level/snow/tree_2.png" type="Texture" id=47]
[ext_resource path="res://assets/img/level/snow/stones_7.png" type="Texture" id=48]
[ext_resource path="res://assets/img/level/snow/stones_5.png" type="Texture" id=49]
[ext_resource path="res://assets/img/level/snow/tree_12.png" type="Texture" id=50]
[ext_resource path="res://assets/img/level/snow/stones_6.png" type="Texture" id=51]
[ext_resource path="res://assets/img/GUI/Cloud_03.png" type="Texture" id=52]
[ext_resource path="res://assets/font/StrenuousBL52.tres" type="DynamicFont" id=53]
[ext_resource path="res://level/Battlefield/Tutorial/WinGUI.tscn" type="PackedScene" id=54]
[ext_resource path="res://assets/font/strenuous bl.ttf" type="DynamicFontData" id=55]
[ext_resource path="res://assets/shader/WindTree.tres" type="Material" id=56]
[ext_resource path="res://assets/img/GUI/5 copy.png" type="Texture" id=57]
[ext_resource path="res://addons/GodotTIE/text_interface_engine.gd" type="Script" id=58]
[ext_resource path="res://assets/shader/PortraitHologram.tres" type="Material" id=59]
[ext_resource path="res://assets/img/level/snow/river.tres" type="TileSet" id=60]
[ext_resource path="res://assets/img/level/snow/trees.tres" type="TileSet" id=61]

[sub_resource type="Curve2D" id=1]
_data = {
"points": PoolVector2Array( 0, 0, 0, 0, 1488, 24, 45.2409, 0, -45.2409, 0, 1288, 56, 56.3527, 0, -56.3527, 0, 992, 64, 34.4774, 22.3697, -34.4774, -22.3697, 720, 64, 65.0834, -0.7937, -65.0834, 0.7937, 616, -16, 39.3778, -28.0316, -39.3778, 28.0316, 352, -8, 34.1291, 11.9055, -34.1291, -11.9055, 192, 0, 37.3039, 51.5905, -37.3039, -51.5905, 143.893, -130.686, 26.1921, -26.9858, -26.1921, 26.9858, -105.329, -148.147, 2.3811, -42.8598, -2.3811, 42.8598, -206.923, -5.28101, -26.1921, -28.5732, 26.1921, 28.5732, -167.238, 129.648, -54.7653, 1.5874, 54.7653, -1.5874, -0.855713, 192.018 )
}

[sub_resource type="Curve2D" id=2]
_data = {
"points": PoolVector2Array( -31, 1.75, 31, -1.75, 0.728424, 191.816, -35.5382, 40.2797, 35.5382, -40.2797, 145.363, 135.476, -0.75, 28.75, 0.75, -28.75, 167.226, 9.34174, 27.8443, 31.6198, -27.8443, -31.6198, 143.681, -126.043, 50.9692, 0, -50.9692, 0, -0.953247, -168.087, 25.9565, -43.4182, -25.9565, 43.4182, -140.542, -117.634, 0, -49.5534, 0, 49.5534, -173.337, -2.43076, -35.8672, -34.4514, 35.8672, 34.4514, -134.656, 153.135, -48, 3, 48, -3, -0.462494, 191.787 )
}

[sub_resource type="TileSet" id=3]
0/name = "bg.png 0"
0/texture = ExtResource( 4 )
0/tex_offset = Vector2( 0, 0 )
0/modulate = Color( 1, 1, 1, 1 )
0/region = Rect2( 0, 0, 256, 256 )
0/tile_mode = 0
0/occluder_offset = Vector2( 0, 0 )
0/navigation_offset = Vector2( 0, 0 )
0/shape_offset = Vector2( 0, 0 )
0/shape_transform = Transform2D( 1, 0, 0, 1, 0, 0 )
0/shape_one_way = false
0/shape_one_way_margin = 0.0
0/shapes = [  ]
0/z_index = 0

[sub_resource type="TileSet" id=4]
0/name = "land_1.png 0"
0/texture = ExtResource( 12 )
0/tex_offset = Vector2( 0, 0 )
0/modulate = Color( 1, 1, 1, 1 )
0/region = Rect2( 0, 0, 256, 256 )
0/tile_mode = 0
0/occluder_offset = Vector2( 0, 0 )
0/navigation_offset = Vector2( 0, 0 )
0/shape_offset = Vector2( 0, 0 )
0/shape_transform = Transform2D( 1, 0, 0, 1, 0, 0 )
0/shape_one_way = false
0/shape_one_way_margin = 0.0
0/shapes = [  ]
0/z_index = 0
1/name = "land_2.png 1"
1/texture = ExtResource( 14 )
1/tex_offset = Vector2( 0, 0 )
1/modulate = Color( 1, 1, 1, 1 )
1/region = Rect2( 0, 0, 256, 256 )
1/tile_mode = 0
1/occluder_offset = Vector2( 0, 0 )
1/navigation_offset = Vector2( 0, 0 )
1/shape_offset = Vector2( 0, 0 )
1/shape_transform = Transform2D( 1, 0, 0, 1, 0, 0 )
1/shape_one_way = false
1/shape_one_way_margin = 0.0
1/shapes = [  ]
1/z_index = 0
2/name = "land_3.png 2"
2/texture = ExtResource( 9 )
2/tex_offset = Vector2( 0, 0 )
2/modulate = Color( 1, 1, 1, 1 )
2/region = Rect2( 0, 0, 256, 256 )
2/tile_mode = 0
2/occluder_offset = Vector2( 0, 0 )
2/navigation_offset = Vector2( 0, 0 )
2/shape_offset = Vector2( 0, 0 )
2/shape_transform = Transform2D( 1, 0, 0, 1, 0, 0 )
2/shape_one_way = false
2/shape_one_way_margin = 0.0
2/shapes = [  ]
2/z_index = 0
3/name = "land_5.png 3"
3/texture = ExtResource( 13 )
3/tex_offset = Vector2( 0, 0 )
3/modulate = Color( 1, 1, 1, 1 )
3/region = Rect2( 0, 0, 256, 256 )
3/tile_mode = 0
3/occluder_offset = Vector2( 0, 0 )
3/navigation_offset = Vector2( 0, 0 )
3/shape_offset = Vector2( 0, 0 )
3/shape_transform = Transform2D( 1, 0, 0, 1, 0, 0 )
3/shape_one_way = false
3/shape_one_way_margin = 0.0
3/shapes = [  ]
3/z_index = 0
4/name = "land_6.png 4"
4/texture = ExtResource( 20 )
4/tex_offset = Vector2( 0, 0 )
4/modulate = Color( 1, 1, 1, 1 )
4/region = Rect2( 0, 0, 256, 256 )
4/tile_mode = 0
4/occluder_offset = Vector2( 0, 0 )
4/navigation_offset = Vector2( 0, 0 )
4/shape_offset = Vector2( 0, 0 )
4/shape_transform = Transform2D( 1, 0, 0, 1, 0, 0 )
4/shape_one_way = false
4/shape_one_way_margin = 0.0
4/shapes = [  ]
4/z_index = 0
5/name = "land_7.png 5"
5/texture = ExtResource( 16 )
5/tex_offset = Vector2( 0, 0 )
5/modulate = Color( 1, 1, 1, 1 )
5/region = Rect2( 0, 0, 256, 256 )
5/tile_mode = 0
5/occluder_offset = Vector2( 0, 0 )
5/navigation_offset = Vector2( 0, 0 )
5/shape_offset = Vector2( 0, 0 )
5/shape_transform = Transform2D( 1, 0, 0, 1, 0, 0 )
5/shape_one_way = false
5/shape_one_way_margin = 0.0
5/shapes = [  ]
5/z_index = 0
6/name = "land_9.png 6"
6/texture = ExtResource( 15 )
6/tex_offset = Vector2( 0, 0 )
6/modulate = Color( 1, 1, 1, 1 )
6/region = Rect2( 0, 0, 256, 256 )
6/tile_mode = 0
6/occluder_offset = Vector2( 0, 0 )
6/navigation_offset = Vector2( 0, 0 )
6/shape_offset = Vector2( 0, 0 )
6/shape_transform = Transform2D( 1, 0, 0, 1, 0, 0 )
6/shape_one_way = false
6/shape_one_way_margin = 0.0
6/shapes = [  ]
6/z_index = 0
7/name = "land_10.png 7"
7/texture = ExtResource( 17 )
7/tex_offset = Vector2( 0, 0 )
7/modulate = Color( 1, 1, 1, 1 )
7/region = Rect2( 0, 0, 256, 256 )
7/tile_mode = 0
7/occluder_offset = Vector2( 0, 0 )
7/navigation_offset = Vector2( 0, 0 )
7/shape_offset = Vector2( 0, 0 )
7/shape_transform = Transform2D( 1, 0, 0, 1, 0, 0 )
7/shape_one_way = false
7/shape_one_way_margin = 0.0
7/shapes = [  ]
7/z_index = 0
8/name = "land_11.png 8"
8/texture = ExtResource( 8 )
8/tex_offset = Vector2( 0, 0 )
8/modulate = Color( 1, 1, 1, 1 )
8/region = Rect2( 0, 0, 256, 256 )
8/tile_mode = 0
8/occluder_offset = Vector2( 0, 0 )
8/navigation_offset = Vector2( 0, 0 )
8/shape_offset = Vector2( 0, 0 )
8/shape_transform = Transform2D( 1, 0, 0, 1, 0, 0 )
8/shape_one_way = false
8/shape_one_way_margin = 0.0
8/shapes = [  ]
8/z_index = 0
9/name = "land_12.png 9"
9/texture = ExtResource( 18 )
9/tex_offset = Vector2( 0, 0 )
9/modulate = Color( 1, 1, 1, 1 )
9/region = Rect2( 0, 0, 256, 256 )
9/tile_mode = 0
9/occluder_offset = Vector2( 0, 0 )
9/navigation_offset = Vector2( 0, 0 )
9/shape_offset = Vector2( 0, 0 )
9/shape_transform = Transform2D( 1, 0, 0, 1, 0, 0 )
9/shape_one_way = false
9/shape_one_way_margin = 0.0
9/shapes = [  ]
9/z_index = 0
10/name = "land_14.png 10"
10/texture = ExtResource( 10 )
10/tex_offset = Vector2( 0, 0 )
10/modulate = Color( 1, 1, 1, 1 )
10/region = Rect2( 0, 0, 256, 256 )
10/tile_mode = 0
10/occluder_offset = Vector2( 0, 0 )
10/navigation_offset = Vector2( 0, 0 )
10/shape_offset = Vector2( 0, 0 )
10/shape_transform = Transform2D( 1, 0, 0, 1, 0, 0 )
10/shape_one_way = false
10/shape_one_way_margin = 0.0
10/shapes = [  ]
10/z_index = 0
11/name = "land_15.png 11"
11/texture = ExtResource( 19 )
11/tex_offset = Vector2( 0, 0 )
11/modulate = Color( 1, 1, 1, 1 )
11/region = Rect2( 0, 0, 256, 256 )
11/tile_mode = 0
11/occluder_offset = Vector2( 0, 0 )
11/navigation_offset = Vector2( 0, 0 )
11/shape_offset = Vector2( 0, 0 )
11/shape_transform = Transform2D( 1, 0, 0, 1, 0, 0 )
11/shape_one_way = false
11/shape_one_way_margin = 0.0
11/shapes = [  ]
11/z_index = 0
12/name = "land_16.png 12"
12/texture = ExtResource( 7 )
12/tex_offset = Vector2( 0, 0 )
12/modulate = Color( 1, 1, 1, 1 )
12/region = Rect2( 0, 0, 256, 256 )
12/tile_mode = 0
12/occluder_offset = Vector2( 0, 0 )
12/navigation_offset = Vector2( 0, 0 )
12/shape_offset = Vector2( 0, 0 )
12/shape_transform = Transform2D( 1, 0, 0, 1, 0, 0 )
12/shape_one_way = false
12/shape_one_way_margin = 0.0
12/shapes = [  ]
12/z_index = 0
13/name = "land_17.png 13"
13/texture = ExtResource( 6 )
13/tex_offset = Vector2( 0, 0 )
13/modulate = Color( 1, 1, 1, 1 )
13/region = Rect2( 0, 0, 256, 256 )
13/tile_mode = 0
13/occluder_offset = Vector2( 0, 0 )
13/navigation_offset = Vector2( 0, 0 )
13/shape_offset = Vector2( 0, 0 )
13/shape_transform = Transform2D( 1, 0, 0, 1, 0, 0 )
13/shape_one_way = false
13/shape_one_way_margin = 0.0
13/shapes = [  ]
13/z_index = 0
14/name = "land_18.png 14"
14/texture = ExtResource( 11 )
14/tex_offset = Vector2( 0, 0 )
14/modulate = Color( 1, 1, 1, 1 )
14/region = Rect2( 0, 0, 256, 256 )
14/tile_mode = 0
14/occluder_offset = Vector2( 0, 0 )
14/navigation_offset = Vector2( 0, 0 )
14/shape_offset = Vector2( 0, 0 )
14/shape_transform = Transform2D( 1, 0, 0, 1, 0, 0 )
14/shape_one_way = false
14/shape_one_way_margin = 0.0
14/shapes = [  ]
14/z_index = 0

[sub_resource type="GDScript" id=5]
script/source = "extends Camera2D

const SHAKE_EXPONENT := 1.8

export var decay_rate := 1.0
export var max_offset := Vector2(100.0, 100.0)
export var max_rotation := 0.1

export var shake_amount := 0.0 setget set_shake_amount
var noise_y := 0.0

onready var noise := OpenSimplexNoise.new()

# Called when the node enters the scene tree for the first time.
func _ready():
	set_physics_process(false)
	
	randomize()
	noise.seed = randi()
	noise.period = 4
	noise.octaves = 2
	
	EventBus.connect(\"shake_camera\", self, \"set_shake_amount\")
	pass # Replace with function body.


# Called every frame. 'delta' is the elapsed time since the previous frame.
func _physics_process(delta):
	self.shake_amount -= 1 * delta
	shake()
	
func shake():
	var amount := pow(shake_amount, 1)

	noise_y += 1.0
	rotation = max_rotation * amount * noise.get_noise_2d(noise.seed, noise_y)
	offset = Vector2(
		max_offset.x * amount * noise.get_noise_2d(noise.seed * 2, noise_y),
		max_offset.y * amount * noise.get_noise_2d(noise.seed * 3, noise_y)
	)


func set_shake_amount(value):
	if not is_inside_tree():
		yield(self, \"ready\")
	shake_amount = clamp(value, 0.0, 1.0)
	set_physics_process(shake_amount != 0.0)

"

[sub_resource type="DynamicFont" id=6]
size = 48
outline_size = 1
outline_color = Color( 0, 0, 0, 1 )
use_filter = true
font_data = ExtResource( 55 )

[sub_resource type="Gradient" id=7]
offsets = PoolRealArray( 0, 0.546219, 1 )
colors = PoolColorArray( 0, 1, 0.423529, 0.196078, 0, 1, 0.422852, 0.729412, 0, 1, 0.423529, 0.196078 )

[sub_resource type="GradientTexture" id=8]
gradient = SubResource( 7 )

[sub_resource type="ParticlesMaterial" id=9]
flag_disable_z = true
gravity = Vector3( 0, 0, 0 )
orbit_velocity = 0.0
orbit_velocity_random = 0.0
angle = 90.0
scale = 160.0
color_ramp = SubResource( 8 )

[sub_resource type="Gradient" id=10]
colors = PoolColorArray( 0.211765, 0.533333, 0.447059, 0.654902, 0.211765, 0.533333, 0.447059, 0.654902 )

[sub_resource type="GradientTexture" id=11]
gradient = SubResource( 10 )
width = 2

[node name="BattleField" instance=ExtResource( 1 )]
script = ExtResource( 2 )
max_zoom = 1.0

[node name="Path2D" type="Path2D" parent="." index="1"]
z_index = 1
curve = SubResource( 1 )

[node name="CircularPath" type="Path2D" parent="." index="2"]
z_index = 1
curve = SubResource( 2 )

[node name="Background" type="TileMap" parent="Ground" index="0"]
scale = Vector2( 0.25, 0.25 )
z_index = -1
tile_set = SubResource( 3 )
cell_size = Vector2( 256, 256 )
format = 1
tile_data = PoolIntArray( -655376, 0, 0, -655375, 0, 0, -655374, 0, 0, -655373, 0, 0, -655372, 0, 0, -655371, 0, 0, -655370, 0, 0, -655369, 0, 0, -655368, 0, 0, -655367, 0, 0, -655366, 0, 0, -655365, 0, 0, -655364, 0, 0, -655363, 0, 0, -655362, 0, 0, -655361, 0, 0, -720896, 0, 0, -720895, 0, 0, -720894, 0, 0, -720893, 0, 0, -720892, 0, 0, -720891, 0, 0, -720890, 0, 0, -720889, 0, 0, -720888, 0, 0, -720887, 0, 0, -720886, 0, 0, -720885, 0, 0, -720884, 0, 0, -720883, 0, 0, -720882, 0, 0, -720881, 0, 0, -720880, 0, 0, -720879, 0, 0, -589840, 0, 0, -589839, 0, 0, -589838, 0, 0, -589837, 0, 0, -589836, 0, 0, -589835, 0, 0, -589834, 0, 0, -589833, 0, 0, -589832, 0, 0, -589831, 0, 0, -589830, 0, 0, -589829, 0, 0, -589828, 0, 0, -589827, 0, 0, -589826, 0, 0, -589825, 0, 0, -655360, 0, 0, -655359, 0, 0, -655358, 0, 0, -655357, 0, 0, -655356, 0, 0, -655355, 0, 0, -655354, 0, 0, -655353, 0, 0, -655352, 0, 0, -655351, 0, 0, -655350, 0, 0, -655349, 0, 0, -655348, 0, 0, -655347, 0, 0, -655346, 0, 0, -655345, 0, 0, -655344, 0, 0, -655343, 0, 0, -524304, 0, 0, -524303, 0, 0, -524302, 0, 0, -524301, 0, 0, -524300, 0, 0, -524299, 0, 0, -524298, 0, 0, -524297, 0, 0, -524296, 0, 0, -524295, 0, 0, -524294, 0, 0, -524293, 0, 0, -524292, 0, 0, -524291, 0, 0, -524290, 0, 0, -524289, 0, 0, -589824, 0, 0, -589823, 0, 0, -589822, 0, 0, -589821, 0, 0, -589820, 0, 0, -589819, 0, 0, -589818, 0, 0, -589817, 0, 0, -589816, 0, 0, -589815, 0, 0, -589814, 0, 0, -589813, 0, 0, -589812, 0, 0, -589811, 0, 0, -589810, 0, 0, -589809, 0, 0, -589808, 0, 0, -589807, 0, 0, -458768, 0, 0, -458767, 0, 0, -458766, 0, 0, -458765, 0, 0, -458764, 0, 0, -458763, 0, 0, -458762, 0, 0, -458761, 0, 0, -458760, 0, 0, -458759, 0, 0, -458758, 0, 0, -458757, 0, 0, -458756, 0, 0, -458755, 0, 0, -458754, 0, 0, -458753, 0, 0, -524288, 0, 0, -524287, 0, 0, -524286, 0, 0, -524285, 0, 0, -524284, 0, 0, -524283, 0, 0, -524282, 0, 0, -524281, 0, 0, -524280, 0, 0, -524279, 0, 0, -524278, 0, 0, -524277, 0, 0, -524276, 0, 0, -524275, 0, 0, -524274, 0, 0, -524273, 0, 0, -524272, 0, 0, -524271, 0, 0, -393232, 0, 0, -393231, 0, 0, -393230, 0, 0, -393229, 0, 0, -393228, 0, 0, -393227, 0, 0, -393226, 0, 0, -393225, 0, 0, -393224, 0, 0, -393223, 0, 0, -393222, 0, 0, -393221, 0, 0, -393220, 0, 0, -393219, 0, 0, -393218, 0, 0, -393217, 0, 0, -458752, 0, 0, -458751, 0, 0, -458750, 0, 0, -458749, 0, 0, -458748, 0, 0, -458747, 0, 0, -458746, 0, 0, -458745, 0, 0, -458744, 0, 0, -458743, 0, 0, -458742, 0, 0, -458741, 0, 0, -458740, 0, 0, -458739, 0, 0, -458738, 0, 0, -458737, 0, 0, -458736, 0, 0, -458735, 0, 0, -327696, 0, 0, -327695, 0, 0, -327694, 0, 0, -327693, 0, 0, -327692, 0, 0, -327691, 0, 0, -327690, 0, 0, -327689, 0, 0, -327688, 0, 0, -327687, 0, 0, -327686, 0, 0, -327685, 0, 0, -327684, 0, 0, -327683, 0, 0, -327682, 0, 0, -327681, 0, 0, -393216, 0, 0, -393215, 0, 0, -393214, 0, 0, -393213, 0, 0, -393212, 0, 0, -393211, 0, 0, -393210, 0, 0, -393209, 0, 0, -393208, 0, 0, -393207, 0, 0, -393206, 0, 0, -393205, 0, 0, -393204, 0, 0, -393203, 0, 0, -393202, 0, 0, -393201, 0, 0, -393200, 0, 0, -393199, 0, 0, -262160, 0, 0, -262159, 0, 0, -262158, 0, 0, -262157, 0, 0, -262156, 0, 0, -262155, 0, 0, -262154, 0, 0, -262153, 0, 0, -262152, 0, 0, -262151, 0, 0, -262150, 0, 0, -262149, 0, 0, -262148, 0, 0, -262147, 0, 0, -262146, 0, 0, -262145, 0, 0, -327680, 0, 0, -327679, 0, 0, -327678, 0, 0, -327677, 0, 0, -327676, 0, 0, -327675, 0, 0, -327674, 0, 0, -327673, 0, 0, -327672, 0, 0, -327671, 0, 0, -327670, 0, 0, -327669, 0, 0, -327668, 0, 0, -327667, 0, 0, -327666, 0, 0, -327665, 0, 0, -327664, 0, 0, -327663, 0, 0, -196624, 0, 0, -196623, 0, 0, -196622, 0, 0, -196621, 0, 0, -196620, 0, 0, -196619, 0, 0, -196618, 0, 0, -196617, 0, 0, -196616, 0, 0, -196615, 0, 0, -196614, 0, 0, -196613, 0, 0, -196612, 0, 0, -196611, 0, 0, -196610, 0, 0, -196609, 0, 0, -262144, 0, 0, -262143, 0, 0, -262142, 0, 0, -262141, 0, 0, -262140, 0, 0, -262139, 0, 0, -262138, 0, 0, -262137, 0, 0, -262136, 0, 0, -262135, 0, 0, -262134, 0, 0, -262133, 0, 0, -262132, 0, 0, -262131, 0, 0, -262130, 0, 0, -262129, 0, 0, -262128, 0, 0, -262127, 0, 0, -131088, 0, 0, -131087, 0, 0, -131086, 0, 0, -131085, 0, 0, -131084, 0, 0, -131083, 0, 0, -131082, 0, 0, -131081, 0, 0, -131080, 0, 0, -131079, 0, 0, -131078, 0, 0, -131077, 0, 0, -131076, 0, 0, -131075, 0, 0, -131074, 0, 0, -131073, 0, 0, -196608, 0, 0, -196607, 0, 0, -196606, 0, 0, -196605, 0, 0, -196604, 0, 0, -196603, 0, 0, -196602, 0, 0, -196601, 0, 0, -196600, 0, 0, -196599, 0, 0, -196598, 0, 0, -196597, 0, 0, -196596, 0, 0, -196595, 0, 0, -196594, 0, 0, -196593, 0, 0, -196592, 0, 0, -196591, 0, 0, -65552, 0, 0, -65551, 0, 0, -65550, 0, 0, -65549, 0, 0, -65548, 0, 0, -65547, 0, 0, -65546, 0, 0, -65545, 0, 0, -65544, 0, 0, -65543, 0, 0, -65542, 0, 0, -65541, 0, 0, -65540, 0, 0, -65539, 0, 0, -65538, 0, 0, -65537, 0, 0, -131072, 0, 0, -131071, 0, 0, -131070, 0, 0, -131069, 0, 0, -131068, 0, 0, -131067, 0, 0, -131066, 0, 0, -131065, 0, 0, -131064, 0, 0, -131063, 0, 0, -131062, 0, 0, -131061, 0, 0, -131060, 0, 0, -131059, 0, 0, -131058, 0, 0, -131057, 0, 0, -131056, 0, 0, -131055, 0, 0, -16, 0, 0, -15, 0, 0, -14, 0, 0, -13, 0, 0, -12, 0, 0, -11, 0, 0, -10, 0, 0, -9, 0, 0, -8, 0, 0, -7, 0, 0, -6, 0, 0, -5, 0, 0, -4, 0, 0, -3, 0, 0, -2, 0, 0, -1, 0, 0, -65536, 0, 0, -65535, 0, 0, -65534, 0, 0, -65533, 0, 0, -65532, 0, 0, -65531, 0, 0, -65530, 0, 0, -65529, 0, 0, -65528, 0, 0, -65527, 0, 0, -65526, 0, 0, -65525, 0, 0, -65524, 0, 0, -65523, 0, 0, -65522, 0, 0, -65521, 0, 0, -65520, 0, 0, -65519, 0, 0, 65520, 0, 0, 65521, 0, 0, 65522, 0, 0, 65523, 0, 0, 65524, 0, 0, 65525, 0, 0, 65526, 0, 0, 65527, 0, 0, 65528, 0, 0, 65529, 0, 0, 65530, 0, 0, 65531, 0, 0, 65532, 0, 0, 65533, 0, 0, 65534, 0, 0, 65535, 0, 0, 0, 0, 0, 1, 0, 0, 2, 0, 0, 3, 0, 0, 4, 0, 0, 5, 0, 0, 6, 0, 0, 7, 0, 0, 8, 0, 0, 9, 0, 0, 10, 0, 0, 11, 0, 0, 12, 0, 0, 13, 0, 0, 14, 0, 0, 15, 0, 0, 16, 0, 0, 17, 0, 0, 131056, 0, 0, 131057, 0, 0, 131058, 0, 0, 131059, 0, 0, 131060, 0, 0, 131061, 0, 0, 131062, 0, 0, 131063, 0, 0, 131064, 0, 0, 131065, 0, 0, 131066, 0, 0, 131067, 0, 0, 131068, 0, 0, 131069, 0, 0, 131070, 0, 0, 131071, 0, 0, 65536, 0, 0, 65537, 0, 0, 65538, 0, 0, 65539, 0, 0, 65540, 0, 0, 65541, 0, 0, 65542, 0, 0, 65543, 0, 0, 65544, 0, 0, 65545, 0, 0, 65546, 0, 0, 65547, 0, 0, 65548, 0, 0, 65549, 0, 0, 65550, 0, 0, 65551, 0, 0, 65552, 0, 0, 65553, 0, 0, 196592, 0, 0, 196593, 0, 0, 196594, 0, 0, 196595, 0, 0, 196596, 0, 0, 196597, 0, 0, 196598, 0, 0, 196599, 0, 0, 196600, 0, 0, 196601, 0, 0, 196602, 0, 0, 196603, 0, 0, 196604, 0, 0, 196605, 0, 0, 196606, 0, 0, 196607, 0, 0, 131072, 0, 0, 131073, 0, 0, 131074, 0, 0, 131075, 0, 0, 131076, 0, 0, 131077, 0, 0, 131078, 0, 0, 131079, 0, 0, 131080, 0, 0, 131081, 0, 0, 131082, 0, 0, 131083, 0, 0, 131084, 0, 0, 131085, 0, 0, 131086, 0, 0, 131087, 0, 0, 131088, 0, 0, 131089, 0, 0, 131090, 0, 0, 262128, 0, 0, 262129, 0, 0, 262130, 0, 0, 262131, 0, 0, 262132, 0, 0, 262133, 0, 0, 262134, 0, 0, 262135, 0, 0, 262136, 0, 0, 262137, 0, 0, 262138, 0, 0, 262139, 0, 0, 262140, 0, 0, 262141, 0, 0, 262142, 0, 0, 262143, 0, 0, 196608, 0, 0, 196609, 0, 0, 196610, 0, 0, 196611, 0, 0, 196612, 0, 0, 196613, 0, 0, 196614, 0, 0, 196615, 0, 0, 196616, 0, 0, 196617, 0, 0, 196618, 0, 0, 196619, 0, 0, 196620, 0, 0, 196621, 0, 0, 196622, 0, 0, 196623, 0, 0, 196624, 0, 0, 196625, 0, 0, 196626, 0, 0, 327664, 0, 0, 327665, 0, 0, 327666, 0, 0, 327667, 0, 0, 327668, 0, 0, 327669, 0, 0, 327670, 0, 0, 327671, 0, 0, 327672, 0, 0, 327673, 0, 0, 327674, 0, 0, 327675, 0, 0, 327676, 0, 0, 327677, 0, 0, 327678, 0, 0, 327679, 0, 0, 262144, 0, 0, 262145, 0, 0, 262146, 0, 0, 262147, 0, 0, 262148, 0, 0, 262149, 0, 0, 262150, 0, 0, 262151, 0, 0, 262152, 0, 0, 262153, 0, 0, 262154, 0, 0, 262155, 0, 0, 262156, 0, 0, 262157, 0, 0, 262158, 0, 0, 262159, 0, 0, 262160, 0, 0, 262161, 0, 0, 393200, 0, 0, 393201, 0, 0, 393202, 0, 0, 393203, 0, 0, 393204, 0, 0, 393205, 0, 0, 393206, 0, 0, 393207, 0, 0, 393208, 0, 0, 393209, 0, 0, 393210, 0, 0, 393211, 0, 0, 393212, 0, 0, 393213, 0, 0, 393214, 0, 0, 393215, 0, 0, 327680, 0, 0, 327681, 0, 0, 327682, 0, 0, 327683, 0, 0, 327684, 0, 0, 327685, 0, 0, 327686, 0, 0, 327687, 0, 0, 327688, 0, 0, 327689, 0, 0, 327690, 0, 0, 327691, 0, 0, 327692, 0, 0, 327693, 0, 0, 327694, 0, 0, 327695, 0, 0, 327696, 0, 0, 327697, 0, 0, 458736, 0, 0, 458737, 0, 0, 458738, 0, 0, 458739, 0, 0, 458740, 0, 0, 458741, 0, 0, 458742, 0, 0, 458743, 0, 0, 458744, 0, 0, 458745, 0, 0, 458746, 0, 0, 458747, 0, 0, 458748, 0, 0, 458749, 0, 0, 458750, 0, 0, 458751, 0, 0, 393216, 0, 0, 393217, 0, 0, 393218, 0, 0, 393219, 0, 0, 393220, 0, 0, 393221, 0, 0, 393222, 0, 0, 393223, 0, 0, 393224, 0, 0, 393225, 0, 0, 393226, 0, 0, 393227, 0, 0, 393228, 0, 0, 393229, 0, 0, 393230, 0, 0, 393231, 0, 0, 393232, 0, 0, 393233, 0, 0, 524272, 0, 0, 524273, 0, 0, 524274, 0, 0, 524275, 0, 0, 524276, 0, 0, 524277, 0, 0, 524278, 0, 0, 524279, 0, 0, 524280, 0, 0, 524281, 0, 0, 524282, 0, 0, 524283, 0, 0, 524284, 0, 0, 524285, 0, 0, 524286, 0, 0, 524287, 0, 0, 458752, 0, 0, 458753, 0, 0, 458754, 0, 0, 458755, 0, 0, 458756, 0, 0, 458757, 0, 0, 458758, 0, 0, 458759, 0, 0, 458760, 0, 0, 458761, 0, 0, 458762, 0, 0, 458763, 0, 0, 458764, 0, 0, 458765, 0, 0, 458766, 0, 0, 458767, 0, 0, 458768, 0, 0, 458769, 0, 0, 589808, 0, 0, 589809, 0, 0, 589810, 0, 0, 589811, 0, 0, 589812, 0, 0, 589813, 0, 0, 589814, 0, 0, 589815, 0, 0, 589816, 0, 0, 589817, 0, 0, 589818, 0, 0, 589819, 0, 0, 589820, 0, 0, 589821, 0, 0, 589822, 0, 0, 589823, 0, 0, 524288, 0, 0, 524289, 0, 0, 524290, 0, 0, 524291, 0, 0, 524292, 0, 0, 524293, 0, 0, 524294, 0, 0, 524295, 0, 0, 524296, 0, 0, 524297, 0, 0, 524298, 0, 0, 524299, 0, 0, 524300, 0, 0, 524301, 0, 0, 524302, 0, 0, 524303, 0, 0, 524304, 0, 0, 524305, 0, 0, 655344, 0, 0, 655345, 0, 0, 655346, 0, 0, 655347, 0, 0, 655348, 0, 0, 655349, 0, 0, 655350, 0, 0, 655351, 0, 0, 655352, 0, 0, 655353, 0, 0, 655354, 0, 0, 655355, 0, 0, 655356, 0, 0, 655357, 0, 0, 655358, 0, 0, 655359, 0, 0, 589824, 0, 0, 589825, 0, 0, 589826, 0, 0, 589827, 0, 0, 589828, 0, 0, 589829, 0, 0, 589830, 0, 0, 589831, 0, 0, 589832, 0, 0, 589833, 0, 0, 589834, 0, 0, 589835, 0, 0, 589836, 0, 0, 589837, 0, 0, 589838, 0, 0, 589839, 0, 0, 589840, 0, 0, 589841, 0, 0, 720880, 0, 0, 720881, 0, 0, 720882, 0, 0, 720883, 0, 0, 720884, 0, 0, 720885, 0, 0, 720886, 0, 0, 720887, 0, 0, 720888, 0, 0, 720889, 0, 0, 720890, 0, 0, 720891, 0, 0, 720892, 0, 0, 720893, 0, 0, 720894, 0, 0, 720895, 0, 0, 655360, 0, 0, 655361, 0, 0, 655362, 0, 0, 655363, 0, 0, 655364, 0, 0, 655365, 0, 0, 655366, 0, 0, 655367, 0, 0, 655368, 0, 0, 655369, 0, 0, 655370, 0, 0, 655371, 0, 0, 655372, 0, 0, 655373, 0, 0, 655374, 0, 0, 655375, 0, 0, 655376, 0, 0, 655377, 0, 0, 720908, 0, 0, 720909, 0, 0, 720910, 0, 0, 720911, 0, 0, 720912, 0, 0 )

[node name="Roads" type="TileMap" parent="Ground" index="1"]
z_index = -1
tile_set = ExtResource( 5 )
format = 1
tile_data = PoolIntArray( -131075, 0, 0, -131074, 1, 0, -131073, 1, 0, -196608, 1, 0, -196607, 1, 0, -196606, 2, 0, -65539, 3, 0, -65538, 4, 0, -65537, 4, 0, -131072, 4, 0, -131071, 4, 0, -131070, 5, 0, -3, 3, 0, -2, 4, 0, -1, 4, 0, -65536, 4, 0, -65535, 4, 0, -65534, 11, 0, -65533, 1, 0, -65532, 1, 0, -65531, 1, 0, -65530, 1, 0, -65529, 1, 0, -65528, 1, 0, -65527, 1, 0, -65526, 1, 0, -65525, 2, 0, 65533, 3, 0, 65534, 4, 0, 65535, 4, 0, 0, 4, 0, 1, 4, 0, 2, 9, 0, 3, 7, 0, 4, 7, 0, 5, 7, 0, 6, 7, 0, 7, 7, 0, 8, 7, 0, 9, 7, 0, 10, 10, 0, 11, 11, 0, 12, 1, 0, 13, 1, 0, 14, 1, 0, 15, 1, 0, 16, 1, 0, 17, 1, 0, 131069, 3, 0, 131070, 4, 0, 131071, 4, 0, 65536, 4, 0, 65537, 4, 0, 65538, 5, 0, 65546, 6, 0, 65547, 7, 0, 65548, 7, 0, 65549, 7, 0, 65550, 7, 0, 65551, 7, 0, 65552, 7, 0, 65553, 7, 0, 196605, 6, 0, 196606, 7, 0, 196607, 7, 0, 131072, 7, 0, 131073, 7, 0, 131074, 8, 0, 524313, 14, 0, 524315, 14, 0, 524316, 14, 0, 524317, 13, 0, 524318, 13, 0, 524319, 13, 0, 524320, 13, 0, 589849, 14, 0, 589850, 14, 0, 589851, 14, 0, 589852, 14, 0, 589853, 13, 0, 589854, 13, 0, 589855, 13, 0, 589856, 13, 0, 655385, 14, 0, 655386, 14, 0, 655387, 14, 0, 655388, 14, 0, 655389, 13, 0, 655390, 13, 0, 655391, 13, 0, 655392, 13, 0, 720921, 14, 0, 720922, 14, 0, 720923, 14, 0, 720924, 14, 0, 720925, 13, 0, 720926, 13, 0, 720927, 13, 0, 720928, 13, 0 )

[node name="TileMap2" type="TileMap" parent="Ground" index="2"]
scale = Vector2( 0.25, 0.25 )
z_index = -1
tile_set = SubResource( 4 )
cell_size = Vector2( 256, 256 )
format = 1
tile_data = PoolIntArray( -393217, 0, 0, -458752, 1, 0, -458751, 1, 0, -458750, 2, 0, -327681, 11, 0, -393216, 4, 0, -393215, 4, 0, -393214, 12, 0, -262145, 6, 0, -327680, 14, 0, -327679, 14, 0, -327678, 8, 0, -196609, 9, 0, -262144, 13, 0, -262143, 13, 0, -262142, 10, 0 )

[node name="TileMap3" type="TileMap" parent="Ground" index="3"]
scale = Vector2( 0.25, 0.25 )
z_index = -1
tile_set = ExtResource( 29 )
cell_size = Vector2( 128, 128 )
format = 1
tile_data = PoolIntArray( -1114124, 6, 0, -1114118, 14, 0, -1114117, 13, 0, -1114116, 14, 0, -1114115, 15, 0, -1048583, 17, 0, -1048581, 17, 0, -1048580, 17, 0, -1048579, 16, 0, -851995, 5, 0, -917475, 8, 0, -720885, 1, 0, 458722, 5, 0, 589847, 1, 0, 851982, 7, 0, 983035, 7, 0, 983069, 1, 0, 1376234, 7, 0, 1376248, 5, 0 )

[node name="TileMap" type="TileMap" parent="Ground" index="4"]
scale = Vector2( 0.25, 0.25 )
tile_set = ExtResource( 60 )
cell_size = Vector2( 256, 256 )
format = 1
tile_data = PoolIntArray( -720883, 0, 0, -655347, 0, 0, -589811, 0, 0, -524275, 0, 0, -458739, 0, 0, -393203, 2, 0, -393202, 1, 0, -393201, 1, 0, -393200, 1, 0, -393199, 1, 0, -16, 1, 0, -15, 1, 0, -14, 1, 0, -13, 4, 0, 65523, 0, 0, 131059, 0, 0, 196595, 0, 0, 262131, 0, 0, 327667, 0, 0, 393203, 2, 0, 393204, 1, 0, 393205, 1, 0, 393206, 1, 0, 393207, 1, 0, 393208, 1, 0, 393209, 1, 0, 393210, 4, 0, 458746, 0, 0, 524282, 0, 0, 589818, 2, 0, 589819, 1, 0, 589820, 1, 0, 589821, 1, 0, 589822, 1, 0, 589823, 4, 0, 655359, 0, 0, 720895, 0, 0 )

[node name="TileMap4" type="TileMap" parent="Ground" index="5"]
material = ExtResource( 56 )
scale = Vector2( 0.25, 0.25 )
z_index = 19
tile_set = ExtResource( 61 )
format = 1
tile_data = PoolIntArray( -2031656, 6, 0, -2097137, 7, 0, -1834977, 6, 0, -1638357, 9, 0, -1245239, 5, 0, -1245162, 0, 0, -851908, 1, 0, -589772, 6, 0, -62, 2, 0, 65481, 8, 0, 131016, 2, 0, 196549, 7, 0, 393156, 8, 0, 393161, 2, 0, 458689, 2, 0, 589766, 2, 0, 589769, 7, 0, 720836, 7, 0, 917446, 2, 0, 917449, 8, 0, 917560, 8, 0, 1048515, 8, 0, 1114055, 7, 0, 1114058, 2, 0, 1114128, 0, 0, 1114145, 2, 0, 1376194, 2, 0, 1376197, 2, 0, 1376202, 8, 0, 1441745, 2, 0, 1441755, 7, 0, 1441763, 7, 0, 1507276, 7, 0, 1507294, 2, 0, 1572809, 2, 0, 1507373, 0, 0, 1638341, 8, 0, 1638358, 7, 0, 1638363, 2, 0, 1703880, 7, 0, 1703887, 7, 0, 1703907, 2, 0, 1769410, 7, 0, 1769440, 7, 0, 1900493, 8, 0, 1900497, 2, 0, 1966021, 8, 0, 1966037, 2, 0, 2031561, 7, 0, 2031577, 2, 0, 2031589, 2, 0, 1966106, 0, 0, 2097104, 2, 0, 2097119, 2, 0 )

[node name="SelectedBuilding" parent="Ground" index="6"]
modulate = Color( 1, 1, 1, 1 )

[node name="Node2D" type="Node2D" parent="Ground" index="7"]
scale = Vector2( 0.25, 0.25 )

[node name="greenery_1" type="Sprite" parent="Ground/Node2D" index="0"]
position = Vector2( 52.2171, -1282.77 )
texture = ExtResource( 34 )

[node name="greenery_2" type="Sprite" parent="Ground/Node2D" index="1"]
position = Vector2( 1085.78, -422.141 )
texture = ExtResource( 27 )

[node name="greenery_3" type="Sprite" parent="Ground/Node2D" index="2"]
position = Vector2( 1777.21, -431.121 )
texture = ExtResource( 28 )

[node name="greenery_4" type="Sprite" parent="Ground/Node2D" index="3"]
position = Vector2( 1476.39, 121.13 )
texture = ExtResource( 36 )

[node name="greenery_5" type="Sprite" parent="Ground/Node2D" index="4"]
position = Vector2( 1346.19, -588.266 )
texture = ExtResource( 37 )

[node name="greenery_7" type="Sprite" parent="Ground/Node2D" index="5"]
position = Vector2( 385.362, -574.796 )
texture = ExtResource( 38 )

[node name="greenery_8" type="Sprite" parent="Ground/Node2D" index="6"]
position = Vector2( 1287.82, 296.234 )
texture = ExtResource( 30 )

[node name="greenery_9" type="Sprite" parent="Ground/Node2D" index="7"]
position = Vector2( 2473.14, 219.907 )
texture = ExtResource( 31 )

[node name="greenery_10" type="Sprite" parent="Ground/Node2D" index="8"]
position = Vector2( 564.956, -1450.32 )
texture = ExtResource( 31 )

[node name="greenery_11" type="Sprite" parent="Ground/Node2D" index="9"]
position = Vector2( 452.709, -1243.78 )
texture = ExtResource( 30 )

[node name="stones_1" type="Sprite" parent="Ground/Node2D" index="10"]
position = Vector2( 2554.64, -565.266 )
texture = ExtResource( 32 )

[node name="stones_2" type="Sprite" parent="Ground/Node2D/stones_1" index="0"]
position = Vector2( -1010.9, 1032.11 )
texture = ExtResource( 33 )

[node name="stones_3" type="Sprite" parent="Ground/Node2D/stones_1" index="1"]
position = Vector2( -1634.99, 1211.71 )
texture = ExtResource( 35 )

[node name="stones_4" type="Sprite" parent="Ground/Node2D/stones_1" index="2"]
position = Vector2( -202.726, 1023.13 )
texture = ExtResource( 46 )

[node name="stones_5" type="Sprite" parent="Ground/Node2D/stones_1" index="3"]
position = Vector2( -525.995, 1216.2 )
texture = ExtResource( 49 )

[node name="stones_6" type="Sprite" parent="Ground/Node2D/stones_1" index="4"]
position = Vector2( -512.525, -305.86 )
texture = ExtResource( 51 )

[node name="stones_7" type="Sprite" parent="Ground/Node2D/stones_1" index="5"]
position = Vector2( -1208.45, 1395.79 )
texture = ExtResource( 48 )

[node name="tree_1" type="Sprite" parent="Ground/Node2D/stones_1" index="6"]
material = ExtResource( 56 )
position = Vector2( -3635.68, -307.275 )
texture = ExtResource( 44 )

[node name="tree_10" type="Sprite" parent="Ground/Node2D/stones_1" index="7"]
material = ExtResource( 56 )
position = Vector2( -1850.64, 2197.27 )
texture = ExtResource( 40 )

[node name="tree_11" type="Sprite" parent="Ground/Node2D/stones_1" index="8"]
position = Vector2( -2170.64, 1397.27 )
texture = ExtResource( 39 )

[node name="tree_12" type="Sprite" parent="Ground/Node2D/stones_1" index="9"]
position = Vector2( -4250.64, -842.734 )
texture = ExtResource( 50 )

[node name="tree_13" type="Sprite" parent="Ground/Node2D/stones_1" index="10"]
position = Vector2( -3162.64, -362.734 )
texture = ExtResource( 43 )

[node name="tree_14" type="Sprite" parent="Ground/Node2D/stones_1" index="11"]
position = Vector2( -3642.64, -810.734 )
texture = ExtResource( 45 )

[node name="tree_15" type="Sprite" parent="Ground/Node2D/stones_1" index="12"]
position = Vector2( -4506.64, 469.266 )
texture = ExtResource( 41 )

[node name="tree_2" type="Sprite" parent="Ground/Node2D/stones_1" index="13"]
material = ExtResource( 56 )
position = Vector2( -3418.64, 1141.27 )
texture = ExtResource( 47 )

[node name="tree_3" type="Sprite" parent="Ground/Node2D/stones_1" index="14"]
material = ExtResource( 56 )
position = Vector2( -4698.64, -522.734 )
texture = ExtResource( 42 )

[node name="tree_4" type="Sprite" parent="Ground/Node2D/stones_1" index="15"]
material = ExtResource( 56 )
position = Vector2( -4954.64, 85.266 )
texture = ExtResource( 22 )

[node name="tree_5" type="Sprite" parent="Ground/Node2D/stones_1" index="16"]
material = ExtResource( 56 )
position = Vector2( -3898.64, 501.266 )
texture = ExtResource( 24 )

[node name="tree_6" type="Sprite" parent="Ground/Node2D/stones_1" index="17"]
material = ExtResource( 56 )
position = Vector2( -5114.64, 821.266 )
texture = ExtResource( 26 )

[node name="tree_7" type="Sprite" parent="Ground/Node2D/stones_1" index="18"]
material = ExtResource( 56 )
position = Vector2( -2618.64, 1813.27 )
texture = ExtResource( 23 )

[node name="tree_8" type="Sprite" parent="Ground/Node2D/stones_1" index="19"]
material = ExtResource( 56 )
position = Vector2( -3642.64, 1941.27 )
texture = ExtResource( 21 )

[node name="tree_9" type="Sprite" parent="Ground/Node2D/stones_1" index="20"]
material = ExtResource( 56 )
position = Vector2( -4698.64, 1589.27 )
texture = ExtResource( 25 )

[node name="PlayerCore" parent="GroundObject" index="0"]
starting_health = 5000

[node name="CollectibleResource" parent="GroundObject" index="1" instance=ExtResource( 3 )]
position = Vector2( -340.384, 75 )

[node name="Camera2D" parent="." index="8"]
zoom = Vector2( 0.8, 0.8 )
limit_left = -1000
limit_top = -500
limit_right = 1000
limit_bottom = 500
script = SubResource( 5 )

[node name="EnemyTimer" type="Timer" parent="." index="10"]

[node name="STEP3_3" type="Sprite" parent="." index="11"]
visible = false
position = Vector2( -552, -120 )
scale = Vector2( 0.446072, 0.446771 )
z_index = 1
texture = ExtResource( 52 )

[node name="TextInterfaceEngine" type="ReferenceRect" parent="STEP3_3" index="0"]
margin_left = -339.0
margin_top = -269.0
margin_right = 342.0
margin_bottom = 125.0
script = ExtResource( 58 )
__meta__ = {
"_edit_use_anchors_": false
}
FONT = SubResource( 6 )

[node name="Label" type="Label" parent="STEP3_3" index="1"]
visible = false
margin_left = -327.0
margin_top = -243.0
margin_right = 320.0
margin_bottom = 104.0
custom_fonts/font = ExtResource( 53 )
text = "Send the collector in this area when miner has extracted the minerals."
autowrap = true
__meta__ = {
"_edit_use_anchors_": false
}

[node name="STEP4_1" type="Sprite" parent="." index="12"]
visible = false
position = Vector2( 32, -267.03 )
scale = Vector2( 0.446072, 0.400378 )
z_index = 1
texture = ExtResource( 52 )

[node name="Label" type="Label" parent="STEP4_1" index="0"]
margin_left = -327.0
margin_top = -243.0
margin_right = 320.0
margin_bottom = 104.0
custom_fonts/font = ExtResource( 53 )
text = "Build more defenses here !!!"
autowrap = true
__meta__ = {
"_edit_use_anchors_": false
}

[node name="STEP5_2" type="Sprite" parent="." index="13"]
visible = false
position = Vector2( 8, -224 )
scale = Vector2( 0.446072, 0.484657 )
z_index = 1
texture = ExtResource( 52 )

[node name="TextInterfaceEngine" type="ReferenceRect" parent="STEP5_2" index="0"]
margin_left = -338.705
margin_top = -243.0
margin_right = 342.295
margin_bottom = 102.0
script = ExtResource( 58 )
__meta__ = {
"_edit_use_anchors_": false
}
FONT = ExtResource( 53 )

[node name="Label" type="Label" parent="STEP5_2" index="1"]
visible = false
margin_left = -327.0
margin_top = -243.0
margin_right = 320.0
margin_bottom = 104.0
custom_fonts/font = ExtResource( 53 )
text = "Send the collector in this area when miner has extracted the minerals."
autowrap = true
__meta__ = {
"_edit_use_anchors_": false
}

[node name="GUI_Tutorial" type="CanvasLayer" parent="." index="14"]

[node name="STEP0_1" type="Sprite" parent="GUI_Tutorial" index="0"]
position = Vector2( 1583.67, 755.038 )
scale = Vector2( 0.446072, 0.400378 )
texture = ExtResource( 52 )

[node name="TextInterfaceEngine" type="ReferenceRect" parent="GUI_Tutorial/STEP0_1" index="0"]
margin_left = -340.0
margin_top = -241.0
margin_right = 341.0
margin_bottom = 104.0
script = ExtResource( 58 )
__meta__ = {
"_edit_use_anchors_": false
}
FONT = ExtResource( 53 )

[node name="Label" type="Label" parent="GUI_Tutorial/STEP0_1" index="1"]
visible = false
margin_left = -327.0
margin_top = -243.0
margin_right = 320.0
margin_bottom = 104.0
custom_fonts/font = ExtResource( 53 )
text = "The enemy is attacking your core from the east. you must protect it!!"
autowrap = true
__meta__ = {
"_edit_use_anchors_": false
}

[node name="STEP0_2" type="Sprite" parent="GUI_Tutorial" index="1"]
visible = false
position = Vector2( 568.854, 832 )
scale = Vector2( 0.446072, 0.400378 )
texture = ExtResource( 52 )

[node name="TextInterfaceEngine" type="ReferenceRect" parent="GUI_Tutorial/STEP0_2" index="0"]
margin_left = -342.667
margin_top = -239.773
margin_right = 338.333
margin_bottom = 105.227
script = ExtResource( 58 )
__meta__ = {
"_edit_use_anchors_": false
}
FONT = ExtResource( 53 )

[node name="Label" type="Label" parent="GUI_Tutorial/STEP0_2" index="1"]
visible = false
margin_left = -327.0
margin_top = -243.0
margin_right = 320.0
margin_bottom = 104.0
custom_fonts/font = ExtResource( 53 )
text = "click on the first tower and place 2 Towers on the right of your core."
autowrap = true
__meta__ = {
"_edit_use_anchors_": false
}

[node name="STEP1_1" type="Sprite" parent="GUI_Tutorial" index="2"]
visible = false
position = Vector2( 1620.08, 772.165 )
scale = Vector2( 0.543049, 0.460158 )
texture = ExtResource( 52 )

[node name="TextInterfaceEngine" type="ReferenceRect" parent="GUI_Tutorial/STEP1_1" index="0"]
margin_left = -340.0
margin_top = -241.0
margin_right = 467.0
margin_bottom = 152.0
rect_scale = Vector2( 0.85, 0.9 )
script = ExtResource( 58 )
__meta__ = {
"_edit_use_anchors_": false
}
FONT = ExtResource( 53 )

[node name="Label" type="Label" parent="GUI_Tutorial/STEP1_1" index="1"]
visible = false
margin_left = -327.0
margin_top = -243.0
margin_right = 320.0
margin_bottom = 104.0
custom_fonts/font = ExtResource( 53 )
autowrap = true
__meta__ = {
"_edit_use_anchors_": false
}

[node name="STEP2_1" type="Sprite" parent="GUI_Tutorial" index="3"]
visible = false
position = Vector2( 1583.67, 754.551 )
scale = Vector2( 0.446072, 0.400378 )
texture = ExtResource( 52 )

[node name="TextInterfaceEngine" type="ReferenceRect" parent="GUI_Tutorial/STEP2_1" index="0"]
margin_left = -340.012
margin_top = -246.145
margin_right = 340.988
margin_bottom = 98.8551
script = ExtResource( 58 )
__meta__ = {
"_edit_use_anchors_": false
}
FONT = ExtResource( 53 )

[node name="Label" type="Label" parent="GUI_Tutorial/STEP2_1" index="1"]
visible = false
margin_left = -327.0
margin_top = -243.0
margin_right = 320.0
margin_bottom = 104.0
custom_fonts/font = ExtResource( 53 )
text = "You must gather ressources to build more towers!"
autowrap = true
__meta__ = {
"_edit_use_anchors_": false
}

[node name="STEP2_2" type="Sprite" parent="GUI_Tutorial" index="4"]
visible = false
position = Vector2( 178.667, 832 )
scale = Vector2( 0.446072, 0.400378 )
texture = ExtResource( 52 )

[node name="TextInterfaceEngine" type="ReferenceRect" parent="GUI_Tutorial/STEP2_2" index="0"]
margin_left = -346.731
margin_top = -239.773
margin_right = 334.269
margin_bottom = 105.227
script = ExtResource( 58 )
__meta__ = {
"_edit_use_anchors_": false
}
FONT = ExtResource( 53 )

[node name="Label" type="Label" parent="GUI_Tutorial/STEP2_2" index="1"]
visible = false
margin_left = -327.0
margin_top = -243.0
margin_right = 320.0
margin_bottom = 104.0
custom_fonts/font = ExtResource( 53 )
text = "Click on the miner button and select a deposit on the map."
autowrap = true
__meta__ = {
"_edit_use_anchors_": false
}

[node name="STEP3_1" type="Sprite" parent="GUI_Tutorial" index="5"]
visible = false
position = Vector2( 1583.67, 755.931 )
scale = Vector2( 0.446072, 0.400378 )
texture = ExtResource( 52 )

[node name="TextInterfaceEngine" type="ReferenceRect" parent="GUI_Tutorial/STEP3_1" index="0"]
margin_left = -340.012
margin_top = -249.592
margin_right = 340.988
margin_bottom = 95.4083
script = ExtResource( 58 )
__meta__ = {
"_edit_use_anchors_": false
}
FONT = ExtResource( 53 )

[node name="Label" type="Label" parent="GUI_Tutorial/STEP3_1" index="1"]
visible = false
margin_left = -327.0
margin_top = -243.0
margin_right = 320.0
margin_bottom = 104.0
custom_fonts/font = ExtResource( 53 )
text = "Now, gather the minerals with the collector drone! (Collect 75 gold)"
autowrap = true
__meta__ = {
"_edit_use_anchors_": false
}

[node name="STEP3_2" type="Sprite" parent="GUI_Tutorial" index="6"]
visible = false
position = Vector2( 270.875, 832 )
scale = Vector2( 0.446072, 0.400378 )
texture = ExtResource( 52 )

[node name="TextInterfaceEngine" type="ReferenceRect" parent="GUI_Tutorial/STEP3_2" index="0"]
margin_left = -338.23
margin_top = -239.773
margin_right = 342.77
margin_bottom = 105.227
script = ExtResource( 58 )
__meta__ = {
"_edit_use_anchors_": false
}
FONT = ExtResource( 53 )

[node name="Label" type="Label" parent="GUI_Tutorial/STEP3_2" index="1"]
visible = false
margin_left = -327.0
margin_top = -243.0
margin_right = 320.0
margin_bottom = 104.0
custom_fonts/font = ExtResource( 53 )
text = "Click on the button and click on the map where you want to collect minerals."
autowrap = true
__meta__ = {
"_edit_use_anchors_": false
}

[node name="STEP5_1" type="Sprite" parent="GUI_Tutorial" index="7"]
visible = false
position = Vector2( 1583.67, 754.602 )
scale = Vector2( 0.446072, 0.400378 )
texture = ExtResource( 52 )

[node name="TextInterfaceEngine" type="ReferenceRect" parent="GUI_Tutorial/STEP5_1" index="0"]
margin_left = -340.012
margin_top = -246.272
margin_right = 340.988
margin_bottom = 98.7278
script = ExtResource( 58 )
__meta__ = {
"_edit_use_anchors_": false
}
FONT = ExtResource( 53 )

[node name="Label" type="Label" parent="GUI_Tutorial/STEP5_1" index="1"]
visible = false
margin_left = -327.0
margin_top = -243.0
margin_right = 320.0
margin_bottom = 104.0
custom_fonts/font = ExtResource( 53 )
text = "You can upgrade your towers by clicking on it and select the upgrade (it needs gold)."
autowrap = true
__meta__ = {
"_edit_use_anchors_": false
}

[node name="GirlGeneral" type="Sprite" parent="GUI_Tutorial" index="8"]
material = ExtResource( 59 )
position = Vector2( 1792, 984 )
scale = Vector2( 1.5, 1.5 )
texture = ExtResource( 57 )

[node name="CanvasModulate" type="CanvasModulate" parent="." index="15"]
visible = false
position = Vector2( 329.172, -304.696 )
color = Color( 0.807843, 0.807843, 0.807843, 1 )

[node name="Area2D" type="Area2D" parent="." index="16" groups=[
"tower_area_building",
]]
collision_mask = 0

[node name="CollisionPolygon2D" type="CollisionPolygon2D" parent="Area2D" index="0"]
visible = false
polygon = PoolVector2Array( -960, -504, -968, 592, 80, 584, 80, -504 )

[node name="CollisionPolygon2D2" type="CollisionPolygon2D" parent="Area2D" index="1"]
visible = false
polygon = PoolVector2Array( 256, 0, 256, 272, 72, 272, 72, 592, 1000, 584, 1000, -616, 40, -608, 40, -192, 256, -192 )

[node name="ColorRect" type="ColorRect" parent="Area2D" index="2"]
visible = false
margin_left = 80.0
margin_top = -191.0
margin_right = 256.0
margin_bottom = 272.0
mouse_filter = 2
color = Color( 0.01, 0, 2, 0.26 )
__meta__ = {
"_edit_use_anchors_": false
}

[node name="Particles2D" type="Particles2D" parent="Area2D" index="3"]
visible = false
position = Vector2( 169.349, -8 )
amount = 1
lifetime = 3.0
process_material = SubResource( 9 )
texture = SubResource( 11 )

[node name="EnemyDirectionTimer" parent="." index="26"]
wait_time = 2.0
autostart = true

[node name="WinGUI" parent="." index="27" instance=ExtResource( 54 )]

[connection signal="timeout" from="EnemyTimer" to="." method="_on_EnemyTimer_timeout"]
