[gd_scene load_steps=8 format=2]

[ext_resource path="res://actor/Enemy/EnemyActor.tscn" type="PackedScene" id=1]
[ext_resource path="res://actor/Enemy/tank2/Tank2.gd" type="Script" id=2]
[ext_resource path="res://assets/sfx/Tanks_Attacks_T1.wav" type="AudioStream" id=3]
[ext_resource path="res://assets/img/enemy/Track_1_B.png" type="Texture" id=4]
[ext_resource path="res://assets/img/enemy/Hull_08.png" type="Texture" id=5]
[ext_resource path="res://assets/img/enemy/Gun_06.png" type="Texture" id=6]

[sub_resource type="RectangleShape2D" id=1]
extents = Vector2( 28, 16 )

[node name="Tank2" instance=ExtResource( 1 )]
scale = Vector2( 0.5, 0.5 )
script = ExtResource( 2 )
type = 1
enemy_name = "tank2"

[node name="CollisionShape2D" parent="." index="1"]
shape = SubResource( 1 )

[node name="ShotTimer" parent="." index="5"]
wait_time = 0.2

[node name="TrackLeft" type="Sprite" parent="." index="6"]
position = Vector2( 2.4869e-14, -9 )
rotation = 1.5708
scale = Vector2( 0.2, 0.2 )
texture = ExtResource( 4 )

[node name="TrackRight" type="Sprite" parent="." index="7"]
position = Vector2( -2.4869e-14, 9 )
rotation = 1.5708
scale = Vector2( 0.2, 0.2 )
texture = ExtResource( 4 )

[node name="Hull" type="Sprite" parent="." index="8"]
rotation = 1.5708
scale = Vector2( 0.2, 0.2 )
texture = ExtResource( 5 )

[node name="Canon" type="Sprite" parent="." index="9"]
position = Vector2( -5, 4.76837e-07 )
rotation = 1.5708
scale = Vector2( 0.2, 0.2 )
texture = ExtResource( 6 )
offset = Vector2( 0, -40 )

[node name="TrackTimer" type="Timer" parent="." index="10"]
wait_time = 0.25

[node name="AudioStreamPlayer2D" type="AudioStreamPlayer2D" parent="." index="11"]
stream = ExtResource( 3 )
volume_db = -6.0
pitch_scale = 2.0
max_distance = 1500.0
bus = "SFX"
area_mask = 0
[connection signal="timeout" from="TrackTimer" to="." method="_on_TrackTimer_timeout"]
