[gd_scene load_steps=14 format=2]

[ext_resource path="res://actor/Enemy/bigtank/BigTankShotExplosion.gd" type="Script" id=1]
[ext_resource path="res://assets/img/effects/Explosion/Sprite_Effects_Explosion_002.png" type="Texture" id=2]
[ext_resource path="res://assets/img/effects/Explosion/Sprite_Effects_Explosion_004.png" type="Texture" id=3]
[ext_resource path="res://assets/img/effects/Explosion/Sprite_Effects_Explosion_007.png" type="Texture" id=4]
[ext_resource path="res://assets/img/effects/Explosion/Sprite_Effects_Explosion_005.png" type="Texture" id=5]
[ext_resource path="res://assets/img/effects/Explosion/Sprite_Effects_Explosion_008.png" type="Texture" id=6]
[ext_resource path="res://assets/img/effects/Explosion/Sprite_Effects_Explosion_001.png" type="Texture" id=7]
[ext_resource path="res://assets/img/effects/Explosion/Sprite_Effects_Explosion_003.png" type="Texture" id=8]
[ext_resource path="res://assets/img/effects/Explosion/Sprite_Effects_Explosion_000.png" type="Texture" id=9]
[ext_resource path="res://assets/img/effects/Explosion/Sprite_Effects_Explosion_006.png" type="Texture" id=10]
[ext_resource path="res://assets/sfx/FarExplosion03.wav" type="AudioStream" id=11]

[sub_resource type="CircleShape2D" id=1]
radius = 48.0

[sub_resource type="Animation" id=2]
resource_name = "explosion"
length = 0.45
step = 0.05
tracks/0/type = "value"
tracks/0/path = NodePath("Sprite:texture")
tracks/0/interp = 1
tracks/0/loop_wrap = true
tracks/0/imported = false
tracks/0/enabled = true
tracks/0/keys = {
"times": PoolRealArray( 0, 0.05, 0.1, 0.15, 0.2, 0.25, 0.3, 0.35, 0.4 ),
"transitions": PoolRealArray( 1, 1, 1, 1, 1, 1, 1, 1, 1 ),
"update": 1,
"values": [ ExtResource( 9 ), ExtResource( 7 ), ExtResource( 2 ), ExtResource( 8 ), ExtResource( 3 ), ExtResource( 5 ), ExtResource( 10 ), ExtResource( 4 ), ExtResource( 6 ) ]
}
tracks/1/type = "method"
tracks/1/path = NodePath(".")
tracks/1/interp = 1
tracks/1/loop_wrap = true
tracks/1/imported = false
tracks/1/enabled = true
tracks/1/keys = {
"times": PoolRealArray( 0.45 ),
"transitions": PoolRealArray( 1 ),
"values": [ {
"args": [  ],
"method": "queue_free"
} ]
}

[node name="BigTankShotExplosion" type="Area2D"]
collision_layer = 16
collision_mask = 67
script = ExtResource( 1 )

[node name="CollisionShape2D" type="CollisionShape2D" parent="."]
shape = SubResource( 1 )

[node name="Sprite" type="Sprite" parent="."]
scale = Vector2( 0.5, 0.5 )
z_index = 20
texture = ExtResource( 6 )

[node name="AnimationPlayer" type="AnimationPlayer" parent="."]
autoplay = "explosion"
anims/explosion = SubResource( 2 )

[node name="AudioStreamPlayer2D" type="AudioStreamPlayer2D" parent="."]
stream = ExtResource( 11 )
volume_db = -6.0
pitch_scale = 2.0
autoplay = true
max_distance = 1500.0
bus = "SFX"
