[gd_scene load_steps=3 format=2]

[ext_resource path="res://actor/Swarm/LaserFocusSwarm/FocusBeam.gd" type="Script" id=1]
[ext_resource path="res://assets/shader/EnergyBeamFocus.tres" type="Material" id=2]

[node name="FocusBeam" type="Line2D"]
points = PoolVector2Array( 0, 0, 0, 0 )
width = 0.01
default_color = Color( 1.8, 0, 0, 1 )
joint_mode = 2
begin_cap_mode = 2
end_cap_mode = 2
antialiased = true
script = ExtResource( 1 )

[node name="ColorRect" type="ColorRect" parent="."]
material = ExtResource( 2 )
margin_left = 8.0
margin_top = -32.0
margin_right = 64.0
margin_bottom = 32.0
mouse_filter = 2
__meta__ = {
"_edit_use_anchors_": false
}

[node name="DamageTimer" type="Timer" parent="."]
wait_time = 0.2
autostart = true

[node name="IncreaseDamageTimer" type="Timer" parent="."]
autostart = true

[connection signal="timeout" from="DamageTimer" to="." method="_on_DamageTimer_timeout"]
[connection signal="timeout" from="IncreaseDamageTimer" to="." method="_on_IncreaseDamageTimer_timeout"]
