[gd_scene load_steps=21 format=2]

[ext_resource path="res://assets/img/effects/puff.png" type="Texture" id=1]
[ext_resource path="res://assets/img/effects/white_glowing_circle.png" type="Texture" id=2]
[ext_resource path="res://assets/sfx/FarExplosion03.wav" type="AudioStream" id=3]
[ext_resource path="res://assets/shader/BigShockwave.tres" type="Material" id=4]

[sub_resource type="Gradient" id=1]
offsets = PoolRealArray( 0, 0.783333, 1 )
colors = PoolColorArray( 0.176471, 0.164706, 0.164706, 1, 0.12549, 0.109804, 0.109804, 0.972549, 0.117647, 0.101961, 0.101961, 0.0980392 )

[sub_resource type="GradientTexture" id=2]
gradient = SubResource( 1 )

[sub_resource type="Curve" id=3]
_data = [ Vector2( 0, 0 ), 0.0, 2.63443, 0, 0, Vector2( 0.380228, 1 ), 0.0, 0.0, 0, 0, Vector2( 0.627376, 1 ), 0.0, 0.0, 0, 0, Vector2( 1, 0.515909 ), 0.0, 0.0, 0, 0 ]

[sub_resource type="CurveTexture" id=4]
curve = SubResource( 3 )

[sub_resource type="ParticlesMaterial" id=5]
flag_disable_z = true
spread = 180.0
gravity = Vector3( 0, 0, 0 )
initial_velocity = 50.0
initial_velocity_random = 0.8
angular_velocity = 50.0
orbit_velocity = 0.0
orbit_velocity_random = 0.0
damping = 10.0
angle = 360.0
angle_random = 1.0
scale = 0.3
scale_curve = SubResource( 4 )
color_ramp = SubResource( 2 )

[sub_resource type="Gradient" id=6]
offsets = PoolRealArray( 0, 0.2375, 0.433333, 0.7375, 1 )
colors = PoolColorArray( 0.870588, 0.12549, 0.12549, 0, 0.823529, 0.152941, 0.152941, 1, 0.905882, 0.337255, 0.101961, 1, 0.815686, 0.603922, 0.27451, 1, 1, 1, 1, 1 )

[sub_resource type="GradientTexture" id=7]
gradient = SubResource( 6 )

[sub_resource type="Curve" id=8]
_data = [ Vector2( 0, 0 ), 0.0, 3.08826, 0, 0, Vector2( 0.243346, 1 ), 0.0, 0.0, 0, 0, Vector2( 0.494297, 0.989773 ), 0.0, 0.0, 0, 0, Vector2( 1, 0 ), 0.0, 0.0, 0, 0 ]

[sub_resource type="CurveTexture" id=9]
curve = SubResource( 8 )

[sub_resource type="ParticlesMaterial" id=10]
emission_shape = 1
emission_sphere_radius = 3.0
flag_disable_z = true
spread = 180.0
gravity = Vector3( 0, 0, 0 )
initial_velocity = 100.0
initial_velocity_random = 0.5
angular_velocity = 80.0
angular_velocity_random = 0.8
orbit_velocity = 0.0
orbit_velocity_random = 0.0
damping = 200.0
damping_random = 0.85
angle = 220.0
angle_random = 1.0
scale = 0.2
scale_curve = SubResource( 9 )
color_ramp = SubResource( 7 )

[sub_resource type="Gradient" id=11]
offsets = PoolRealArray( 0, 0.2, 0.379167, 0.6, 1 )
colors = PoolColorArray( 1, 1, 1, 1, 0.788235, 0.533333, 0.219608, 1, 0.905882, 0.337255, 0.101961, 1, 0.941176, 0.0784314, 0.0784314, 1, 0, 0, 0, 1 )

[sub_resource type="GradientTexture" id=12]
gradient = SubResource( 11 )

[sub_resource type="Curve" id=13]
_data = [ Vector2( 0, 1 ), 0.0, 0.0, 0, 0, Vector2( 1, 0 ), -1.0067, 0.0, 0, 0 ]

[sub_resource type="CurveTexture" id=14]
curve = SubResource( 13 )

[sub_resource type="ParticlesMaterial" id=15]
emission_shape = 1
emission_sphere_radius = 15.0
flag_disable_z = true
spread = 180.0
gravity = Vector3( 0, 0, 0 )
orbit_velocity = 0.1
orbit_velocity_random = 0.0
radial_accel = 50.0
tangential_accel = 60.0
scale = 0.1
scale_random = 0.05
scale_curve = SubResource( 14 )
color_ramp = SubResource( 12 )

[sub_resource type="Animation" id=16]
length = 2.5
tracks/0/type = "value"
tracks/0/path = NodePath("Smoke:emitting")
tracks/0/interp = 1
tracks/0/loop_wrap = true
tracks/0/imported = false
tracks/0/enabled = true
tracks/0/keys = {
"times": PoolRealArray( 0, 0.3 ),
"transitions": PoolRealArray( 1, 1 ),
"update": 1,
"values": [ true, false ]
}
tracks/1/type = "value"
tracks/1/path = NodePath("FireExplosion:emitting")
tracks/1/interp = 1
tracks/1/loop_wrap = true
tracks/1/imported = false
tracks/1/enabled = true
tracks/1/keys = {
"times": PoolRealArray( 0, 0.3 ),
"transitions": PoolRealArray( 1, 1 ),
"update": 1,
"values": [ true, false ]
}
tracks/2/type = "method"
tracks/2/path = NodePath("FireExplosion")
tracks/2/interp = 1
tracks/2/loop_wrap = true
tracks/2/imported = false
tracks/2/enabled = true
tracks/2/keys = {
"times": PoolRealArray( 0 ),
"transitions": PoolRealArray( 1 ),
"values": [ {
"args": [  ],
"method": "restart"
} ]
}
tracks/3/type = "method"
tracks/3/path = NodePath("Smoke")
tracks/3/interp = 1
tracks/3/loop_wrap = true
tracks/3/imported = false
tracks/3/enabled = true
tracks/3/keys = {
"times": PoolRealArray( 0 ),
"transitions": PoolRealArray( 1 ),
"values": [ {
"args": [  ],
"method": "restart"
} ]
}
tracks/4/type = "method"
tracks/4/path = NodePath(".")
tracks/4/interp = 1
tracks/4/loop_wrap = true
tracks/4/imported = false
tracks/4/enabled = true
tracks/4/keys = {
"times": PoolRealArray( 2.5 ),
"transitions": PoolRealArray( 1 ),
"values": [ {
"args": [  ],
"method": "queue_free"
} ]
}
tracks/5/type = "value"
tracks/5/path = NodePath("Sparkle:emitting")
tracks/5/interp = 1
tracks/5/loop_wrap = true
tracks/5/imported = false
tracks/5/enabled = true
tracks/5/keys = {
"times": PoolRealArray( 0, 0.3 ),
"transitions": PoolRealArray( 1, 1 ),
"update": 1,
"values": [ true, false ]
}
tracks/6/type = "method"
tracks/6/path = NodePath("Sparkle")
tracks/6/interp = 1
tracks/6/loop_wrap = true
tracks/6/imported = false
tracks/6/enabled = true
tracks/6/keys = {
"times": PoolRealArray( 0 ),
"transitions": PoolRealArray( 1 ),
"values": [ {
"args": [  ],
"method": "restart"
} ]
}
tracks/7/type = "method"
tracks/7/path = NodePath("AudioStreamPlayer2D")
tracks/7/interp = 1
tracks/7/loop_wrap = true
tracks/7/imported = false
tracks/7/enabled = true
tracks/7/keys = {
"times": PoolRealArray( 0 ),
"transitions": PoolRealArray( 1 ),
"values": [ {
"args": [ 0.0 ],
"method": "play"
} ]
}
tracks/8/type = "value"
tracks/8/path = NodePath("ColorRect:material:shader_param/torus_radius")
tracks/8/interp = 1
tracks/8/loop_wrap = true
tracks/8/imported = false
tracks/8/enabled = true
tracks/8/keys = {
"times": PoolRealArray( 0, 0.4 ),
"transitions": PoolRealArray( 1, 1 ),
"update": 0,
"values": [ 0.0, 0.5 ]
}
tracks/9/type = "value"
tracks/9/path = NodePath("ColorRect:material:shader_param/displacement_amount")
tracks/9/interp = 1
tracks/9/loop_wrap = true
tracks/9/imported = false
tracks/9/enabled = true
tracks/9/keys = {
"times": PoolRealArray( 0, 0.3, 0.4 ),
"transitions": PoolRealArray( 1, 1, 1 ),
"update": 0,
"values": [ 0.03, 0.03, 0.0 ]
}
tracks/10/type = "value"
tracks/10/path = NodePath("ColorRect:visible")
tracks/10/interp = 1
tracks/10/loop_wrap = true
tracks/10/imported = false
tracks/10/enabled = true
tracks/10/keys = {
"times": PoolRealArray( 0, 0.4 ),
"transitions": PoolRealArray( 1, 1 ),
"update": 1,
"values": [ true, false ]
}

[node name="BigExplosion" type="Node2D"]
z_index = 10

[node name="ColorRect" type="ColorRect" parent="."]
material = ExtResource( 4 )
margin_left = -256.0
margin_top = -256.0
margin_right = 256.0
margin_bottom = 256.0
mouse_filter = 2
__meta__ = {
"_edit_use_anchors_": false
}

[node name="Smoke" type="Particles2D" parent="."]
emitting = false
amount = 32
lifetime = 2.0
preprocess = 0.3
explosiveness = 0.6
process_material = SubResource( 5 )
texture = ExtResource( 1 )

[node name="FireExplosion" type="Particles2D" parent="."]
modulate = Color( 1.5, 1.5, 1.5, 1 )
emitting = false
amount = 128
lifetime = 0.6
explosiveness = 0.3
randomness = 1.0
process_material = SubResource( 10 )
texture = ExtResource( 1 )

[node name="Sparkle" type="Particles2D" parent="."]
modulate = Color( 1.3, 1.3, 1.3, 1 )
emitting = false
amount = 32
explosiveness = 0.2
randomness = 1.0
process_material = SubResource( 15 )
texture = ExtResource( 2 )

[node name="AnimationPlayer" type="AnimationPlayer" parent="."]
autoplay = "explosion"
anims/explosion = SubResource( 16 )

[node name="AudioStreamPlayer2D" type="AudioStreamPlayer2D" parent="."]
stream = ExtResource( 3 )
volume_db = -9.0
max_distance = 1000.0
bus = "SFX"
area_mask = 0
