[gd_scene load_steps=7 format=2]

[ext_resource path="res://actor/Bonus/LaunchedBonusTemplate.tscn" type="PackedScene" id=1]
[ext_resource path="res://actor/Bonus/IncDefence/LaunchedIncDefence.gd" type="Script" id=2]

[sub_resource type="StreamTexture" id=1]
flags = 4
load_path = "res://.import/circle.png-3af02c2263b7cdc0f2f57b0d3a3e83e9.stex"

[sub_resource type="Curve" id=2]
_data = [ Vector2( 0, 1 ), 0.0, 0.0, 0, 0, Vector2( 1, 0.469154 ), 0.0, 0.0, 0, 0 ]

[sub_resource type="CurveTexture" id=3]
curve = SubResource( 2 )

[sub_resource type="ParticlesMaterial" id=4]
emission_shape = 1
emission_sphere_radius = 192.0
flag_disable_z = true
gravity = Vector3( 0, -100, 0 )
orbit_velocity = 0.0
orbit_velocity_random = 0.0
scale = 3.0
scale_curve = SubResource( 3 )
color = Color( 0, 0, 1.3, 1 )

[node name="LaunchedIncDefence" instance=ExtResource( 1 )]
script = ExtResource( 2 )
type = 4

[node name="TickTimer" parent="." index="1"]
wait_time = 0.5

[node name="Sprite" parent="." index="2"]
modulate = Color( 0, 0.0392157, 1, 0.121569 )
texture = SubResource( 1 )

[node name="EndTimer" parent="." index="3"]
wait_time = 10.0

[node name="Particles2D" type="Particles2D" parent="." index="4"]
visible = false
amount = 128
process_material = SubResource( 4 )
[connection signal="timeout" from="TickTimer" to="." method="_on_TickTimer_timeout"]
[connection signal="timeout" from="EndTimer" to="." method="_on_EndTimer_timeout"]
