[gd_resource type="TileSet" load_steps=10 format=2]

[ext_resource path="res://assets/img/level/snow/greenery_8.png" type="Texture" id=1]
[ext_resource path="res://assets/img/level/snow/greenery_3.png" type="Texture" id=2]
[ext_resource path="res://assets/img/level/snow/greenery_1.png" type="Texture" id=3]
[ext_resource path="res://assets/img/level/snow/greenery_2.png" type="Texture" id=4]
[ext_resource path="res://assets/img/level/snow/greenery_4.png" type="Texture" id=5]
[ext_resource path="res://assets/img/level/snow/greenery_7.png" type="Texture" id=6]
[ext_resource path="res://assets/img/level/snow/greenery_9.png" type="Texture" id=7]
[ext_resource path="res://assets/img/level/snow/greenery_6.png" type="Texture" id=8]
[ext_resource path="res://assets/img/level/snow/greenery_5.png" type="Texture" id=9]

[resource]
0/name = "greenery_1"
0/texture = ExtResource( 3 )
0/tex_offset = Vector2( 0, 0 )
0/modulate = Color( 1, 1, 1, 1 )
0/region = Rect2( 0, 0, 128, 86 )
0/tile_mode = 0
0/occluder_offset = Vector2( 64, 43 )
0/navigation_offset = Vector2( 64, 43 )
0/shape_offset = Vector2( 0, 0 )
0/shape_transform = Transform2D( 1, 0, 0, 1, 0, 0 )
0/shape_one_way = false
0/shape_one_way_margin = 0.0
0/shapes = [  ]
0/z_index = 0
1/name = "greenery_2"
1/texture = ExtResource( 4 )
1/tex_offset = Vector2( 0, 0 )
1/modulate = Color( 1, 1, 1, 1 )
1/region = Rect2( 0, 0, 98, 89 )
1/tile_mode = 0
1/occluder_offset = Vector2( 49, 44.5 )
1/navigation_offset = Vector2( 49, 44.5 )
1/shape_offset = Vector2( 0, 0 )
1/shape_transform = Transform2D( 1, 0, 0, 1, 0, 0 )
1/shape_one_way = false
1/shape_one_way_margin = 0.0
1/shapes = [  ]
1/z_index = 0
2/name = "greenery_3"
2/texture = ExtResource( 2 )
2/tex_offset = Vector2( 0, 0 )
2/modulate = Color( 1, 1, 1, 1 )
2/region = Rect2( 0, 0, 102, 78 )
2/tile_mode = 0
2/occluder_offset = Vector2( 51, 39 )
2/navigation_offset = Vector2( 51, 39 )
2/shape_offset = Vector2( 0, 0 )
2/shape_transform = Transform2D( 1, 0, 0, 1, 0, 0 )
2/shape_one_way = false
2/shape_one_way_margin = 0.0
2/shapes = [  ]
2/z_index = 0
3/name = "greenery_4"
3/texture = ExtResource( 5 )
3/tex_offset = Vector2( 0, 0 )
3/modulate = Color( 1, 1, 1, 1 )
3/region = Rect2( 0, 0, 57, 45 )
3/tile_mode = 0
3/occluder_offset = Vector2( 28.5, 22.5 )
3/navigation_offset = Vector2( 28.5, 22.5 )
3/shape_offset = Vector2( 0, 0 )
3/shape_transform = Transform2D( 1, 0, 0, 1, 0, 0 )
3/shape_one_way = false
3/shape_one_way_margin = 0.0
3/shapes = [  ]
3/z_index = 0
4/name = "greenery_5"
4/texture = ExtResource( 9 )
4/tex_offset = Vector2( 0, 0 )
4/modulate = Color( 1, 1, 1, 1 )
4/region = Rect2( 0, 0, 59, 46 )
4/tile_mode = 0
4/occluder_offset = Vector2( 29.5, 23 )
4/navigation_offset = Vector2( 29.5, 23 )
4/shape_offset = Vector2( 0, 0 )
4/shape_transform = Transform2D( 1, 0, 0, 1, 0, 0 )
4/shape_one_way = false
4/shape_one_way_margin = 0.0
4/shapes = [  ]
4/z_index = 0
5/name = "greenery_6"
5/texture = ExtResource( 8 )
5/tex_offset = Vector2( 0, 0 )
5/modulate = Color( 1, 1, 1, 1 )
5/region = Rect2( 0, 0, 105, 86 )
5/tile_mode = 0
5/occluder_offset = Vector2( 52.5, 43 )
5/navigation_offset = Vector2( 52.5, 43 )
5/shape_offset = Vector2( 0, 0 )
5/shape_transform = Transform2D( 1, 0, 0, 1, 0, 0 )
5/shape_one_way = false
5/shape_one_way_margin = 0.0
5/shapes = [  ]
5/z_index = 0
6/name = "greenery_7"
6/texture = ExtResource( 6 )
6/tex_offset = Vector2( 0, 0 )
6/modulate = Color( 1, 1, 1, 1 )
6/region = Rect2( 0, 0, 48, 40 )
6/tile_mode = 0
6/occluder_offset = Vector2( 24, 20 )
6/navigation_offset = Vector2( 24, 20 )
6/shape_offset = Vector2( 0, 0 )
6/shape_transform = Transform2D( 1, 0, 0, 1, 0, 0 )
6/shape_one_way = false
6/shape_one_way_margin = 0.0
6/shapes = [  ]
6/z_index = 0
7/name = "greenery_8"
7/texture = ExtResource( 1 )
7/tex_offset = Vector2( 0, 0 )
7/modulate = Color( 1, 1, 1, 1 )
7/region = Rect2( 0, 0, 59, 50 )
7/tile_mode = 0
7/occluder_offset = Vector2( 29.5, 25 )
7/navigation_offset = Vector2( 29.5, 25 )
7/shape_offset = Vector2( 0, 0 )
7/shape_transform = Transform2D( 1, 0, 0, 1, 0, 0 )
7/shape_one_way = false
7/shape_one_way_margin = 0.0
7/shapes = [  ]
7/z_index = 0
8/name = "greenery_9"
8/texture = ExtResource( 7 )
8/tex_offset = Vector2( 0, 0 )
8/modulate = Color( 1, 1, 1, 1 )
8/region = Rect2( 0, 0, 163, 112 )
8/tile_mode = 0
8/occluder_offset = Vector2( 81.5, 56 )
8/navigation_offset = Vector2( 81.5, 56 )
8/shape_offset = Vector2( 0, 0 )
8/shape_transform = Transform2D( 1, 0, 0, 1, 0, 0 )
8/shape_one_way = false
8/shape_one_way_margin = 0.0
8/shapes = [  ]
8/z_index = 0
