[gd_scene load_steps=5 format=2]

[ext_resource path="res://actor/Bonus/LaunchedBonusTemplate.tscn" type="PackedScene" id=1]
[ext_resource path="res://actor/Bonus/Meteor/LaunchedMeteor.gd" type="Script" id=2]

[sub_resource type="CircleShape2D" id=1]
radius = 192.167

[sub_resource type="StreamTexture" id=2]
flags = 4
load_path = "res://.import/circle.png-3af02c2263b7cdc0f2f57b0d3a3e83e9.stex"

[node name="LaunchedMeteor" instance=ExtResource( 1 )]
script = ExtResource( 2 )
type = 6

[node name="CollisionShape2D" parent="." index="0"]
shape = SubResource( 1 )
disabled = true

[node name="Sprite" parent="." index="2"]
modulate = Color( 1, 0, 0, 0.196078 )
position = Vector2( -9.53674e-07, 9.53674e-07 )
scale = Vector2( 0.426667, 0.426667 )
texture = SubResource( 2 )
