[gd_scene load_steps=8 format=2]

[ext_resource path="res://assets/img/effects/Meteor_02.png" type="Texture" id=1]
[ext_resource path="res://effects/Meteor/Meteor.gd" type="Script" id=2]

[sub_resource type="CircleShape2D" id=1]
radius = 50.6215

[sub_resource type="Curve" id=2]
_data = [ Vector2( 0, 1 ), 0.0, -0.448296, 0, 0, Vector2( 1, 0.207955 ), -0.880861, 0.0, 0, 0 ]

[sub_resource type="CurveTexture" id=3]
curve = SubResource( 2 )

[sub_resource type="ParticlesMaterial" id=4]
flag_disable_z = true
gravity = Vector3( 0, 0, 0 )
angular_velocity = 100.0
angular_velocity_random = 0.1
orbit_velocity = 0.0
orbit_velocity_random = 0.0
scale = 0.5
scale_curve = SubResource( 3 )

[sub_resource type="Animation" id=5]
resource_name = "fall"
length = 2.0
tracks/0/type = "value"
tracks/0/path = NodePath("MeteorParticle:emitting")
tracks/0/interp = 1
tracks/0/loop_wrap = true
tracks/0/imported = false
tracks/0/enabled = true
tracks/0/keys = {
"times": PoolRealArray( 0, 0.1 ),
"transitions": PoolRealArray( 1, 1 ),
"update": 1,
"values": [ true, false ]
}
tracks/1/type = "method"
tracks/1/path = NodePath("MeteorParticle")
tracks/1/interp = 1
tracks/1/loop_wrap = true
tracks/1/imported = false
tracks/1/enabled = true
tracks/1/keys = {
"times": PoolRealArray( 0 ),
"transitions": PoolRealArray( 1 ),
"values": [ {
"args": [  ],
"method": "restart"
} ]
}
tracks/2/type = "method"
tracks/2/path = NodePath(".")
tracks/2/interp = 1
tracks/2/loop_wrap = true
tracks/2/imported = false
tracks/2/enabled = true
tracks/2/keys = {
"times": PoolRealArray( 2 ),
"transitions": PoolRealArray( 1 ),
"values": [ {
"args": [  ],
"method": "compute_damage"
} ]
}
tracks/3/type = "value"
tracks/3/path = NodePath("MeteorParticle:visible")
tracks/3/interp = 1
tracks/3/loop_wrap = true
tracks/3/imported = false
tracks/3/enabled = true
tracks/3/keys = {
"times": PoolRealArray( 0 ),
"transitions": PoolRealArray( 1 ),
"update": 1,
"values": [ true ]
}

[node name="Meteor" type="Area2D"]
z_index = 30
collision_mask = 7
script = ExtResource( 2 )

[node name="CollisionShape2D" type="CollisionShape2D" parent="."]
shape = SubResource( 1 )

[node name="MeteorParticle" type="Particles2D" parent="."]
emitting = false
amount = 1
lifetime = 2.0
one_shot = true
visibility_rect = Rect2( -1000, -1000, 2000, 2000 )
process_material = SubResource( 4 )
texture = ExtResource( 1 )

[node name="AnimationPlayer" type="AnimationPlayer" parent="."]
anims/fall = SubResource( 5 )
