;en;fr
KEY_TUTORIAL;Tutorial;Didacticiel
KEY_CAMPAIGN;Start Campaign;Démarrer Campagne
KEY_START;Start;Démarrer
KEY_OPTIONS;Options;Options
KEY_LEADERBOARD;Leaderboard;Classements
KEY_CREDIT;Credit;Crédit
KEY_EXIT;Exit;Sortir
KEY_LOAD_GAME;Load your game or start a new one;Charger une partie ou démarrer une nouvelle partie
KEY_REMOVE_SAVE;Remove a saved game;Supprimer une partie sauvegardée
KEY_NEW_GAME;New game;Nouvelle partie
KEY_REMOVE_SAVED;Remove save;Supprimer sauvegarde
KEY_SUBMIT_SCORE;Submit score;Publier le score
KEY_CONGRATULATION;Congratulation! You saved your colony!;Bravo! Vous avez sauvé votre colonie!
KEY_CONGRAT;Congratulation!;Bravo!
KEY_CLEAR_TUTORIAL;You successfully clear the tutorial. \nNow you can go to the main menu and try to clean the campaign.;Vous avez terminé le tutoriel.\nVous pouvez maintenant essayer de terminer la campagne.
KEY_UNLOCK_DONE;You have unlocked 2 Skill points by defeating all the waves.;Vous avez débloqué 2 points de compétence en détruisant toutes les vagues.
KEY_UNLOCK_CHALLENGE;You have unlocked 1 Skill point by achieving points challenge.;Vous avez débloqué 1 point de compétence en réussissant le défis de points.
KEY_SKILL_TREE;Skill tree;Arbre de compétences
KEY_SKILL_RESET;Reset Skills;Remise à zéro
KEY_RESUME;Resume game;Continuer la partie
KEY_STATS_COLLECTED_GOLD;Collected gold:;Or collecté:
KEY_STATS_SUPER_GOLD;Collected super gold:;Super or collecté:
KEY_STATS_ENEMY_KILL;Enemy kill:;Enemies tués:
KEY_STATS_BOSS_KILL;Boss kill:;Boss tués:
KEY_STATS_DRONE_DESTROYED;Drones destroyed:;Drones détruits:
KEY_STATS_TOWER_DESTROYED;Towers destroyed:;Tours détruites:
KEY_STATS_COLLECTED_GOLD2;Collected gold;Or collecté
KEY_STATS_SUPER_GOLD2;Collected super gold;Super or collecté
KEY_STATS_ENEMY_KILL2;Enemy kill;Enemies tués
KEY_STATS_BOSS_KILL2;Boss kill;Boss tués
KEY_STATS_DRONE_DESTROYED2;Drones destroyed;Drones détruits
KEY_STATS_TOWER_DESTROYED2;Towers destroyed;Tours détruites
KEY_LOSE_GAME;The colony has been erased from the zone.;Votre colonie a été éradiquée de la zone.
KEY_LOSE_WAVE;You survived {0} waves.;Vous avez survécu à {0} vagues.
KEY_LOSE_HALF_WAVES;You have unlocked 1 Skill point by defeating half the waves.;Vous avez débloqué 1 point de compétence en détruisant la moitié des vagues.
KEY_SCORE;Score;Score
KEY_POSITION_IN_LEADERBOARD;Position in leaderboard;Position dans le classement
KEY_POSITION;Position;Classement
KEY_WAVE;Wave:;Vague:
KEY_WAVE2;Wave;Vague
KEY_NAME;Name;Nom
KEY_TOWER_SMALL_TOOLTIP;High fire rate but small damage.\nHEALTH: %d\nDMG: %.1f\nFIRE-RATE: %.1f;Haute vitesse de tir mais faible dégats.\nVIE: %d\nDMG: %.1f\nVITESSE-TIR: %.1f
KEY_TOWER_SMALL_UPG1_TOOLTIP;Increase maximum number of drone slot by 1.;Augmente le nombre maximum possible de drone dans la tour de 1.
KEY_TOWER_SMALL_UPG2_TOOLTIP;Increase drone health by 25.;Augmente la vie des drones de 25.
KEY_TOWER_SMALL_UPG3_TOOLTIP;Increase drone damage by 1.;Augmente les dégats des drones de 1.
KEY_TOWER_SMALL_UPG4_TOOLTIP;Increase maximum number of drone by 4.;Augmente le nombre maximum possible de drone dans la tour de 4.
KEY_TOWER_THUNDER_TOOLTIP;Bounce between enemies.\nHEALTH: %d\nDMG: %.1f\nFIRE-RATE: %.1f;Les tirs rebondissent entre les enemies.\nVIE: %d\nDMG: %.1f\nVITESSE-TIR: %.1f
KEY_TOWER_THUNDER_UPG1_TOOLTIP;Increase maximum number of drone slot by 1.;Augmente le nombre maximum possible de drone dans la tour de 1.
KEY_TOWER_THUNDER_UPG2_TOOLTIP;Increase number of bounce by 1.;Augmente le nombre de rebond de 1.
KEY_TOWER_THUNDER_UPG3_TOOLTIP;Increase bouncing damage by 10%.;Augmente les dégats de rebond de 10%.
KEY_TOWER_THUNDER_UPG4_TOOLTIP;Increase number of bounce (1) and bouncing damage (10%).;Augmente le nombre de rebond (1) et les dégats de rebond (10%).
KEY_TOWER_BOMBER_TOOLTIP;Damage in area.\nHEALTH: %d\nDMG: %.1f\nFIRE-RATE: %.1f;Fait de gros dégats de zone.\nVIE: %d\nDMG: %.1f\nVITESSE-TIR: %.1f
KEY_TOWER_BOMBER_UPG1_TOOLTIP;Increase maximum number of drone slot by 1.;Augmente le nombre maximum possible de drone dans la tour de 1.
KEY_TOWER_BOMBER_UPG2_TOOLTIP;Increase drone speed by 50%.;Augmente la vitesse des drones de 50%.
KEY_TOWER_BOMBER_UPG3_TOOLTIP;Increase explosion damage by 5.;Augmente les dégats des explosions des drones de 5.
KEY_TOWER_BOMBER_UPG4_TOOLTIP;Set the ground in fire when a bomb explodes.;Mets le sol en feu pendant 5 secondes quand une bombe explose.
KEY_TOWER_HEALER_TOOLTIP;Heal allies.\nHEALTH: %d\nDMG: %.1f\nFIRE-RATE: %.1f;Soigne les alliés.\nVIE: %d\nDMG: %.1f\nVITESSE-TIR: %.1f
KEY_TOWER_HEALER_UPG1_TOOLTIP;Increase maximum number of drone slot by 1.;Augmente le nombre maximum possible de drone dans la tour de 1.
KEY_TOWER_HEALER_UPG2_TOOLTIP;Increase maximum target by 1.;Augmente le nombre de cible maximum de 1.
KEY_TOWER_HEALER_UPG3_TOOLTIP;Increase healing value by 20%.;Augmente la valeur de soin de 20%.
KEY_TOWER_HEALER_UPG4_TOOLTIP;Boost damage of the healing target by 20%.;Augmente les dégats de la cible soignée de 20%.
KEY_TOWER_SLOWER_TOOLTIP;Slow ennemies around him.\nHEALTH: %d\nDMG: %.1f\nFIRE-RATE: %.1f;Ralenti les enemies autour de lui.\nVIE: %d\nDMG: %.1f\nVITESSE-TIR: %.1f
KEY_TOWER_SLOWER_UPG1_TOOLTIP;Todo;Todo
KEY_TOWER_SLOWER_UPG2_TOOLTIP;Todo;Todo
KEY_TOWER_SLOWER_UPG3_TOOLTIP;Todo;Todo
KEY_TOWER_SLOWER_UPG4_TOOLTIP;Todo;Todo
KEY_TOWER_AGGRO_TOOLTIP;Takes damage but don't have drone.\nHEALTH: %d\nDMG: %.1f\nFIRE-RATE: %.1f;Encaisse les dégats mais ne possède pas de drone.\nVIE: %d\nDMG: %.1f\nVITESSE-TIR: %.1f
KEY_TOWER_AGGRO_UPG1_TOOLTIP;Todo;Todo
KEY_TOWER_AGGRO_UPG2_TOOLTIP;Todo;Todo
KEY_TOWER_AGGRO_UPG3_TOOLTIP;Todo;Todo
KEY_TOWER_AGGRO_UPG4_TOOLTIP;Todo;Todo
KEY_TOWER_SNIPER_TOOLTIP;Slow fire rate but high damage and distance.\nHEALTH: %d\nDMG: %.1f\nFIRE-RATE: %.1f;Vitesse de tir faible, longue portée, gros dégats.\nVIE: %d\nDMG: %.1f\nVITESSE-TIR: %.1f
KEY_TOWER_SNIPER_UPG1_TOOLTIP;Increase maximum number of drone slot by 1.;Augmente le nombre maximum possible de drone dans la tour de 1.
KEY_TOWER_SNIPER_UPG2_TOOLTIP;Increase attack distance.;Augmente la distance d'attaque.
KEY_TOWER_SNIPER_UPG3_TOOLTIP;Increase drone damage by 25.;Augmente les dégats des drones de 25.
KEY_TOWER_SNIPER_UPG4_TOOLTIP;The drones shot now pass through enemies.;Les tirs laser des drones traversent les enemies.
KEY_TOWER_FOCUS_TOOLTIP;Damages increase by focusing the same target.\nHEALTH: %d\nDMG: %.1f\nFIRE-RATE: %.1f;Les dégats augmentent en restant sur la même cible.\nVIE: %d\nDMG: %.1f\nVITESSE-TIR: %.1f
KEY_TOWER_FOCUS_UPG1_TOOLTIP;Increase maximum number of drone slot by 1.;Augmente le nombre maximum possible de drone dans la tour de 1.
KEY_TOWER_FOCUS_UPG2_TOOLTIP;Increase attack distance.;Augmente la distance d'attaque.
KEY_TOWER_FOCUS_UPG3_TOOLTIP;Increase drone starting damage by 1.;Augmente les dégats de départ des drones de 1.
KEY_TOWER_FOCUS_UPG4_TOOLTIP;Increase drone starting damage by 2.;Augmente les dégats de départ des drones de 2.
KEY_TOWER_BUY_NEW_DRONE;Buy a new drone.;Acheter un nouveau drone.
KEY_BUY_MINER;Buy a miner and send it to a deposit.\n(Click to highlight deposits);Acheter un mineur et l'envoyer sur un gisement (Cliquer pour mettre en évidence les gisements).
KEY_USE_COLLECTOR;Use your collector to gather ressources on the ground. (Click to highlight ressources);Envoyer un collecteur récolter les ressources qui sont au sol. (Cliquer pour mettre en évidence les ressources)
KEY_BUY_COLLECTOR;Buy a new collector.;Acheter un collecteur supplémentaire.
KEY_BONUS_REGEN;Healing zone for your towers and drones. Heals 2 life every 0.25 sec.;Soigne les alliés dans la zone de 2 VIE par 0.25 sec.
KEY_BONUS_INC_DAMAGE;Increase drone damage in the zone.;Augmente les dégats des drones dans la zone.
KEY_BONUS_INC_DEFENCE;Increase drone defense in the zone.;Augmente la defense des drones dans la zone.
KEY_BONUS_SLOW_ENEMIES;Slow enemies in the zone.;Ralenti les enemies dans la zone.
KEY_BONUS_METEOR;Call an orbital strike with a meteor that make 300 damage in small area.;Effectue une frappe orbitale qui fait 300 dégats dans une petite zone.
KEY_BONUS_LARGE_METEOR;Call an orbital strike with a meteor that make 100 damage in large area.;Effectue une frappe orbitale qui fait 100 dégats dans une grande zone.
KEY_BONUS_REGEN_NAME;Regen Life;Regénération de vie
KEY_BONUS_INC_DAMAGE_NAME;Increase Damage;Augmentation de dégats
KEY_BONUS_INC_DEFENCE_NAME;Increase Defense;Augmentation de défence
KEY_BONUS_SLOW_ENEMIES_NAME;Slow enemies;Ralentissement d'énemies
KEY_BONUS_METEOR_NAME;Small Meteor;Petite météorite
KEY_BONUS_LARGE_METEOR_NAME;Large Meteor;Grosse météorite
KEY_BONUS_REGEN_STATS;- Area: Large\n- Target: Allies\n- Health: 2.0\n- Rate: 4.0\n- Duration: 10.0s;- Zone: Grande\n- Cible: Alliés\n- Vie: 2.0\n- Fréquence: 4.0\n- Durée: 10.0s
KEY_BONUS_INC_DAMAGE_STATS;- Area: Large\n- Target: Allies\n- Damage percent increase: 25.0\n- Duration: 10.0s;- Zone: Grande\n- Cible: Alliés\n- Augmentation de dégats: 25.0%\n- Durée: 10.0s
KEY_BONUS_INC_DEFENCE_STATS;- Area: Large\n- Target: Allies\n- Damage reduction percent: 50.0\n- Duration: 10.0s;- Zone: Grande\n- Cible: Alliés\n- Réduction de dégats: 50.0%\n- Durée: 10.0s
KEY_BONUS_SLOW_ENEMIES_STATS;TODO;TODO
KEY_BONUS_METEOR_STATS;- Area: Small\n- Target: All ground units\n- Damage: 300.0;- Zone: Petite\n- Cible: Toute unité terrestre\n- Dégats: 300.0
KEY_BONUS_LARGE_METEOR_STATS;- Area: Large\n- Target: All ground units\n- Damage: 100.0;- Zone: Grande\n- Cible: Toute unité terrestre\n- Dégats: 100.0
KEY_GOLD_TOOLTIP;Gold can be obtained by mining deposit and collecting it on the ground.;L'or peut être obtenu en minant les gisements et récoltant les ressources au sol.
KEY_SUPER_GOLD_TOOLTIP;Super Gold can only be obtained by killing bosses.;Le super or ne peut être obtenu qu'en tuant des boss.
KEY_XP_AVAILABLE;Experience available;Expérience disponible
KEY_XP_USED;Experience used;Expérience utilisée
KEY_MUSIC_VOLUME;Music volume;Volume de la musique
KEY_EFFECT_VOLUME;Effect volume;Volume des effets
KEY_SAVE;Save;Sauvegarder
KEY_LEVEL1;Level 1;Niveau 1
KEY_LEVEL2;Level 2;Niveau 2
KEY_LEVEL3;Level 3;Niveau 3
KEY_LEVEL4;Level 4;Niveau 4
KEY_LEVEL5;Level 5;Niveau 5
KEY_LEVEL6;Level 6;Niveau 6
KEY_NORMAL;Normal;Normal
KEY_HARD;Hard;Difficile
KEY_STRATEGY_FIRST_SEEN;Strategy: First seen. Drones target the first enemy that enter the tower area of effect.;Stratégie: Premier vu. Les drones attaquent le premier enemie entrée dans la zone de detection.
KEY_STRATEGY_MOST_HEALTH;Strategy: Most health. Drones target the enemy with the most current health.;Stratégie: Le plus de vie. Les drones attaquent l'enemie avec le plus de vie actuellement.
KEY_STRATEGY_LEAST_HEALTH;Strategy: Least health. Drones target the enemy with the least current health.;Stratégie: Le moins de vie. Les drones attaquent l'enemie avec le moins de vie actuellement.
KEY_STRATEGY_MOST_MAX_HEALTH;Strategy: Most max health. Drones target the enemy with the most maximum health.;Stratégie: Le plus de vie max. Les drones attaquent l'enemie avec le plus de vie maximum.
KEY_STRATEGY_LEAST_MAX_HEALTH;Strategy: Least max health. Drones target the enemy with the least maximum health.;Stratégie: Le moins de vie max. Les drones attaquent l'enemie avec le moins de vie maximum.
KEY_ON_GROUND;On ground:;Au sol:
KEY_TUTORIAL_STEP0_1;The enemy is attacking your core from the east. you must protect it!!;L'enemie attaque votre base depuis l'est.
KEY_TUTORIAL_STEP0_2;Click on the first tower and place 2 Towers on the right of your core.(in the area);Cliquez sur la première tour et placez 2 tours à droite de votre base.(dans la zone)
KEY_TUTORIAL_STEP1_1;You can move your camera by maintaining middle mouse button (or WASD). You can also zoom in and out with the scroll.;Vous pouvez déplacer la caméra en maintenant le bouton du milieu de la souris (ou ZQSD). Vous pouvez aussi zoomer avec la molette.
KEY_TUTORIAL_STEP2_1;You must gather ressources to build more towers!;Vous devez récolter des ressources pour construire plus de tours!
KEY_TUTORIAL_STEP2_2;Click on the miner button and select a deposit on the map.;Cliquez sur le bouton du mineur et selectionnez un gisement sur la carte.
KEY_TUTORIAL_STEP3_1;Now, gather the minerals with the collector drone!(Collect 75 gold);Maintenant, récoltez le minerai au sol avec le drone collecteur!(Collectez 75 or)
KEY_TUTORIAL_STEP3_2;Click on the button and click on the map where you want to collect minerals.;Cliquez sur le bouton puis sur la carte aux endroits ou vous souhaitez que le drone passe.
KEY_TUTORIAL_STEP3_3;Send the collector in this area when miner has extracted the minerals. He will collect everything on its path.;Envoyez le collecteur dans cette zone quand le mineur aura extrait des minerais.
KEY_TUTORIAL_STEP5_1;You can upgrade your towers by clicking on it and select the upgrade.;Vous pouvez améliorer vos tours en cliquant dessus et en sélectionnant une amélioration.
KEY_TUTORIAL_STEP5_2;Buy 2 maximum drone slot and buy 2 drones. (it needs gold);Achetez 2 emplacements de drone maximum puis achetez 2 drones. (nécessite de l'or)
KEY_SKILLTREE_1_1;Unlock the STANDARD drone airport. (always unlocked);Débloque la tour de lancement pour drone standard. (débloqué par défaut)
KEY_SKILLTREE_1_2;Increase drone damage by 1. (cost 2 XP);Augmente les dégats du drone standard de 1. (coute 2 XP)
KEY_SKILLTREE_1_3;Increase drone attack speed and unlock sniper drone tower. (cost 3 XP);Augmente la vitesse d'attaque du drone standard et débloque la tour sniper. (coute 3 XP)
KEY_SKILLTREE_1_4;Add one drone when you build this airport. (cost 4 XP);Ajoute un drone lors de la construction de la tour standard. (coute 4 XP)
KEY_SKILLTREE_2_1;Unlock the HEALING drone airport. (cost 1 experience points);Débloque la tour pour drone de réparation. (coute 1 point d'expérience)
KEY_SKILLTREE_2_2;Increase drone heal by 0.5 every 0.2 seconds. (cost 2 XP);Augmente les soins du drone de 0.5 chaque 0.2 seconde. (coute 2 XP)
KEY_SKILLTREE_2_3;Increase drone heal by 1.0 every 0.2 seconds and unlock focused laser drone tower. (cost 3 XP);Augmente les soins de 1.0 chaque 0.2 seconde et débloque la tour laser focalisé. (coute 3 XP)
KEY_SKILLTREE_2_4;Boost defense of healed target. (cost 4 experience points);Augmente la défense des cibles soignées par le drone de soin. (coute 4 XP)
KEY_SKILLTREE_3_1;Unlock the THUNDER drone airport. (cost 1 experience points);Débloque la tour pour drone tonnerre. (coute 1 point d'expérience)
KEY_SKILLTREE_3_2;Increase drone damage by 5. (cost 2 experience points);Augmente les dégats du drone tonnerre de 5. (coute 2 XP)
KEY_SKILLTREE_3_3;Increase bounce damage. (cost 3 experience points);Augmente les dégats de rebond du tonnerre de 10%. (coute 3 XP)
KEY_SKILLTREE_3_4;Increase drone attack speed. (cost 4 experience points);Augmente la vitesse d'attaque du drone tonnerre. (coute 4 XP)
KEY_SKILLTREE_4_1;Unlock the BOMBER drone airport. (cost 1 experience points);Débloque la tour pour drone bombardier. (coute 1 point d'expérience)
KEY_SKILLTREE_4_2;Increase drone damage by 5. (cost 2 experience points);Augmente les dégats du drone bombardier de 5. (coute 2 XP)
KEY_SKILLTREE_4_3;Increase drone attack speed. (cost 3 experience points);Augmente la vitesse d'attaque du drone bombardier. (coute 3 XP)
KEY_SKILLTREE_4_4;Increase bomb area of effect. (cost 4 experience points);Augmente la zone d'effect des bombes. (coute 4 XP)
KEY_SKILLTREE_5_1;Increase collector speed and start with 50 more gold. (cost 1 experience points);Augmente la vitesse du collecteur et commence chaque partie avec 50 or supplémentaire. (coute 1 XP)
KEY_SKILLTREE_5_2;Start with one more collector. (cost 2 experience points);Commence chaque partie avec 1 collecteur de plus. (coute 2 XP)
KEY_SKILLTREE_5_3;Add one point to the collector path. (cost 3 experience points);Ajoute un point supplémentaire pour le chemin des collecteurs. (coute 3 XP)
KEY_SKILLTREE_5_4;You can buy 1 more miner per deposit. (cost 4 experience points);Permet d'acheter 2 mineurs par gisement. (coute 4 XP)
KEY_START_WAVE;Start wave;Commencer
KEY_PREVIOUS;Previous;Précédent
KEY_NEXT;Next;Suivant
KEY_RETRY;Retry;Re-essayer
KEY_CODEX;Codex;Codex
KEY_TOWER_SMALL_DESCRIPTION;Spawn small drone with low health that shot fast laser to enemies. Efficient against every enemy types.\nYou can increase health, firepower and get a large number of drone inside your tower.;Crée de petits drones avec peu de vie mais qui tirent rapidement. Efficace contre tous types d'enemies.\nVous pouvez améliorer la vie, la puissance de feu et aussi obtenir un grand nombre de drones dans cette tour.
KEY_TOWER_THUNDER_DESCRIPTION;Spawn drones that shot bouncing thunder bolt. Very efficient against large number of compact targets.\nYou can increase the number of bounce and their damages.;Crée des drones qui tirent des éclairs rebondissant. Trés efficace contre les ennemis regroupés.\nVous pouvez augmenter le nombre de rebonds ainsi que leurs dégats.
KEY_TOWER_BOMBER_DESCRIPTION;Spawn slow bomber drones. They get a lot of life making them tank enemy shots.\nYou can increase their speed, damage and put the ground on fire.;Crée des drones bombardier lent. Ils possèdent beaucoup de vie ce qui en font des bons tanks contre les tirs ennemis.\nVous pouvez augmenter leur vitesse, dégats ainsi qu'enflammer le sol.
KEY_TOWER_HEALER_DESCRIPTION;Spawn drones that heal allies and towers.\nYou can increase healing, the number of target and the damages done by healed target.;Crée des drones qui soignent leurs alliés et les tours.\nVous pouvez augmenter les soins, le nombre de cible et augmenter les dégats fait par les cibles soignées.
KEY_TOWER_SLOWER_DESCRIPTION;TODO;TODO
KEY_TOWER_AGGRO_DESCRIPTION;TODO;TODO
KEY_TOWER_SNIPER_DESCRIPTION;Spawn slow sniper drones. They shot very powerful blast at far distance. Very efficient against isolated and large life enemies.\nYou can increase shot distance, damage and even make shots pass through enemies.;Crée des drones sniper lent. Ils tirent des lasers très puissant d'une très grande distance. Efficace contre les ennemis isolés avec beaucoup de vie.\nVous pouvez augmenter la distance, les dégats ainsi que rendre les tirs laser traversant.
KEY_TOWER_FOCUS_DESCRIPTION;Spawn drones that focus their laser against a specific enemy. Laser gain damage each second it stay on the same enemy. Very efficient against large life enemies.\nYou can increase damage and shot distance.;Crée des drones qui un laser continu sur un ennemi spécifique. Le laser gagne en puissance chaque seconde où il reste sur un même ennemi.\Vous pouvez augmenter les dégats ainsi que la distance.
KEY_HEALTH;Health;Points de vie
KEY_DAMAGE;Damage;Dégats
KEY_FIRE_RATE;Fire-Rate;Vitesse de tir
KEY_MOVE_SPEED;Move speed;Vitesse de déplacement
KEY_TOWER_PRICE;Tower Price;Prix de la tour
KEY_TOWER_HEALTH;Tower Health;Points de vie de la tour
KEY_DRONE_PRICE;Drone Price;Prix d'un drone
KEY_DRONE_NUMBER;Drone Number;Nombre de drones
KEY_DRONE_HEALTH;Drone Health;Points de vie des drones
KEY_DRONE_DAMAGE;Drone Damage;Dégats des drones
KEY_DRONE_FIRE_RATE;Drone Fire-Rate;Vitesse d'attaque des drones
KEY_ENEMY_TANK1_TOOLTIP;High fire rate but small damage. Be careful, this tank will focus your drones in priority.;Haute vitesse d'attaque mais faible dégats. Attention, ce tank va cibler en priorité vos drones.
KEY_ENEMY_TANK2_TOOLTIP;High fire rate but small damage. This tank only focus your towers and Core.;Haute vitesse d'attaque mais faible dégats. Ce tank va cibler uniquement les tours et le Core.
KEY_ENEMY_TANKHEAL_TOOLTIP;This tank repairs all enemies in the area.;Ce tank va réparer tous les enemies dans la zone.
KEY_ENEMY_SHIP1_TOOLTIP;Fast moving jet that will focus your Core.;Avion de combat rapide qui va cibler votre Core.
KEY_ENEMY_SHIP2_TOOLTIP;Slow moving jet with lot of life that will focus your Core.;Bombardier lent avec beaucoup de vie qui va cibler votre Core.
KEY_ENEMY_BIGTANK_TOOLTIP;Tank with massive health. It can do area damage but has slow fire-rate.;Tank avec beaucoup de points de vie. Il ciblera les batiments mais avec une zone de dégats.
KEY_ENEMY_TANK1BOSS_TOOLTIP;This tank has 4 laser turrets but only focus your towers and Core.;Ce tank possède 4 tourelles laser qui cibleront vos tours et votre Core.
KEY_ENEMY_TANK2BOSS_TOOLTIP;TODO;TODO
KEY_ENEMY_SHIP1BOSS_TOOLTIP;TODO;TODO
KEY_ENEMY_SHIP2BOSS_TOOLTIP;TODO;TODO
KEY_LEVEL1_NORMAL_DESCRIPTION;Your first mission is to defend our desert military base. This small base is an outpost we can't lose. All the ressources for the other bases come from here.\n\nThe enemy will attack with fast tank but our spy have also seen tanks able to attack our drones!\n\nGood luck with this first mission, we trust you!;Votre première mission est de défendre notre base militaire dans le désert. Cette petite base est un avant-poste que nous ne pouvons pas perdre. Toutes les ressources pour les autres bases viennent d'ici.\n\nLes ennemis vont attaquer avec des tanks rapide mais nos espions ont détectés des tanks capable d'attaquer directement nos drones!\n\nBonne chance pour cette première mission, nous avons confiance en vous!
KEY_LEVEL2_NORMAL_DESCRIPTION;Congratulation for your first defense, I knew I can trust you!\n\nDuring this second mission, you will defend our base located in the boreal forest.\n\nThe enemy is sending some tanks to our base! Be careful, they seems to have created tank which can repair the tanks around it. Destroy these tanks in priority!;Bravo pour votre première défense, je savais que je pouvais vous faire confiance!\n\nPendant cette deuxième mission, vous défendrez notre base située dans la foret boréale.\n\nL'ennemi envoie plusieurs tank en direction de notre base! Faites attention, il semblerait qu'ils aient réussi à créer un tank capable de réparer les tanks autour de lui. Détruisez ces tanks en priorité!
KEY_LEVEL3_NORMAL_DESCRIPTION;The tropical zone is an important ressource provider. This base is often under pressure with many attacks.\n\nStop the enemy attacks to leave us gather food for the local population.\n\nThe enemy finally succeed to create effecient jet fighter and they will focus your core with fast jet.;La zone tropicale est une importante fournisseuse de ressources. Cette base est souvent sous pression avec beaucoup d'attaques incessantes.\n\nArretez les attaques ennemies afin de nous laisser récolter de la nourriture pour la population locale.\n\nLes ennemis ont finalement réussi à créer des avions de combat et ils vont cibler votre Core avec des avions rapide.
KEY_LEVEL4_NORMAL_DESCRIPTION;This time, the enemy try to do a fast attack on our south pole base.\n\nThe enemy has created large and heavy ship which can take a lot of damage. Check out where they come from and destroy them before they reach your Core.;Cette fois, les ennemis lancent un assaut rapide sur notre base du pôle sud.\n\nLes ennemis ont créés des énormes vaisseaux capable d'encaisser de fort dégats. Detectez d'ou ils viennent afin de les détruire avant qu'il n'atteignent votre Core.
KEY_LEVEL5_NORMAL_DESCRIPTION;Our last base on the planet is hidden near to a volcano. This base is difficult to protect due to the lava around it.\n\nTry to find a good strategy to destroy the enemy before they reach the Core.\n\nA very big tank with area damage will try to blow our defenses. Be careful to not group all your defenses!;Notre dernière base sur la planète est cachée proche d'un volcan. Cette base est difficile à défendre à cause de la lave autour d'elle.\n\nEssayez de trouver le bonne stratégie pour détruire les ennemis avant qu'ils n'atteignent le Core.\n\nDes gros tanks avec des dégats de zones vont essayer de réduire nos défenses en cendres. Faites attention à ne pas trop grouper vos défenses!
KEY_LEVEL6_NORMAL_DESCRIPTION;This last fight will be located on the Thukothea moon! The enemy is launching a last assault to destroy the base which allows us to create colony on other planet.\n\nBe careful, on moon we cannot have a good detection on the enemies and they will not wait between each waves.;Ce dernier combat se situera sur la lune de Thukothea! Les ennemis envoient un dernier assaut pour détruire la base qui nous permet de créer de nouvelles colonies sur les autres planètes.\n\nAttention, sur la lune nos radar fonctionnent trés mal pour detecter les ennemis. Ils vont de plus attaquer trés rapidement entre chaque vagues.
KEY_LEVEL1_HARD_DESCRIPTION;The enemy has found new material to improve its armor and weapons! Now, the enemy has 50% more HP and does 50% more damage.\n\nMake the correct choices in your improvements to defeat them.;Les ennemis ont trouvé un nouveau matériau permettant d'améliorer leurs blindages ainsi que leurs armes! Maintenant, les ennemis ont 50% plus de vie et font 50% de dégats en plus.\n\nFaites les bons choix dans vos améliorations afin de les battre.
KEY_LEVEL2_HARD_DESCRIPTION;With this new power, the enemy wants to make huge damage to our drones!\n\nThey will mostly send explosive tank and drone killer on our base trying to shutdown our defenses.;Avec cette nouvelle puissance, les ennemis vont essayer de faire de gros dégats à vos drones!\n\nIls vont principalement envoyer des tanks lourd et des tueurs de drone vers votre base pour essayer de supprimer vos défenses.
KEY_LEVEL3_HARD_DESCRIPTION;The enemy comes back to the tropical zone with big armored vehicles.\n\nAdapt your tower placement to destroy the armored jet.;Les ennemis reviennent dans la zone tropicale avec des vehicules blindés.\n\nAdaptez votre placement de tours afin de détruire les avions blindés.
KEY_LEVEL4_HARD_DESCRIPTION;A lot of fast enemies are heading to your south pole base.\n\nAdapt your defenses to do massive destruction.;Une grande quantité d'ennemis approchent de votre base du pole sud.\n\nAdaptez vos défenses pour faire de la destruction de masse.
KEY_LEVEL5_HARD_DESCRIPTION;This is the final battle on the planet Thukothea.\n\nThe enemy is sending every kind of tank to destroy this base.\n\nGood luck!;C'est la dernière bataille sur la planète Thukothea.\n\nLes ennemis envoient tous leurs types de tank afin de détruire cette base.\n\nBonne chance!
KEY_LEVEL6_HARD_DESCRIPTION;This will be a massive assault on our moon base.\n\nThe enemy has scrambled our communications. We cannot warn you about the arriving enemies.\n\nPlace defenses everywhere to be sure to stop the enemies.;Un assaut massif sur notre base lunaire est en préparation.\n\nLes ennemis ont brouillés nos communications. Nous ne pouvons plus vous avertir des différents assauts.\n\nPlacez des défenses de partout afin d'être sur de détruire les ennemis.
KEY_UNLOCKED_HARD;You have unlocked the hard mode! Enjoy the real challenge!;Vous avez débloqué le mode difficile! Découvrez maintenant le vrai challenge!
KEY_FINISH_GAME;Congratulation, you have finish the game in HARD mode! Thanks for playing!;Bravo, vous avez terminé le jeu en mode difficile! Merci d'avoir joué!
KEY_ENTER_NAME;Enter your captain nickname;Tapez votre pseudo de capitaine
KEY_SUBMIT;Submit;Ok
KEY_CANCEL;Cancel;Annuler
KEY_ENEMIES;Enemies;Ennemis
KEY_TOWERS;Towers;Tours
KEY_USABLE;Usable;Utilisable
KEY_LEVEL1_NORMAL_W1;Enemies are coming from the EAST. Prepare your defenses and don't forget to mine ressource deposit.;Les ennemis arrivent par l'EST. Préparez vos défenses et n'oubliez pas de miner des ressources.
KEY_LEVEL1_NORMAL_W2;More enemies are coming from the EAST. Improve your defenses. Don't forget to collect the usable on the ground.;Plus d'ennemis arrivent à l'EST. Améliorez vos défenses. N'oubliez pas de récolter les objets au sol.
KEY_LEVEL1_NORMAL_W3;Enemy has a new tank with more life and focusing your drones. Adapt your tower strategy to kill them first.;Les ennemis ont de nouveaux tanks qui ciblent les drones. Adaptez la stratégie de vos tours pour les tuer en premier.
KEY_LEVEL1_NORMAL_W4;A BOSS is coming from the EAST. Adapt your strategy and stop him!;Un BOSS arrive par l'EST. N'oubliez pas d'adapter la stratégie de vos tours pour l'arreter!
KEY_LEVEL1_NORMAL_W5;Enemies are coming from the WEST. Build new defenses to stop them!;Les ennemis arrivent maintenant par l'OUEST. Construisez de nouvelles defenses pour les arreter!
KEY_LEVEL1_NORMAL_W6;Be careful, bigger tanks are coming from EAST and WEST.;Attention, des tueurs de drones arrivent par l'EST et l'OUEST.
KEY_LEVEL1_NORMAL_W7;Enemies are coming from EAST and WEST.;Les ennemis continuent d'arriver par l'EST et l'OUEST.
KEY_LEVEL1_NORMAL_W8;BOSS are coming from EAST and WEST. This is the last attack. Use all your defenses and adapt your strategy.;Des BOSS arrivent par l'EST et l'OUEST. C'est leur dernière attaque! Utilisez toutes vos défenses et adaptez votre stratégie!
KEY_LEVEL2_NORMAL_W1;Fast tanks are coming from the EAST. Prepare your defenses and don't forget to mine ressource deposit.;Des tanks rapide arrivent par l'EST. Préparez vos défenses et n'oubliez pas de miner des ressources.
KEY_LEVEL2_NORMAL_W2;Fast tank are coming from both EAST path. Concentrate your firepower!;Des tanks rapide arrivent par les deux chemins de l'EST. Concentrez votre puissance de frappe!
KEY_LEVEL2_NORMAL_W3;Warning! Drone killer are coming with the fast tanks. Adapt your towers strategy!;Attention! Des tueurs de drone se cachent parmis les tanks rapide. Adaptez les stratégies de vos tours!
KEY_LEVEL2_NORMAL_W4;A BOSS is coming from EAST. Be careful!;Un boss arrive par l'EST. Soyez prudent!
KEY_LEVEL2_NORMAL_W5;The enemy is attacking on each side! Build new defenses!;Les ennemis attaquent de tous les cotés! Construisez de nouvelles defenses!
KEY_LEVEL2_NORMAL_W6;The enemy continues to send fast tanks and drone killers.;Les ennemis continuent d'envoyer des tanks rapide et des tueurs  de drone.
KEY_LEVEL2_NORMAL_W7;Enemy has discovered a repair tank. It can repair all the tanks around him and has a lot of life!;Les ennemis ont inventé un tank réparateur. Il possède beaucoup de vie et est capable de réparer tous les tanks autour de lui.
KEY_LEVEL2_NORMAL_W8;Bosses are coming on each path. You will need a lot of firepower!;Des boss arrivent sur chaque chemin. Vous allez avoir besoin de plus de puissance!
KEY_LEVEL3_NORMAL_W1;Enemies are coming from the EAST and SOUTH with drone killers. Prepare your defenses and don't forget to mine ressource deposit.;Les ennemis arrivent de l'EST et le SUD avec des tueurs de drone. Preparez vos défenses et n'oubliez pas de miner des ressources.
KEY_LEVEL3_NORMAL_W2;Enemies are coming from EAST and SOUTH. Concentrate your firepower!;Les ennemis viennent de l'EST et du SUD. Concentrez vos puissance de feu!
KEY_LEVEL3_NORMAL_W3;They are changing their strategy and now attack from SOUTH and NORTH. Adapt your defenses.;Ils changent leur stratégie en attaquant du SUD et du NORD. Adaptez vos défenses.
KEY_LEVEL3_NORMAL_W4;A BOSS is coming from SOUTH. Other enemies are coming from EAST and NORTH. Be careful!;Un boss arrive du SUD. D'autres ennemis viennent depuis les routes du NORD et de l'EST.
KEY_LEVEL3_NORMAL_W5;Enemies have just discovered how to build planes. They can come from everywhere and focus your Core. Protect each sides!;Les ennemis ont découvert comment construire des avions. Ils peuvent venir de n'importe ou et vont cibler votre Core. Protegez tous les cotés!
KEY_LEVEL3_NORMAL_W6;Enemies continu to increase their firepower!;Les ennemis continuent d'augmenter leur puissance de frappe!
KEY_LEVEL3_NORMAL_W7;Repair tanks are coming to help the enemies.;Des tanks de réparation arrivent pour aider les ennemis.
KEY_LEVEL3_NORMAL_W8;Bosses are coming to blow our Core. You will need a lot of firepower!;Des boss sont en chemin pour détruire notre Core. Vous allez avoir besoin de plus de puissance!
KEY_LEVEL4_NORMAL_W1;Enemies are coming from the WEST and SOUTH but also with fast jet. Prepare your defenses and don't forget to mine ressource deposit.;Les ennemis vont arriver de l'OUEST et du SUD mais aussi avec des avions. Préparez vos défenses et n'oubliez pas de miner des ressources.
KEY_LEVEL4_NORMAL_W2;Repair tanks are coming to help the enemies.;Des tanks de réparation arrivent pour aider les ennemis.
KEY_LEVEL4_NORMAL_W3;The enemy is now also attacking from the NORTH. Adapt your strategy.;Les ennemis attaquent maintenant aussi par le NORD. Adaptez votre stratégie.
KEY_LEVEL4_NORMAL_W4;A BOSS is coming from WEST. Be careful!;Un BOSS arrive par l'OUEST. Soyez prudent!
KEY_LEVEL4_NORMAL_W5;Enemy can now send big armored jet. It can absorb a lot of shot so be careful.;Les ennemis peuvent maintenant envoyer des gros avions blindés. Ils peuvent absorber beaucoup de dégats. Soyez prudent!
KEY_LEVEL4_NORMAL_W6;Two armored jet are heading to our Core. Destroy them quickly.;Deux avions blindés se dirigent vers votre Core. Détruisez les rapidement.
KEY_LEVEL4_NORMAL_W7;A lot of jet are coming. Your Core is in danger.;Beaucoup d'avions sont en route. Votre Core est en danger.
KEY_LEVEL4_NORMAL_W8;Bosses are coming on each path with armored jet and repair tanks. You will need a lot of firepower!;Des boss arrivent de chaque chemin accompagnés de tanks de réparation. Des avions blindés vont aussi essayer d'attaquer.
KEY_LEVEL5_NORMAL_W1;Drone killers are coming from everywhere. Prepare your defenses and don't forget to mine ressource deposit.;Des tueurs de drone arrivent de tous les cotés. Préparez vos défenses et n'oubliez pas de miner les ressources.
KEY_LEVEL5_NORMAL_W2;Enemies send ship fighter directly to our base! Defend it!;Les ennemis envoient des avions de combat rapide directement sur votre base!
KEY_LEVEL5_NORMAL_W3;Enemies are using only fast vehicles.;Les ennemis envoient leurs véhicules rapide.
KEY_LEVEL5_NORMAL_W4;Boss are coming from every direction. Increase your firepower to kill them.;Des boss arrivent de chaque direction. Augmentez votre puissance d'attaque pour les détruire.
KEY_LEVEL5_NORMAL_W5;Enemies have new dangerous tank! The can do area damage and have huge armor.;Les ennemis ont un nouveau tank trés dangereux. Il peut faire des dégats de zone et ont une trés grosse armure.
KEY_LEVEL5_NORMAL_W6;Enemies continu to harass you with lot of tanks and jet.;Les ennemis continuent de vous harceler avec beaucoup de tanks et d'avions.
KEY_LEVEL5_NORMAL_W7;Enemies are everywhere!;Les ennemis sont partout!
KEY_LEVEL5_NORMAL_W8;Enemies are sending all their firepower. Boss, armored tank and jet will try to destroy you Core.;Les ennemis envoient toute leur puissance d'attaque. Des boss, des tanks et des avions blindés vont essayer de détruire votre Core.
KEY_LEVEL6_NORMAL_W1;Fast tank are coming from the EAST.;Des tanks rapide arrivent par l'EST.
KEY_LEVEL6_NORMAL_W2;Enemies are coming from EAST and N-E.;Les ennemis arrivent de l'EST et N-E.
KEY_LEVEL6_NORMAL_W3;More enemies are coming. Prepare yourself!;Plus d'ennemis arrivent. Preparez vous!
KEY_LEVEL6_NORMAL_W4;A Boss is coming from the EAST;Un boss arrive par l'EST.
KEY_LEVEL6_NORMAL_W5;Enemies comes from almost everywhere.;Les ennemis viennent de quasiment partout.
KEY_LEVEL6_NORMAL_W6;Fast jet are heading to your base!;Des avions vont cibler votre Core!
KEY_LEVEL6_NORMAL_W7;More enemies are coming. Prepare yourself!;Plus d'ennemis arrivent. Preparez vous!
KEY_LEVEL6_NORMAL_W8;Repair tanks will help the enemies.;Des tanks de réparation vont venir en renfort des ennemis.
KEY_LEVEL6_NORMAL_W9;Lots of jet are heading to your base!;Un nombre important d'avions ciblent votre base!
KEY_LEVEL6_NORMAL_W10;More enemies are coming. Prepare yourself!;Plus d'ennemis arrivent. Preparez vous!
KEY_LEVEL6_NORMAL_W11;Enemies are coming from everywhere.;Les ennemis arrivent de toutes les directions.
KEY_LEVEL6_NORMAL_W12;Two boss are coming for this last fight!;Deux boss arrivent pour ce dernier combat!
KEY_LEVEL1_HARD_W1;Enemies are coming from the EAST. Don't forget to protect your deposit as the enemis hit harder now.;Les ennemis arrivent par l'EST. N'oubliez pas de proteger vos ressources maintenant que les tanks sont plus puissant.
KEY_LEVEL1_HARD_W2;Jet fighter are coming to help the enemy.;Des avions de combat viennent renforcer les ennemis.
KEY_LEVEL1_HARD_W3;Warning, an armored tank comes from the WEST.;Attention, un tank blindé arrive par l'OUEST.
KEY_LEVEL1_HARD_W4;A boss is coming from EAST.;Un boss arrive par l'EST.
KEY_LEVEL1_HARD_W5;Tanks and jet are coming from everywhere.;Des tanks et des avions arrivent de partout.
KEY_LEVEL1_HARD_W6;Armored ship joined the fight.;Des avions blindés rejoignent le combat.
KEY_LEVEL1_HARD_W7;Improve your defenses.;Améliorez encore vos défenses.
KEY_LEVEL1_HARD_W8;Multiple boss are heading to your Core.;Plusieurs boss se dirigent vers votre Core.
KEY_LEVEL2_HARD_W1;Enemies are coming from all direction.;Les ennemis viennent de toutes les directions.
KEY_LEVEL2_HARD_W2;Fast jet and armored tanks are coming!;Des avions rapide et des tanks blindés arrivent!
KEY_LEVEL2_HARD_W3;A lot of fast jet are heading to your Core.;Beaucoup d'avions de combat arrivent vers votre Core.
KEY_LEVEL2_HARD_W4;Boss are coming from everywhere.;Des boss arrivent de toutes les directions.
KEY_LEVEL2_HARD_W5;Huge number of enemies are coming!;Un grand nombre d'ennemis arrivent!
KEY_LEVEL2_HARD_W6;Drone killer are coming from everywhere.;Des tueurs de drone arrivent de toutes les directions.
KEY_LEVEL2_HARD_W7;Only armored jet are coming.;Seul des avions blindés arrivent.
KEY_LEVEL2_HARD_W8;Some boss are coming!;Des boss arrivent!
KEY_LEVEL3_HARD_W1;Warning, armored jet are going directly to your base from EAST and WEST. They have a lot of life.;Attention, les avions blindés se dirigent directement sur votre base depuis l'EST et l'OUEST.
KEY_LEVEL3_HARD_W2;Big tank and jet are coming from EAST and WEST.;Des tanks et avions blindés viennent de l'EST et l'OUEST.
KEY_LEVEL3_HARD_W3;Big tanks come from WEST and NORTH. Armored jet come from EAST and WEST.;De gros tanks arrivent de l'OUEST et du NORD. Les avions blindés continuent d'arriver de l'EST et l'OUEST.
KEY_LEVEL3_HARD_W4;Warning, BOSS come from everywhere! Armored jet also come from EAST and WEST!;Attention, des boss arrivent de partout! Des avions blindés arrivent aussi par l'EST et l'OUEST.
KEY_LEVEL3_HARD_W5;Fast ship are going directly to your base! Ground unit also come from everywhere with repair tanks!;Des avions rapide foncent directement sur votre base! Au sol, des tanks arrivent de tous les cotés.
KEY_LEVEL3_HARD_W6;Hordes of fast tank and drone killer are coming from everywhere! Be ready to destroy a lot of tanks!;Des tonnes de tanks rapide et de tueurs de drone arrivent de partout! Preparez vous à détruire beaucoup d'ennemis.
KEY_LEVEL3_HARD_W7;Repair and big tank coming from WEST and NORTH.;Des tanks de réparation et blindés arrivent de l'OUEST et le NORD.
KEY_LEVEL3_HARD_W8;Boss and hordes of tanks are coming from everywhere. Prepare for mass killing!;Des boss et beaucoup de tanks arrivent de partout. Préparez vos défenses!
KEY_LEVEL4_HARD_W1;A horde of fast tanks and drone killers are coming from SOUTH. Some repair tank accompany them!;Un grand nombre de tanks rapide et de tueurs de drone arrivent par le SUD. Des tanks de réparation sont en support.
KEY_LEVEL4_HARD_W2;Some drone killers try to approach from the WEST. Be careful!;Des tueurs de drone essaient d'approcher par l'OUEST. Faites attention!
KEY_LEVEL4_HARD_W3;More enemies are coming from WEST! Some ship are coming from SOUTH-EAST.;Plus d'ennemis arrivent de l'OUEST! Quelques avions viennent du SUD-EST.
KEY_LEVEL4_HARD_W4;Warning, a BOSS is coming from the SOUTH! Increase your firepower!;Attention, un boss arrive depuis le SUD. Augmentez votre puissance de frappe!
KEY_LEVEL4_HARD_W5;Enemies are coming from everywhere.;Les ennemis arrivent de partout.
KEY_LEVEL4_HARD_W6;Armored tank is coming from the NORTH.;Un tank blindé arrive par le NORD.
KEY_LEVEL4_HARD_W7;Enemies are coming from everywhere;Les ennemis arrivent de partout.
KEY_LEVEL4_HARD_W8;Boss are coming from every direction.;Des boss arrivent de toutes les directions.
KEY_LEVEL5_HARD_W1;Lots of enemies are coming from the SOUTH. Concentrate your defenses!;Beaucoup d'ennemis arrivent par le SUD. Concentrez vos défenses!
KEY_LEVEL5_HARD_W2;An armored tank comes from the EAST.;Un tank blindé arrive pas l'EST.
KEY_LEVEL5_HARD_W3;Armored tanks are coming from every path.;Des tanks blindés arrivent par tous les chemins.
KEY_LEVEL5_HARD_W4;Boss are coming from every path.;Des boss arrivent par chaque chemin.
KEY_LEVEL5_HARD_W5;More armored tanks are coming.;Encore plus de tanks blindés sont en chemin.
KEY_LEVEL5_HARD_W6;Some jets are heading to the Core.;Quelques avions se dirigent vers le Core.
KEY_LEVEL5_HARD_W7;Lots of tanks are coming from every path.;Beaucoup de tanks arrivent de tous les chemins.
KEY_LEVEL5_HARD_W8;Two boss come on every path.;Deux boss arrivent par chaque chemin.
KEY_LEVEL6_HARD_W1;Bzz..Bzz..Everywhere..Bzz..Bzz;Bzz..Bzz..Partout..Bzz..Bzz
KEY_LEVEL6_HARD_W2;Bzz..Bzz..More..Bzz..Bzz;Bzz..Bzz..Plus..Bzz..Bzz
KEY_LEVEL6_HARD_W3;Bzz..Bzz..More..Bzz..Bzz;Bzz..Bzz..More..Bzz..Bzz
KEY_LEVEL6_HARD_W4;Bzz..Bzz..Boss..Bzz..Bzz;Bzz..Bzz..Boss..Bzz..Bzz
KEY_LEVEL6_HARD_W5;Bzz..Bzz..!..Bzz..Bzz;Bzz..Bzz..!..Bzz..Bzz
KEY_LEVEL6_HARD_W6;Bzz..Bzz..Everywhere..Bzz..Bzz;Bzz..Bzz..Partout..Bzz..Bzz
KEY_LEVEL6_HARD_W7;Bzz..Bzz..!..Bzz..Bzz;Bzz..Bzz..!..Bzz..Bzz
KEY_LEVEL6_HARD_W8;Bzz..Bzz..Boss..Bzz..Bzz;Bzz..Bzz..Boss..Bzz..Bzz
KEY_LEVEL6_HARD_W9;Bzz..Bzz..!..Bzz..Bzz;Bzz..Bzz..!..Bzz..Bzz
KEY_LEVEL6_HARD_W10;Bzz..Bzz..Everywhere..Bzz..Bzz;Bzz..Bzz..Partout..Bzz..Bzz
KEY_LEVEL6_HARD_W11;Bzz..Bzz..!..Bzz..Bzz;Bzz..Bzz..!..Bzz..Bzz
KEY_LEVEL6_HARD_W12;Bzz..Bzz..Boss..Bzz..Bzz;Bzz..Bzz..Boss..Bzz..Bzz

