{
    "phrases": {
        "dashboard": {
            "tabs": {
                "general": {
                    "name": "Glowna",
                   
                    "online": {
                        "title": "Online",
                        "data": ":online:/:max:"
                    },
                    "totalMoney": {
                        "title": "Laczna ilosc $"
                    },
                    "jobDistribution": {
                        "title": "Wykres prac"
                    },
                    "richestPlayer": {
                        "title": "Najbogatszy gracz",
                        "economy": ":percentage:% of economy"
                    }
                },
                "economy": {
                    "name": "Wykres ekonomii",
                    "noData": "Brak informacji",
                    "days": [
                        "Dzis",
                        "1 dzien temu",
                        "2 dni temu",
                        "3 dni temu",
                        "4 dni temu",
                        "5 dni temu",
                        "6 dni temu"
                    ]
                }
            },
            "favouriteJobs": {
                "title": "Ulubione prace",
                "none": "Brak ulubionych prac"
            },
            "onlineStaff": {
                "title": "Administracja online",
                "none": "Brak administracji online"
            }
        },
        "jobs": {
            "top": {
                "search": "Szukaj",
                "sort": {
                    "default": "Podstawowe sortowanie",
                    "alphabetically": "Alfabetycznie",
                    "highestSalary": "Najwyzsza wyplata",
                    "lowestSalary": "Najnizsza wyplata",
                    "mostPeople": "Najwiecej graczy",
                    "leastPeople": "Najmniej graczy"
                },
                "showRecentJobs": "Pokaz ostatnie prace",
                "showFavouriteJobs": "Pokaz ulubione prace"
            },
            "slideout": {
                "tabs": {
                    "description": "OPIS",
                    "weapons": "WYPOSAZENIE",
                    "ranks": "RANGI"
                },
                "levelRequirement": "Wymagany poziom: :level:",
                "donatorJob": "Praca premium!",
                "button": {
                    "become": "ZMIEN",
                    "areThisJob": "JUZ NIM JESTES",
                    "jobIsFull": "PRACA JEST PELNA",
                    "customCheckFailed": "CUSTOMCHECK NIEUDANY",
                    "tooLowLevel": "ZA NISKI POZIOM"
                },
                "anHour": "/h"
            },
            "favouriteJobs": "Ulubione prace",
            "recentJobs": "Ostatnie prace",
            "salary": "Wyplata: :money:"
        },
        "items": {
            "tabs": {
                "entities": "PRZEDMIOTY",
                "weapons": "BRONIE",
                "shipments": "PACZKI",
                "ammo": "AMUNICJA",
                "vehicles": "POJAZDY",
                "food": "JEDZENIE"
            },
            "top": {
                "search": "Szukaj po nazwie",
                "sort": {
                    "default": "Podstawowe sortowanie",
                    "alphabetically": "Alfabetycznie",
                    "highestPrice": "Najwyzsza cena",
                    "lowestPrice": "Najnizsza cena"
                },
                "showFavourite": "Pokaz ulubione"
            },
            "favourites": "Ulubione"
        },
        "options": {
            "general": {
                "name": "Główne",
               
                "dropMoney": {
                    "name": "Wyrzuc pieniadze",
                    "desc": "Wyrzuca ilosc pieniedzy jaka chcesz",
                    "placeholder": "$1000"
                },
                "giveMoney": {
                    "name": "Przekaz pieniadze",
                    "desc": "Przekaz pieniadze osobie na ktora sie patrzysz",
                    "placeholder": "$1000"
                },
                "changeName": {
                    "name": "Zmien imie",
                    "desc": "Wpisz swoje nowe imie",
                    "placeholder": "Name"
                },
                "changeJobTitle": {
                    "name": "Zmien nazwe pracy",
                    "desc": "Wpisz swoja nowa nazwe pracy",
                    "placeholder": "Job title"
                },
                "requestGunLicense": {
                    "name": "Popros o licencje do broni"
                },
                "sellAllDoors": {
                    "name": "Sprzedaj wszystkie drzwi"
                },
                "dropWeapon": {
                    "name": "Wyrzuc bron"
                }
            },
            "mayor": {
                "name": "Mayor",
               
                "startLockdown": {
                    "name": "Rozpocznij lockdown"
                },
                "stopLockdown": {
                    "name": "Zatrzymaj lockdown"
                },
                "giveLicense": {
                    "name": "Daj licencje"
                },
                "addLaw": {
                    "name": "Dodaj prawo",
                    "desc": "Dodaj nowe prawo",
                    "placeholder": "Law"
                },
                "removeLaw": {
                    "name": "Usun prawo",
                    "desc": "Usun istniejace prawo",
                    "placeholder": "Law"
                },
                "resetLaws": {
                    "name": "Zresetuj prawa"
                },
                "placeLawboard": {
                    "name": "Postaw tablice z prawami"
                },
                "broadcastToCity": {
                    "name": "Nadaj ogloszenie dla miasta",
                    "desc": "Co chcialbys oglosic?",
                    "placeholder": "Message"
                },
                "startLottery": {
                    "name": "Rozpocznij loterie",
                    "desc": "Ile pieniedzy chcesz wplacic na loterie?",
                    "placeholder": "$1000"
                }
            }
        }
    }
}