module SmtpSmartRelay

go 1.18

require (
	github.com/emersion/go-sasl v0.0.0-20200509203442-7bfe0ed36a21
	github.com/emersion/go-smtp v0.15.0
)

require (
	github.com/cention-sany/utf7 v0.0.0-20170124080048-26cad61bd60a // indirect
	github.com/gogs/chardet v0.0.0-20191104214054-4b6791f73a28 // indirect
	github.com/jaytaylor/html2text v0.0.0-20200412013138-3577fbdbcff7 // indirect
	github.com/jhillyerd/enmime v0.9.3 // indirect
	github.com/mattn/go-runewidth v0.0.12 // indirect
	github.com/olekukonko/tablewriter v0.0.5 // indirect
	github.com/pkg/errors v0.9.1 // indirect
	github.com/rivo/uniseg v0.2.0 // indirect
	github.com/sendgrid/rest v2.6.9+incompatible // indirect
	github.com/sendgrid/sendgrid-go v3.11.1+incompatible // indirect
	github.com/ssor/bom v0.0.0-20170718123548-6386211fdfcf // indirect
	golang.org/x/net v0.0.0-20210501142056-aec3718b3fa0 // indirect
	golang.org/x/text v0.3.6 // indirect
)
