{
	"info": {
		"_postman_id": "5df79494-1bfe-4756-bbf0-7ff6707d6185",
		"name": "S01",
		"schema": "https://schema.getpostman.com/json/collection/v2.1.0/collection.json",
		"_exporter_id": "25584850"
	},
	"item": [
		{
			"name": "discussion",
			"item": [
				{
					"name": "Views.py",
					"request": {
						"method": "GET",
						"header": [],
						"url": {
							"raw": "localhost:8000/todolist/index",
							"host": [
								"localhost"
							],
							"port": "8000",
							"path": [
								"todolist",
								"index"
							]
						}
					},
					"response": []
				}
			]
		},
		{
			"name": "S01_Activity",
			"item": [
				{
					"name": "django_practice",
					"item": [
						{
							"name": "djangopractice.py",
							"request": {
								"method": "GET",
								"header": []
							},
							"response": []
						}
					]
				}
			]
		}
	]
}