run,custom_name,custom_cap,custom_region,custom_res,country_set,constraint_RES_SHARE,feature_hydrogen,feature_constrained_H2_transport,phi_min_res('DE'),"m_p('DE','Onshore wind')","m_p('DE','Offshore wind')",NTC.fx(l),"N_RSVR_P.fx(n,rsvr)"
29,FCEV Centralized,cap,standalone,0.05,DE,Demand_based_minimum,DE,DE,0.05,100000,30000,0,"m_rsvr_p_out(n,rsvr)"
30,FCEV Centralized,no_cap,standalone,0.05,DE,Demand_based_minimum,DE,DE,0.05,,,0,"m_rsvr_p_out(n,rsvr)"
31,FCEV Centralized,cap,with_neighbors,0.05,,Demand_based_minimum,DE,DE,0.05,100000,30000,m_ntc(l),"m_rsvr_p_out(n,rsvr)"
32,FCEV Centralized,no_cap,with_neighbors,0.05,,Demand_based_minimum,DE,DE,0.05,,,m_ntc(l),"m_rsvr_p_out(n,rsvr)"
