feature,value
scenarios_iteration,yes
skip_input,no
skip_iteration_data_file,no
define_h_set,
dispatch_only,no
network_transfer,yes
no_crossover,no
infeasibility,no
GUSS,no
GUSS_parallel,no
GUSS_parallel_threads,0
data_input_file,static_input_TYNDP2020.xlsx
time_series_file,timeseries_input_TYNDP2020.xlsx
iteration_data_file,iteration_data.xlsx
model_file,DIETER.gms
gdx_convert_parallel_threads,0
gdx_convert_to_csv,no
gdx_convert_to_pickle,no
gdx_convert_to_vaex,no
report_data,no
