basic,reserves,prosumage,dsm,heat,ev_endogenous,ev_exogenous,hydrogen,hydrogen_simple
Z,grad_per_min,m_res_pro,c_fix_dsm_cu,H_DHW_STO_OUT,c_m_ev,ev_ged_exog,H2_E_H2_IN,H2_H2_PRODUCTION
G_L,phi_mean_reserves_call,m_sto_pro_e,c_fix_dsm_shift,H_HP_IN,eta_ev_in,,H2_AUX_BFFUEL_OUT,H2_ELECTROLYSIS
G_RES,phi_reserves_call,m_sto_pro_p,c_i_dsm_cu,H_STO_IN_HP,eta_ev_out,,H2_PROD_OUT,H2_ELEC_IN
N_TECH,phi_reserves_pr_do,phi_pro_load,c_i_dsm_shift,H_STO_LEV,ev_quant,,,
N_STO_E,phi_reserves_pr_up,phi_pro_self,c_inv_overnight_dsm_cu,H_STO_OUT,phi_ev,,,
N_STO_P_OUT,phi_reserves_share,phi_sto_pro_ini,c_inv_overnight_dsm_shift,N_HEAT_P_OUT,EV_CHARGE,,,
N_STO_P_IN,reserves_exogenous,CU_PRO,c_m_dsm_cu,N_HEAT_P_IN,EV_DISCHARGE,,,
STO_IN,reserves_intercept,G_MARKET_M2PRO,c_m_dsm_shift,N_HEAT_E,EV_GED,,,
STO_L,reserves_reaction,G_MARKET_PRO2M,eta_dsm_shift,phi_heat_type,EV_L,,,
STO_OUT,reserves_slope,G_RES_PRO,inv_interest_dsm_cu,area_floor,EV_PHEVFUEL,,,
N_RSVR_E,RP_DIS,N_RES_PRO,inv_interest_dsm_shift,phi_heat_type,,,,
N_RSVR_P,RP_EV_G2V,N_STO_E_PRO,inv_recovery_dsm_cu,dh_upload,,,,
RSVR_OUT,RP_EV_V2G,N_STO_P_PRO,inv_recovery_dsm_shift,dhw_upload,,,,
RSVR_L,RP_H_ELEC,STO_IN_M2M,m_dsm_cu,,,,,
NTC,RP_HP,STO_IN_M2PRO,m_dsm_shift,,,,,
F,RP_NONDIS,STO_IN_PRO2M,t_dur_dsm_cu,,,,,
inc,RP_RSVR,STO_IN_PRO2PRO,t_dur_dsm_shift,,,,,
d,RP_SETS,STO_L_M2M,t_off_dsm_cu,,,,,
CU,RP_SETS_AUX,STO_L_M2PRO,t_off_dsm_shift,,,,,
con1a_bal.m,RP_STO_IN,STO_L_PRO,DSM_CU,,,,,
con5a_minRES.m,RP_STO_OUT,STO_L_PRO2M,DSM_DO,,,,,
,RP_DSM_CU,STO_L_PRO2PRO,DSM_DO_DEMAND,,,,,
,RP_DSM_SHIFT,STO_OUT_M2M,DSM_UP,,,,,
,,STO_OUT_M2PRO,DSM_UP_DEMAND,,,,,
,,STO_OUT_PRO2M,N_DSM_CU,,,,,
,,STO_OUT_PRO2PRO,N_DSM_SHIFT,,,,,