n,bu,ch,heat_storage,heat_hp,heat_elec,heat_fossil,area_floor,dynamic_efficiency,level_ini,max_energy_sets_aux_dhw,max_level,max_outflow,max_power,max_power_in_sets_aux_dhw,max_power_out_sets_aux_dhw,penalty_non-electric_heat_supply,share,static_efficiency,static_efficiency_sets_aux_dhw,temperature_sink,temperature_source
DE,bu1,dir,no,no,no,no,246705003.056201,0.0,0.0,0.0,0.0,0.0,0.0,0.0,0.0,0.0,0.0,0.0,0.0,0.0,0.0
DE,bu1,gas_elec,yes,no,yes,yes,246705003.056201,0.0,0.5,0.0,0.0,0.0,0.0,0.0,0.0,0.0,0.0,0.9957,0.0,0.0,0.0
DE,bu1,gas_hp_as,yes,yes,no,yes,246705003.056201,0.35,0.5,0.0,0.0,0.0,0.0,0.0,0.0,0.0,0.0,0.9957,0.0,50.0,0.0
DE,bu1,gas_hp_gs,yes,yes,no,yes,246705003.056201,0.45,0.5,0.0,0.0,0.0,0.0,0.0,0.0,0.0,0.0,0.9957,0.0,50.0,10.0
DE,bu1,hp_as,yes,yes,no,no,246705003.056201,0.35,0.5,0.0,0.0,0.0,0.0,0.0,0.0,0.0,0.005,0.9957,0.0,50.0,0.0
DE,bu1,hp_as_elec,yes,yes,yes,no,246705003.056201,0.35,0.5,0.0,0.0,0.0,0.0,0.0,0.0,0.0,0.0,0.9957,0.0,50.0,0.0
DE,bu1,hp_gs,yes,yes,no,no,246705003.056201,0.45,0.5,0.0,0.0,0.0,0.0,0.0,0.0,0.0,0.005,0.9957,0.0,50.0,10.0
DE,bu1,hp_gs_elec,yes,yes,yes,no,246705003.056201,0.45,0.5,0.0,0.0,0.0,0.0,0.0,0.0,0.0,0.0,0.9957,0.0,50.0,10.0
DE,bu1,oil_elec,yes,no,yes,yes,246705003.056201,0.0,0.5,0.0,0.0,0.0,0.0,0.0,0.0,0.0,0.0,0.9957,0.0,0.0,0.0
DE,bu1,setsh,no,no,no,no,246705003.056201,1.0,0.0,0.0,0.0,0.0,0.0,0.0,0.0,0.0,0.029,0.975,0.9957,0.0,0.0
DE,bu10,dir,no,no,no,no,180986042.07919,0.0,0.0,0.0,0.0,0.0,0.0,0.0,0.0,0.0,0.0,0.0,0.0,0.0,0.0
DE,bu10,gas_elec,yes,no,yes,yes,180986042.07919,0.99,0.5,0.0,0.0,0.0,0.0,0.0,0.0,0.0,0.0,0.9957,0.0,0.0,0.0
DE,bu10,gas_hp_as,yes,yes,no,yes,180986042.07919,0.35,0.5,0.0,0.0,0.0,0.0,0.0,0.0,0.0,0.0,0.9957,0.0,50.0,0.0
DE,bu10,gas_hp_gs,yes,yes,no,yes,180986042.07919,0.45,0.5,0.0,0.0,0.0,0.0,0.0,0.0,0.0,0.0,0.9957,0.0,50.0,10.0
DE,bu10,hp_as,yes,yes,no,no,180986042.07919,0.35,0.5,0.0,0.0,0.0,0.0,0.0,0.0,0.0,0.1216,0.9957,0.0,50.0,0.0
DE,bu10,hp_as_elec,yes,yes,yes,no,180986042.07919,0.35,0.5,0.0,0.0,0.0,0.0,0.0,0.0,0.0,0.0,0.9957,0.0,50.0,0.0
DE,bu10,hp_gs,yes,yes,no,no,180986042.07919,0.45,0.5,0.0,0.0,0.0,0.0,0.0,0.0,0.0,0.0384,0.9957,0.0,50.0,10.0
DE,bu10,hp_gs_elec,yes,yes,yes,no,180986042.07919,0.45,0.5,0.0,0.0,0.0,0.0,0.0,0.0,0.0,0.0,0.9957,0.0,50.0,10.0
DE,bu10,oil_elec,yes,no,yes,yes,180986042.07919,0.99,0.5,0.0,0.0,0.0,0.0,0.0,0.0,0.0,0.0,0.9957,0.0,0.0,0.0
DE,bu10,setsh,no,no,no,no,180986042.07919,1.0,0.0,0.0,0.0,0.0,0.0,0.0,0.0,0.0,0.0,0.975,0.9957,0.0,0.0
DE,bu11,dir,no,no,no,no,375486545.475694,0.0,0.0,0.0,0.0,0.0,0.0,0.0,0.0,0.0,0.0,0.0,0.0,0.0,0.0
DE,bu11,gas_elec,yes,no,yes,yes,375486545.475694,0.99,0.5,0.0,0.0,0.0,0.0,0.0,0.0,0.0,0.0,0.9957,0.0,0.0,0.0
DE,bu11,gas_hp_as,yes,yes,no,yes,375486545.475694,0.35,0.5,0.0,0.0,0.0,0.0,0.0,0.0,0.0,0.0,0.9957,0.0,50.0,0.0
DE,bu11,gas_hp_gs,yes,yes,no,yes,375486545.475694,0.45,0.5,0.0,0.0,0.0,0.0,0.0,0.0,0.0,0.0,0.9957,0.0,50.0,10.0
DE,bu11,hp_as,yes,yes,no,no,375486545.475694,0.35,0.5,0.0,0.0,0.0,0.0,0.0,0.0,0.0,0.2584,0.9957,0.0,50.0,0.0
DE,bu11,hp_as_elec,yes,yes,yes,no,375486545.475694,0.35,0.5,0.0,0.0,0.0,0.0,0.0,0.0,0.0,0.0,0.9957,0.0,50.0,0.0
DE,bu11,hp_gs,yes,yes,no,no,375486545.475694,0.45,0.5,0.0,0.0,0.0,0.0,0.0,0.0,0.0,0.0816,0.9957,0.0,50.0,10.0
DE,bu11,hp_gs_elec,yes,yes,yes,no,375486545.475694,0.45,0.5,0.0,0.0,0.0,0.0,0.0,0.0,0.0,0.0,0.9957,0.0,50.0,10.0
DE,bu11,oil_elec,yes,no,yes,yes,375486545.475694,0.99,0.5,0.0,0.0,0.0,0.0,0.0,0.0,0.0,0.0,0.9957,0.0,0.0,0.0
DE,bu11,setsh,no,no,no,no,375486545.475694,1.0,0.0,0.0,0.0,0.0,0.0,0.0,0.0,0.0,0.0,0.975,0.9957,0.0,0.0
DE,bu12,dir,no,no,no,no,232161299.829754,0.0,0.0,0.0,0.0,0.0,0.0,0.0,0.0,0.0,0.0,0.0,0.0,0.0,0.0
DE,bu12,gas_elec,yes,no,yes,yes,232161299.829754,0.99,0.5,0.0,0.0,0.0,0.0,0.0,0.0,0.0,0.0,0.9957,0.0,0.0,0.0
DE,bu12,gas_hp_as,yes,yes,no,yes,232161299.829754,0.35,0.5,0.0,0.0,0.0,0.0,0.0,0.0,0.0,0.0,0.9957,0.0,50.0,0.0
DE,bu12,gas_hp_gs,yes,yes,no,yes,232161299.829754,0.45,0.5,0.0,0.0,0.0,0.0,0.0,0.0,0.0,0.0,0.9957,0.0,50.0,10.0
DE,bu12,hp_as,yes,yes,no,no,232161299.829754,0.35,0.5,0.0,0.0,0.0,0.0,0.0,0.0,0.0,0.1216,0.9957,0.0,50.0,0.0
DE,bu12,hp_as_elec,yes,yes,yes,no,232161299.829754,0.35,0.5,0.0,0.0,0.0,0.0,0.0,0.0,0.0,0.0,0.9957,0.0,50.0,0.0
DE,bu12,hp_gs,yes,yes,no,no,232161299.829754,0.45,0.5,0.0,0.0,0.0,0.0,0.0,0.0,0.0,0.0384,0.9957,0.0,50.0,10.0
DE,bu12,hp_gs_elec,yes,yes,yes,no,232161299.829754,0.45,0.5,0.0,0.0,0.0,0.0,0.0,0.0,0.0,0.0,0.9957,0.0,50.0,10.0
DE,bu12,oil_elec,yes,no,yes,yes,232161299.829754,0.99,0.5,0.0,0.0,0.0,0.0,0.0,0.0,0.0,0.0,0.9957,0.0,0.0,0.0
DE,bu12,setsh,no,no,no,no,232161299.829754,1.0,0.0,0.0,0.0,0.0,0.0,0.0,0.0,0.0,0.0,0.975,0.9957,0.0,0.0
DE,bu2,dir,no,no,no,no,170430274.412552,0.0,0.0,0.0,0.0,0.0,0.0,0.0,0.0,0.0,0.0,0.0,0.0,0.0,0.0
DE,bu2,gas_elec,yes,no,yes,yes,170430274.412552,0.99,0.5,0.0,0.0,0.0,0.0,0.0,0.0,0.0,0.0,0.9957,0.0,0.0,0.0
DE,bu2,gas_hp_as,yes,yes,no,yes,170430274.412552,0.35,0.5,0.0,0.0,0.0,0.0,0.0,0.0,0.0,0.0,0.9957,0.0,50.0,0.0
DE,bu2,gas_hp_gs,yes,yes,no,yes,170430274.412552,0.45,0.5,0.0,0.0,0.0,0.0,0.0,0.0,0.0,0.0,0.9957,0.0,50.0,10.0
DE,bu2,hp_as,yes,yes,no,no,170430274.412552,0.35,0.5,0.0,0.0,0.0,0.0,0.0,0.0,0.0,0.0065,0.9957,0.0,50.0,0.0
DE,bu2,hp_as_elec,yes,yes,yes,no,170430274.412552,0.35,0.5,0.0,0.0,0.0,0.0,0.0,0.0,0.0,0.0,0.9957,0.0,50.0,0.0
DE,bu2,hp_gs,yes,yes,no,no,170430274.412552,0.45,0.5,0.0,0.0,0.0,0.0,0.0,0.0,0.0,0.0065,0.9957,0.0,50.0,10.0
DE,bu2,hp_gs_elec,yes,yes,yes,no,170430274.412552,0.45,0.5,0.0,0.0,0.0,0.0,0.0,0.0,0.0,0.0,0.9957,0.0,50.0,10.0
DE,bu2,oil_elec,yes,no,yes,yes,170430274.412552,0.99,0.5,0.0,0.0,0.0,0.0,0.0,0.0,0.0,0.0,0.9957,0.0,0.0,0.0
DE,bu2,setsh,no,no,no,no,170430274.412552,1.0,0.0,0.0,0.0,0.0,0.0,0.0,0.0,0.0,0.021,0.975,0.9957,0.0,0.0
DE,bu3,dir,no,no,no,no,431156503.707827,0.0,0.0,0.0,0.0,0.0,0.0,0.0,0.0,0.0,0.0,0.0,0.0,0.0,0.0
DE,bu3,gas_elec,yes,no,yes,yes,431156503.707827,0.99,0.5,0.0,0.0,0.0,0.0,0.0,0.0,0.0,0.0,0.9957,0.0,0.0,0.0
DE,bu3,gas_hp_as,yes,yes,no,yes,431156503.707827,0.35,0.5,0.0,0.0,0.0,0.0,0.0,0.0,0.0,0.0,0.9957,0.0,50.0,0.0
DE,bu3,gas_hp_gs,yes,yes,no,yes,431156503.707827,0.45,0.5,0.0,0.0,0.0,0.0,0.0,0.0,0.0,0.0,0.9957,0.0,50.0,10.0
DE,bu3,hp_as,yes,yes,no,no,431156503.707827,0.35,0.5,0.0,0.0,0.0,0.0,0.0,0.0,0.0,0.005,0.9957,0.0,50.0,0.0
DE,bu3,hp_as_elec,yes,yes,yes,no,431156503.707827,0.35,0.5,0.0,0.0,0.0,0.0,0.0,0.0,0.0,0.0,0.9957,0.0,50.0,0.0
DE,bu3,hp_gs,yes,yes,no,no,431156503.707827,0.45,0.5,0.0,0.0,0.0,0.0,0.0,0.0,0.0,0.005,0.9957,0.0,50.0,10.0
DE,bu3,hp_gs_elec,yes,yes,yes,no,431156503.707827,0.45,0.5,0.0,0.0,0.0,0.0,0.0,0.0,0.0,0.0,0.9957,0.0,50.0,10.0
DE,bu3,oil_elec,yes,no,yes,yes,431156503.707827,0.99,0.5,0.0,0.0,0.0,0.0,0.0,0.0,0.0,0.0,0.9957,0.0,0.0,0.0
DE,bu3,setsh,no,no,no,no,431156503.707827,1.0,0.0,0.0,0.0,0.0,0.0,0.0,0.0,0.0,0.029,0.975,0.9957,0.0,0.0
DE,bu4,dir,no,no,no,no,321505424.40651,0.0,0.0,0.0,0.0,0.0,0.0,0.0,0.0,0.0,0.0,0.0,0.0,0.0,0.0
DE,bu4,gas_elec,yes,no,yes,yes,321505424.40651,0.99,0.5,0.0,0.0,0.0,0.0,0.0,0.0,0.0,0.0,0.9957,0.0,0.0,0.0
DE,bu4,gas_hp_as,yes,yes,no,yes,321505424.40651,0.35,0.5,0.0,0.0,0.0,0.0,0.0,0.0,0.0,0.0,0.9957,0.0,50.0,0.0
DE,bu4,gas_hp_gs,yes,yes,no,yes,321505424.40651,0.45,0.5,0.0,0.0,0.0,0.0,0.0,0.0,0.0,0.0,0.9957,0.0,50.0,10.0
DE,bu4,hp_as,yes,yes,no,no,321505424.40651,0.35,0.5,0.0,0.0,0.0,0.0,0.0,0.0,0.0,0.0065,0.9957,0.0,50.0,0.0
DE,bu4,hp_as_elec,yes,yes,yes,no,321505424.40651,0.35,0.5,0.0,0.0,0.0,0.0,0.0,0.0,0.0,0.0,0.9957,0.0,50.0,0.0
DE,bu4,hp_gs,yes,yes,no,no,321505424.40651,0.45,0.5,0.0,0.0,0.0,0.0,0.0,0.0,0.0,0.0065,0.9957,0.0,50.0,10.0
DE,bu4,hp_gs_elec,yes,yes,yes,no,321505424.40651,0.45,0.5,0.0,0.0,0.0,0.0,0.0,0.0,0.0,0.0,0.9957,0.0,50.0,10.0
DE,bu4,oil_elec,yes,no,yes,yes,321505424.40651,0.99,0.5,0.0,0.0,0.0,0.0,0.0,0.0,0.0,0.0,0.9957,0.0,0.0,0.0
DE,bu4,setsh,no,no,no,no,321505424.40651,1.0,0.0,0.0,0.0,0.0,0.0,0.0,0.0,0.0,0.021,0.975,0.9957,0.0,0.0
DE,bu5,dir,no,no,no,no,445548878.347231,0.0,0.0,0.0,0.0,0.0,0.0,0.0,0.0,0.0,0.0,0.0,0.0,0.0,0.0
DE,bu5,gas_elec,yes,no,yes,yes,445548878.347231,0.99,0.5,0.0,0.0,0.0,0.0,0.0,0.0,0.0,0.0,0.9957,0.0,0.0,0.0
DE,bu5,gas_hp_as,yes,yes,no,yes,445548878.347231,0.35,0.5,0.0,0.0,0.0,0.0,0.0,0.0,0.0,0.0,0.9957,0.0,50.0,0.0
DE,bu5,gas_hp_gs,yes,yes,no,yes,445548878.347231,0.45,0.5,0.0,0.0,0.0,0.0,0.0,0.0,0.0,0.0,0.9957,0.0,50.0,10.0
DE,bu5,hp_as,yes,yes,no,no,445548878.347231,0.35,0.5,0.0,0.0,0.0,0.0,0.0,0.0,0.0,0.0085,0.9957,0.0,50.0,0.0
DE,bu5,hp_as_elec,yes,yes,yes,no,445548878.347231,0.35,0.5,0.0,0.0,0.0,0.0,0.0,0.0,0.0,0.0,0.9957,0.0,50.0,0.0
DE,bu5,hp_gs,yes,yes,no,no,445548878.347231,0.45,0.5,0.0,0.0,0.0,0.0,0.0,0.0,0.0,0.0085,0.9957,0.0,50.0,10.0
DE,bu5,hp_gs_elec,yes,yes,yes,no,445548878.347231,0.45,0.5,0.0,0.0,0.0,0.0,0.0,0.0,0.0,0.0,0.9957,0.0,50.0,10.0
DE,bu5,oil_elec,yes,no,yes,yes,445548878.347231,0.99,0.5,0.0,0.0,0.0,0.0,0.0,0.0,0.0,0.0,0.9957,0.0,0.0,0.0
DE,bu5,setsh,no,no,no,no,445548878.347231,1.0,0.0,0.0,0.0,0.0,0.0,0.0,0.0,0.0,0.037,0.975,0.9957,0.0,0.0
DE,bu6,dir,no,no,no,no,229580374.066222,0.0,0.0,0.0,0.0,0.0,0.0,0.0,0.0,0.0,0.0,0.0,0.0,0.0,0.0
DE,bu6,gas_elec,yes,no,yes,yes,229580374.066222,0.99,0.5,0.0,0.0,0.0,0.0,0.0,0.0,0.0,0.0,0.9957,0.0,0.0,0.0
DE,bu6,gas_hp_as,yes,yes,no,yes,229580374.066222,0.35,0.5,0.0,0.0,0.0,0.0,0.0,0.0,0.0,0.0,0.9957,0.0,50.0,0.0
DE,bu6,gas_hp_gs,yes,yes,no,yes,229580374.066222,0.45,0.5,0.0,0.0,0.0,0.0,0.0,0.0,0.0,0.0,0.9957,0.0,50.0,10.0
DE,bu6,hp_as,yes,yes,no,no,229580374.066222,0.35,0.5,0.0,0.0,0.0,0.0,0.0,0.0,0.0,0.0,0.9957,0.0,50.0,0.0
DE,bu6,hp_as_elec,yes,yes,yes,no,229580374.066222,0.35,0.5,0.0,0.0,0.0,0.0,0.0,0.0,0.0,0.0,0.9957,0.0,50.0,0.0
DE,bu6,hp_gs,yes,yes,no,no,229580374.066222,0.45,0.5,0.0,0.0,0.0,0.0,0.0,0.0,0.0,0.0,0.9957,0.0,50.0,10.0
DE,bu6,hp_gs_elec,yes,yes,yes,no,229580374.066222,0.45,0.5,0.0,0.0,0.0,0.0,0.0,0.0,0.0,0.0,0.9957,0.0,50.0,10.0
DE,bu6,oil_elec,yes,no,yes,yes,229580374.066222,0.99,0.5,0.0,0.0,0.0,0.0,0.0,0.0,0.0,0.0,0.9957,0.0,0.0,0.0
DE,bu6,setsh,no,no,no,no,229580374.066222,1.0,0.0,0.0,0.0,0.0,0.0,0.0,0.0,0.0,0.025,0.975,0.9957,0.0,0.0
DE,bu7,dir,no,no,no,no,528310626.163446,0.0,0.0,0.0,0.0,0.0,0.0,0.0,0.0,0.0,0.0,0.0,0.0,0.0,0.0
DE,bu7,gas_elec,yes,no,yes,yes,528310626.163446,0.99,0.5,0.0,0.0,0.0,0.0,0.0,0.0,0.0,0.0,0.9957,0.0,0.0,0.0
DE,bu7,gas_hp_as,yes,yes,no,yes,528310626.163446,0.35,0.5,0.0,0.0,0.0,0.0,0.0,0.0,0.0,0.0,0.9957,0.0,50.0,0.0
DE,bu7,gas_hp_gs,yes,yes,no,yes,528310626.163446,0.45,0.5,0.0,0.0,0.0,0.0,0.0,0.0,0.0,0.0,0.9957,0.0,50.0,10.0
DE,bu7,hp_as,yes,yes,no,no,528310626.163446,0.35,0.5,0.0,0.0,0.0,0.0,0.0,0.0,0.0,0.0305,0.9957,0.0,50.0,0.0
DE,bu7,hp_as_elec,yes,yes,yes,no,528310626.163446,0.35,0.5,0.0,0.0,0.0,0.0,0.0,0.0,0.0,0.0,0.9957,0.0,50.0,0.0
DE,bu7,hp_gs,yes,yes,no,no,528310626.163446,0.45,0.5,0.0,0.0,0.0,0.0,0.0,0.0,0.0,0.0305,0.9957,0.0,50.0,10.0
DE,bu7,hp_gs_elec,yes,yes,yes,no,528310626.163446,0.45,0.5,0.0,0.0,0.0,0.0,0.0,0.0,0.0,0.0,0.9957,0.0,50.0,10.0
DE,bu7,oil_elec,yes,no,yes,yes,528310626.163446,0.99,0.5,0.0,0.0,0.0,0.0,0.0,0.0,0.0,0.0,0.9957,0.0,0.0,0.0
DE,bu7,setsh,no,no,no,no,528310626.163446,1.0,0.0,0.0,0.0,0.0,0.0,0.0,0.0,0.0,0.013,0.975,0.9957,0.0,0.0
DE,bu8,dir,no,no,no,no,239175323.517645,0.0,0.0,0.0,0.0,0.0,0.0,0.0,0.0,0.0,0.0,0.0,0.0,0.0,0.0
DE,bu8,gas_elec,yes,no,yes,yes,239175323.517645,0.99,0.5,0.0,0.0,0.0,0.0,0.0,0.0,0.0,0.0,0.9957,0.0,0.0,0.0
DE,bu8,gas_hp_as,yes,yes,no,yes,239175323.517645,0.35,0.5,0.0,0.0,0.0,0.0,0.0,0.0,0.0,0.0,0.9957,0.0,50.0,0.0
DE,bu8,gas_hp_gs,yes,yes,no,yes,239175323.517645,0.45,0.5,0.0,0.0,0.0,0.0,0.0,0.0,0.0,0.0,0.9957,0.0,50.0,10.0
DE,bu8,hp_as,yes,yes,no,no,239175323.517645,0.35,0.5,0.0,0.0,0.0,0.0,0.0,0.0,0.0,0.007,0.9957,0.0,50.0,0.0
DE,bu8,hp_as_elec,yes,yes,yes,no,239175323.517645,0.35,0.5,0.0,0.0,0.0,0.0,0.0,0.0,0.0,0.0,0.9957,0.0,50.0,0.0
DE,bu8,hp_gs,yes,yes,no,no,239175323.517645,0.45,0.5,0.0,0.0,0.0,0.0,0.0,0.0,0.0,0.007,0.9957,0.0,50.0,10.0
DE,bu8,hp_gs_elec,yes,yes,yes,no,239175323.517645,0.45,0.5,0.0,0.0,0.0,0.0,0.0,0.0,0.0,0.0,0.9957,0.0,50.0,10.0
DE,bu8,oil_elec,yes,no,yes,yes,239175323.517645,0.99,0.5,0.0,0.0,0.0,0.0,0.0,0.0,0.0,0.0,0.9957,0.0,0.0,0.0
DE,bu8,setsh,no,no,no,no,239175323.517645,1.0,0.0,0.0,0.0,0.0,0.0,0.0,0.0,0.0,0.004,0.975,0.9957,0.0,0.0
DE,bu9,dir,no,no,no,no,305541810.622073,0.0,0.0,0.0,0.0,0.0,0.0,0.0,0.0,0.0,0.0,0.0,0.0,0.0,0.0
DE,bu9,gas_elec,yes,no,yes,yes,305541810.622073,0.99,0.5,0.0,0.0,0.0,0.0,0.0,0.0,0.0,0.0,0.9957,0.0,0.0,0.0
DE,bu9,gas_hp_as,yes,yes,no,yes,305541810.622073,0.35,0.5,0.0,0.0,0.0,0.0,0.0,0.0,0.0,0.0,0.9957,0.0,50.0,0.0
DE,bu9,gas_hp_gs,yes,yes,no,yes,305541810.622073,0.45,0.5,0.0,0.0,0.0,0.0,0.0,0.0,0.0,0.0,0.9957,0.0,50.0,10.0
DE,bu9,hp_as,yes,yes,no,no,305541810.622073,0.35,0.5,0.0,0.0,0.0,0.0,0.0,0.0,0.0,0.2584,0.9957,0.0,50.0,0.0
DE,bu9,hp_as_elec,yes,yes,yes,no,305541810.622073,0.35,0.5,0.0,0.0,0.0,0.0,0.0,0.0,0.0,0.0,0.9957,0.0,50.0,0.0
DE,bu9,hp_gs,yes,yes,no,no,305541810.622073,0.45,0.5,0.0,0.0,0.0,0.0,0.0,0.0,0.0,0.0816,0.9957,0.0,50.0,10.0
DE,bu9,hp_gs_elec,yes,yes,yes,no,305541810.622073,0.45,0.5,0.0,0.0,0.0,0.0,0.0,0.0,0.0,0.0,0.9957,0.0,50.0,10.0
DE,bu9,oil_elec,yes,no,yes,yes,305541810.622073,0.99,0.5,0.0,0.0,0.0,0.0,0.0,0.0,0.0,0.0,0.9957,0.0,0.0,0.0
DE,bu9,setsh,no,no,no,no,305541810.622073,1.0,0.0,0.0,0.0,0.0,0.0,0.0,0.0,0.0,0.0,0.975,0.9957,0.0,0.0
