l,min_NTC_ex,max_NTC_ex,min_NTC_im,max_NTC_im,distance,fixed_costs,interest_rate,lifetime,loss_transmission,overnight_costs,recovery_period,variable_om,fixed_capacities_ntc
AT_CH,1200,1200,1200,1200,340.0,6.194,0.07,40.0,0.0,326.0,40.0,0.0,1700
AT_CZ,900,900,900,900,248.0,6.194,0.07,40.0,0.0,326.0,40.0,0.0,1100
AT_DE,5400,5400,5400,5400,546.0,6.194,0.07,40.0,0.0,326.0,40.0,0.0,7500
AT_HR,0,0,0,0,469.0,6.194,0.07,40.0,0.0,326.0,40.0,0.0,0
AT_HU,800,800,800,800,125.0,6.194,0.07,40.0,0.0,326.0,40.0,0.0,1000
AT_IT,800,800,650,650,188.0,6.194,0.07,40.0,0.0,326.0,40.0,0.0,1470
AT_SI,950,950,950,950,318.0,6.194,0.07,40.0,0.0,326.0,40.0,0.0,2200
AT_SK,0,0,0,0,496.0,6.194,0.07,40.0,0.0,326.0,40.0,0.0,0
BE_DE,1000,1000,1000,1000,349.0,6.194,0.07,40.0,0.0,326.0,40.0,0.0,1000
BE_FR,2800,2800,4300,4300,444.0,6.194,0.07,40.0,0.0,326.0,40.0,0.0,5050
BE_LU,680,680,180,180,323.0,6.194,0.07,40.0,0.0,326.0,40.0,0.0,430
BE_NL,2400,2400,3400,3400,494.0,6.194,0.07,40.0,0.0,326.0,40.0,0.0,4900
BE_UK,1000,1000,1000,1000,314.0,6.194,0.07,40.0,0.0,326.0,40.0,0.0,2500
BG_GR,1700,1700,1400,1400,540.0,6.194,0.07,40.0,0.0,326.0,40.0,0.0,1380
BG_RO,1500,1500,1400,1400,669.0,6.194,0.07,40.0,0.0,326.0,40.0,0.0,1450
CH_DE,4200,4200,3000,3000,282.0,6.194,0.07,40.0,0.0,326.0,40.0,0.0,5300
CH_FR,1300,1300,3700,3700,297.0,6.194,0.07,40.0,0.0,326.0,40.0,0.0,4000
CH_IT,3750,3750,1700,1700,514.0,6.194,0.07,40.0,0.0,326.0,40.0,0.0,4850
CZ_DE,2100,2100,1500,1500,481.0,6.194,0.07,40.0,0.0,326.0,40.0,0.0,2300
CZ_HU,0,0,0,0,676.0,6.194,0.07,40.0,0.0,326.0,40.0,0.0,0
CZ_PL,600,600,800,800,408.0,6.194,0.07,40.0,0.0,326.0,40.0,0.0,700
CZ_SK,1800,1800,1100,1100,999.0,6.194,0.07,40.0,0.0,326.0,40.0,0.0,1600
DE_DK,4500,4500,4485,4485,999.0,6.194,0.07,40.0,0.0,326.0,40.0,0.0,4000
DE_FR,3300,3300,3300,3300,999.0,6.194,0.07,40.0,0.0,326.0,40.0,0.0,4800
DE_LU,2300,2300,2300,2300,999.0,6.194,0.07,40.0,0.0,326.0,40.0,0.0,3300
DE_NL,5000,5000,5000,5000,999.0,6.194,0.07,40.0,0.0,326.0,40.0,0.0,5000
DE_NO,1400,1400,1400,1400,999.0,6.194,0.07,40.0,0.0,326.0,40.0,0.0,1400
DE_PL,2000,2000,3000,3000,999.0,6.194,0.07,40.0,0.0,326.0,40.0,0.0,3750
DE_SE,615,615,615,615,999.0,6.194,0.07,40.0,0.0,326.0,40.0,0.0,1815
DE_UK,0,0,0,0,999.0,6.194,0.07,40.0,0.0,326.0,40.0,0.0,1400
DK_NL,700,700,700,700,999.0,6.194,0.07,40.0,0.0,326.0,40.0,0.0,700
DK_NO,1640,1640,1640,1640,999.0,6.194,0.07,40.0,0.0,326.0,40.0,0.0,2140
DK_PL,0,0,0,0,999.0,6.194,0.07,40.0,0.0,326.0,40.0,0.0,500
DK_SE,2415,2415,2015,2015,999.0,6.194,0.07,40.0,0.0,326.0,40.0,0.0,710
DK_UK,1400,1400,1400,1400,999.0,6.194,0.07,40.0,0.0,326.0,40.0,0.0,1400
EE_FI,1016,1016,1000,1000,999.0,6.194,0.07,40.0,0.0,326.0,40.0,0.0,1000
EE_LV,1100,1100,900,900,999.0,6.194,0.07,40.0,0.0,326.0,40.0,0.0,1300
EE_SE,0,0,0,0,999.0,6.194,0.07,40.0,0.0,326.0,40.0,0.0,0
ES_FR,5000,5000,5000,5000,999.0,6.194,0.07,40.0,0.0,326.0,40.0,0.0,9000
ES_PT,4200,4200,3500,3500,999.0,6.194,0.07,40.0,0.0,326.0,40.0,0.0,4350
ES_UK,0,0,0,0,999.0,6.194,0.07,40.0,0.0,326.0,40.0,0.0,
FI_NO,0,0,0,0,999.0,6.194,0.07,40.0,0.0,326.0,40.0,0.0,0
FI_SE,2300,2300,2400,2400,999.0,6.194,0.07,40.0,0.0,326.0,40.0,0.0,4100
FR_IE,0,0,0,0,999.0,6.194,0.07,40.0,0.0,326.0,40.0,0.0,700
FR_IT,4100,4100,2000,2000,999.0,6.194,0.07,40.0,0.0,326.0,40.0,0.0,3255
FR_LU,380,380,0,0,999.0,6.194,0.07,40.0,0.0,326.0,40.0,0.0,190
FR_UK,4000,4000,4000,4000,999.0,6.194,0.07,40.0,0.0,326.0,40.0,0.0,6900
GR_IT,500,500,500,500,999.0,6.194,0.07,40.0,0.0,326.0,40.0,0.0,500
HR_HU,1700,1700,1700,1700,999.0,6.194,0.07,40.0,0.0,326.0,40.0,0.0,2000
HR_IT,0,0,0,0,999.0,6.194,0.07,40.0,0.0,326.0,40.0,0.0,0
HR_SI,2000,2000,2000,2000,999.0,6.194,0.07,40.0,0.0,326.0,40.0,0.0,2500
IE_UK,500,500,500,500,999.0,6.194,0.07,40.0,0.0,326.0,40.0,0.0,
IT_SI,660,660,650,650,999.0,6.194,0.07,40.0,0.0,326.0,40.0,0.0,1650
LT_LV,950,950,950,950,999.0,6.194,0.07,40.0,0.0,326.0,40.0,0.0,1350
LT_PL,500,500,500,500,999.0,6.194,0.07,40.0,0.0,326.0,40.0,0.0,500
LT_SE,0,0,0,0,999.0,6.194,0.07,40.0,0.0,326.0,40.0,0.0,700
NL_NO,700,700,700,700,999.0,6.194,0.07,40.0,0.0,326.0,40.0,0.0,1700
NL_UK,1000,1000,1000,1000,999.0,6.194,0.07,40.0,0.0,326.0,40.0,0.0,
NO_SE,4395,4395,3995,3995,999.0,6.194,0.07,40.0,0.0,326.0,40.0,0.0,3845
NO_UK,1400,1400,1400,1400,999.0,6.194,0.07,40.0,0.0,326.0,40.0,0.0,
PL_SE,600,600,600,600,999.0,6.194,0.07,40.0,0.0,326.0,40.0,0.0,600
PL_SK,0,0,0,0,999.0,6.194,0.07,40.0,0.0,326.0,40.0,0.0,990
