l,AT,BE,BG,CH,CY,CZ,DE,DK,EE,ES,FI,FR,GR,HR,HU,IE,IT,LT,LU,LV,NL,NO,PL,PT,RO,SE,SI,SK,UK,comments
AT_CH,1,,,-1,,,,,,,,,,,,,,,,,,,,,,,,,,
AT_CZ,1,,,,,-1,,,,,,,,,,,,,,,,,,,,,,,,
AT_DE,1,,,,,,-1,,,,,,,,,,,,,,,,,,,,,,,
AT_HR,1,,,,,,,,,,,,,-1,,,,,,,,,,,,,,,,
AT_HU,1,,,,,,,,,,,,,,-1,,,,,,,,,,,,,,,
AT_IT,1,,,,,,,,,,,,,,,,-1,,,,,,,,,,,,,
AT_SI,1,,,,,,,,,,,,,,,,,,,,,,,,,,-1,,,
AT_SK,1,,,,,,,,,,,,,,,,,,,,,,,,,,,-1,,
BE_DE,,1,,,,,-1,,,,,,,,,,,,,,,,,,,,,,,
BE_FR,,1,,,,,,,,,,-1,,,,,,,,,,,,,,,,,,
BE_LU,,1,,,,,,,,,,,,,,,,,-1,,,,,,,,,,,
BE_NL,,1,,,,,,,,,,,,,,,,,,,-1,,,,,,,,,
BE_UK,,1,,,,,,,,,,,,,,,,,,,,,,,,,,,-1,
BG_GR,,,1,,,,,,,,,,-1,,,,,,,,,,,,,,,,,
BG_RO,,,1,,,,,,,,,,,,,,,,,,,,,,-1,,,,,
CH_DE,,,,1,,,-1,,,,,,,,,,,,,,,,,,,,,,,
CH_FR,,,,1,,,,,,,,-1,,,,,,,,,,,,,,,,,,
CH_IT,,,,1,,,,,,,,,,,,,-1,,,,,,,,,,,,,
CZ_DE,,,,,,1,-1,,,,,,,,,,,,,,,,,,,,,,,
CZ_HU,,,,,,1,,,,,,,,,-1,,,,,,,,,,,,,,,
CZ_PL,,,,,,1,,,,,,,,,,,,,,,,,-1,,,,,,,
CZ_SK,,,,,,1,,,,,,,,,,,,,,,,,,,,,,-1,,
DE_DK,,,,,,,1,-1,,,,,,,,,,,,,,,,,,,,,,
DE_FR,,,,,,,1,,,,,-1,,,,,,,,,,,,,,,,,,
DE_LU,,,,,,,1,,,,,,,,,,,,-1,,,,,,,,,,,
DE_NL,,,,,,,1,,,,,,,,,,,,,,-1,,,,,,,,,
DE_NO,,,,,,,1,,,,,,,,,,,,,,,-1,,,,,,,,
DE_PL,,,,,,,1,,,,,,,,,,,,,,,,-1,,,,,,,
DE_SE,,,,,,,1,,,,,,,,,,,,,,,,,,,-1,,,,
DE_UK,,,,,,,1,,,,,,,,,,,,,,,,,,,,,,-1,
DK_NL,,,,,,,,1,,,,,,,,,,,,,-1,,,,,,,,,
DK_NO,,,,,,,,1,,,,,,,,,,,,,,-1,,,,,,,,
DK_PL,,,,,,,,,,,,,,,,,,,,,,,,,,,,,,
DK_SE,,,,,,,,1,,,,,,,,,,,,,,,,,,-1,,,,
DK_UK,,,,,,,,1,,,,,,,,,,,,,,,,,,,,,-1,
EE_FI,,,,,,,,,1,,-1,,,,,,,,,,,,,,,,,,,
EE_LV,,,,,,,,,1,,,,,,,,,,,-1,,,,,,,,,,
EE_SE,,,,,,,,,1,,,,,,,,,,,,,,,,,-1,,,,
ES_FR,,,,,,,,,,1,,-1,,,,,,,,,,,,,,,,,,
ES_PT,,,,,,,,,,1,,,,,,,,,,,,,,-1,,,,,,
ES_UK,,,,,,,,,,1,,,,,,,,,,,,,,,,,,,-1,
FI_NO,,,,,,,,,,,1,,,,,,,,,,,-1,,,,,,,,
FI_SE,,,,,,,,,,,1,,,,,,,,,,,,,,,-1,,,,
FR_IE,,,,,,,,,,,,1,,,,-1,,,,,,,,,,,,,,
FR_IT,,,,,,,,,,,,1,,,,,-1,,,,,,,,,,,,,
FR_LU,,,,,,,,,,,,1,,,,,,,-1,,,,,,,,,,,
FR_UK,,,,,,,,,,,,1,,,,,,,,,,,,,,,,,-1,
GR_IT,,,,,,,,,,,,,1,,,,-1,,,,,,,,,,,,,
HR_HU,,,,,,,,,,,,,,1,-1,,,,,,,,,,,,,,,
HR_IT,,,,,,,,,,,,,,1,,,-1,,,,,,,,,,,,,
HR_SI,,,,,,,,,,,,,,1,,,,,,,,,,,,,-1,,,
IE_UK,,,,,,,,,,,,,,,,1,,,,,,,,,,,,,-1,
IT_SI,,,,,,,,,,,,,,,,,1,,,,,,,,,,-1,,,
LT_LV,,,,,,,,,,,,,,,,,,1,,-1,,,,,,,,,,
LT_PL,,,,,,,,,,,,,,,,,,1,,,,,-1,,,,,,,
LT_SE,,,,,,,,,,,,,,,,,,1,,,,,,,,-1,,,,
NL_NO,,,,,,,,,,,,,,,,,,,,,1,-1,,,,,,,,
NL_UK,,,,,,,,,,,,,,,,,,,,,1,,,,,,,,-1,
NO_SE,,,,,,,,,,,,,,,,,,,,,,1,,,,-1,,,,
NO_UK,,,,,,,,,,,,,,,,,,,,,,1,,,,,,,-1,
PL_SE,,,,,,,,,,,,,,,,,,,,,,,1,,,-1,,,,
PL_SK,,,,,,,,,,,,,,,,,,,,,,,1,,,,,-1,,
