n,h2_recon,availability,efficiency,fixed_capacities,fixed_costs,interest_rate,lifetime,max_installable,min_installable,oc,variable_om
AT,H2_GT,1.0,0.4,0.0,5075.0,0.04,25.0,inf,0.0,504000.0,7.5
BE,H2_GT,1.0,0.4,0.0,5075.0,0.04,25.0,inf,0.0,504000.0,7.5
BG,H2_GT,1.0,0.4,0.0,5075.0,0.04,25.0,inf,0.0,504000.0,7.5
CH,H2_GT,1.0,0.4,0.0,5075.0,0.04,25.0,inf,0.0,504000.0,7.5
CY,H2_GT,1.0,0.4,0.0,5075.0,0.04,25.0,inf,0.0,504000.0,7.5
CZ,H2_GT,1.0,0.4,0.0,5075.0,0.04,25.0,inf,0.0,504000.0,7.5
DE,H2_GT,1.0,0.4,0.0,5075.0,0.04,25.0,inf,0.0,504000.0,7.5
DK,H2_GT,1.0,0.4,0.0,5075.0,0.04,25.0,inf,0.0,504000.0,7.5
EE,H2_GT,1.0,0.4,0.0,5075.0,0.04,25.0,inf,0.0,504000.0,7.5
ES,H2_GT,1.0,0.4,0.0,5075.0,0.04,25.0,inf,0.0,504000.0,7.5
FI,H2_GT,1.0,0.4,0.0,5075.0,0.04,25.0,inf,0.0,504000.0,7.5
FR,H2_GT,1.0,0.4,0.0,5075.0,0.04,25.0,inf,0.0,504000.0,7.5
GB,H2_GT,1.0,0.4,0.0,5075.0,0.04,25.0,inf,0.0,504000.0,7.5
GR,H2_GT,1.0,0.4,0.0,5075.0,0.04,25.0,inf,0.0,504000.0,7.5
HR,H2_GT,1.0,0.4,0.0,5075.0,0.04,25.0,inf,0.0,504000.0,7.5
HU,H2_GT,1.0,0.4,0.0,5075.0,0.04,25.0,inf,0.0,504000.0,7.5
IE,H2_GT,1.0,0.4,0.0,5075.0,0.04,25.0,inf,0.0,504000.0,7.5
IEsem,H2_GT,1.0,0.4,0.0,5075.0,0.04,25.0,inf,0.0,504000.0,7.5
IT,H2_GT,1.0,0.4,0.0,5075.0,0.04,25.0,inf,0.0,504000.0,7.5
LT,H2_GT,1.0,0.4,0.0,5075.0,0.04,25.0,inf,0.0,504000.0,7.5
LU,H2_GT,1.0,0.4,0.0,5075.0,0.04,25.0,inf,0.0,504000.0,7.5
LV,H2_GT,1.0,0.4,0.0,5075.0,0.04,25.0,inf,0.0,504000.0,7.5
NL,H2_GT,1.0,0.4,0.0,5075.0,0.04,25.0,inf,0.0,504000.0,7.5
NO,H2_GT,1.0,0.4,0.0,5075.0,0.04,25.0,inf,0.0,504000.0,7.5
PL,H2_GT,1.0,0.4,0.0,5075.0,0.04,25.0,inf,0.0,504000.0,7.5
PT,H2_GT,1.0,0.4,0.0,5075.0,0.04,25.0,inf,0.0,504000.0,7.5
RO,H2_GT,1.0,0.4,0.0,5075.0,0.04,25.0,inf,0.0,504000.0,7.5
SE,H2_GT,1.0,0.4,0.0,5075.0,0.04,25.0,inf,0.0,504000.0,7.5
SI,H2_GT,1.0,0.4,0.0,5075.0,0.04,25.0,inf,0.0,504000.0,7.5
SK,H2_GT,1.0,0.4,0.0,5075.0,0.04,25.0,inf,0.0,504000.0,7.5
