n,dsm,dsm_type,efficiency,fc,interest_rate,lifetime,max_duration,max_installable,mc,oc,recovery_time
AT,DSM_curt1,curt,0.0,1000.0,0.04,10.0,4.0,3300.0,500.0,10000.0,24.0
AT,DSM_curt2,curt,0.0,1000.0,0.04,10.0,4.0,1600.0,1500.0,10000.0,24.0
AT,DSM_curt3,curt,0.0,1000.0,0.04,10.0,4.0,5400.0,8000.0,10000.0,24.0
AT,DSM_shift1,shift,1.0,0.0,0.04,10.0,1.0,792.5,0.5,745319.840983014,1.0
AT,DSM_shift2,shift,1.0,0.0,0.04,10.0,2.0,2534.75,0.5,1516558.90460672,1.0
AT,DSM_shift3,shift,1.0,0.0,0.04,10.0,3.0,1385.0,50.0,10000.0,1.0
AT,DSM_shift4,shift,1.0,0.0,0.04,10.0,4.0,1450.75,0.5,834723.418921248,1.0
AT,DSM_shift5,shift,1.0,0.0,0.04,10.0,12.0,1050.0,0.5,30000.0,1.0
BE,DSM_curt1,curt,0.0,1000.0,0.04,10.0,4.0,3300.0,500.0,10000.0,24.0
BE,DSM_curt2,curt,0.0,1000.0,0.04,10.0,4.0,1600.0,1500.0,10000.0,24.0
BE,DSM_curt3,curt,0.0,1000.0,0.04,10.0,4.0,5400.0,8000.0,10000.0,24.0
BE,DSM_shift1,shift,1.0,0.0,0.04,10.0,1.0,792.5,0.5,745319.840983014,1.0
BE,DSM_shift2,shift,1.0,0.0,0.04,10.0,2.0,2534.75,0.5,1516558.90460672,1.0
BE,DSM_shift3,shift,1.0,0.0,0.04,10.0,3.0,1385.0,50.0,10000.0,1.0
BE,DSM_shift4,shift,1.0,0.0,0.04,10.0,4.0,1450.75,0.5,834723.418921248,1.0
BE,DSM_shift5,shift,1.0,0.0,0.04,10.0,12.0,1050.0,0.5,30000.0,1.0
CH,DSM_curt1,curt,0.0,1000.0,0.04,10.0,4.0,3300.0,500.0,10000.0,24.0
CH,DSM_curt2,curt,0.0,1000.0,0.04,10.0,4.0,1600.0,1500.0,10000.0,24.0
CH,DSM_curt3,curt,0.0,1000.0,0.04,10.0,4.0,5400.0,8000.0,10000.0,24.0
CH,DSM_shift1,shift,1.0,0.0,0.04,10.0,1.0,792.5,0.5,745319.840983014,1.0
CH,DSM_shift2,shift,1.0,0.0,0.04,10.0,2.0,2534.75,0.5,1516558.90460672,1.0
CH,DSM_shift3,shift,1.0,0.0,0.04,10.0,3.0,1385.0,50.0,10000.0,1.0
CH,DSM_shift4,shift,1.0,0.0,0.04,10.0,4.0,1450.75,0.5,834723.418921248,1.0
CH,DSM_shift5,shift,1.0,0.0,0.04,10.0,12.0,1050.0,0.5,30000.0,1.0
CZ,DSM_curt1,curt,0.0,1000.0,0.04,10.0,4.0,3300.0,500.0,10000.0,24.0
CZ,DSM_curt2,curt,0.0,1000.0,0.04,10.0,4.0,1600.0,1500.0,10000.0,24.0
CZ,DSM_curt3,curt,0.0,1000.0,0.04,10.0,4.0,5400.0,8000.0,10000.0,24.0
CZ,DSM_shift1,shift,1.0,0.0,0.04,10.0,1.0,792.5,0.5,745319.840983014,1.0
CZ,DSM_shift2,shift,1.0,0.0,0.04,10.0,2.0,2534.75,0.5,1516558.90460672,1.0
CZ,DSM_shift3,shift,1.0,0.0,0.04,10.0,3.0,1385.0,50.0,10000.0,1.0
CZ,DSM_shift4,shift,1.0,0.0,0.04,10.0,4.0,1450.75,0.5,834723.418921248,1.0
CZ,DSM_shift5,shift,1.0,0.0,0.04,10.0,12.0,1050.0,0.5,30000.0,1.0
DE,DSM_curt1,curt,0.0,1000.0,0.04,10.0,4.0,3300.0,500.0,10000.0,24.0
DE,DSM_curt2,curt,0.0,1000.0,0.04,10.0,4.0,1600.0,1500.0,10000.0,24.0
DE,DSM_curt3,curt,0.0,1000.0,0.04,10.0,4.0,5400.0,8000.0,10000.0,24.0
DE,DSM_shift1,shift,1.0,0.0,0.04,10.0,1.0,792.5,0.5,745319.840983014,1.0
DE,DSM_shift2,shift,1.0,0.0,0.04,10.0,2.0,2534.75,0.5,1516558.90460672,1.0
DE,DSM_shift3,shift,1.0,0.0,0.04,10.0,3.0,1385.0,50.0,10000.0,1.0
DE,DSM_shift4,shift,1.0,0.0,0.04,10.0,4.0,1450.75,0.5,834723.418921248,1.0
DE,DSM_shift5,shift,1.0,0.0,0.04,10.0,12.0,1050.0,0.5,30000.0,1.0
DK,DSM_curt1,curt,0.0,1000.0,0.04,10.0,4.0,3300.0,500.0,10000.0,24.0
DK,DSM_curt2,curt,0.0,1000.0,0.04,10.0,4.0,1600.0,1500.0,10000.0,24.0
DK,DSM_curt3,curt,0.0,1000.0,0.04,10.0,4.0,5400.0,8000.0,10000.0,24.0
DK,DSM_shift1,shift,1.0,0.0,0.04,10.0,1.0,792.5,0.5,745319.840983014,1.0
DK,DSM_shift2,shift,1.0,0.0,0.04,10.0,2.0,2534.75,0.5,1516558.90460672,1.0
DK,DSM_shift3,shift,1.0,0.0,0.04,10.0,3.0,1385.0,50.0,10000.0,1.0
DK,DSM_shift4,shift,1.0,0.0,0.04,10.0,4.0,1450.75,0.5,834723.418921248,1.0
DK,DSM_shift5,shift,1.0,0.0,0.04,10.0,12.0,1050.0,0.5,30000.0,1.0
FR,DSM_curt1,curt,0.0,1000.0,0.04,10.0,4.0,3300.0,500.0,10000.0,24.0
FR,DSM_curt2,curt,0.0,1000.0,0.04,10.0,4.0,1600.0,1500.0,10000.0,24.0
FR,DSM_curt3,curt,0.0,1000.0,0.04,10.0,4.0,5400.0,8000.0,10000.0,24.0
FR,DSM_shift1,shift,1.0,0.0,0.04,10.0,1.0,792.5,0.5,745319.840983014,1.0
FR,DSM_shift2,shift,1.0,0.0,0.04,10.0,2.0,2534.75,0.5,1516558.90460672,1.0
FR,DSM_shift3,shift,1.0,0.0,0.04,10.0,3.0,1385.0,50.0,10000.0,1.0
FR,DSM_shift4,shift,1.0,0.0,0.04,10.0,4.0,1450.75,0.5,834723.418921248,1.0
FR,DSM_shift5,shift,1.0,0.0,0.04,10.0,12.0,1050.0,0.5,30000.0,1.0
IT,DSM_curt1,curt,0.0,1000.0,0.04,10.0,4.0,3300.0,500.0,10000.0,24.0
IT,DSM_curt2,curt,0.0,1000.0,0.04,10.0,4.0,1600.0,1500.0,10000.0,24.0
IT,DSM_curt3,curt,0.0,1000.0,0.04,10.0,4.0,5400.0,8000.0,10000.0,24.0
IT,DSM_shift1,shift,1.0,0.0,0.04,10.0,1.0,792.5,0.5,745319.840983014,1.0
IT,DSM_shift2,shift,1.0,0.0,0.04,10.0,2.0,2534.75,0.5,1516558.90460672,1.0
IT,DSM_shift3,shift,1.0,0.0,0.04,10.0,3.0,1385.0,50.0,10000.0,1.0
IT,DSM_shift4,shift,1.0,0.0,0.04,10.0,4.0,1450.75,0.5,834723.418921248,1.0
IT,DSM_shift5,shift,1.0,0.0,0.04,10.0,12.0,1050.0,0.5,30000.0,1.0
LU,DSM_curt1,curt,0.0,1000.0,0.04,10.0,4.0,3300.0,500.0,10000.0,24.0
LU,DSM_curt2,curt,0.0,1000.0,0.04,10.0,4.0,1600.0,1500.0,10000.0,24.0
LU,DSM_curt3,curt,0.0,1000.0,0.04,10.0,4.0,5400.0,8000.0,10000.0,24.0
LU,DSM_shift1,shift,1.0,0.0,0.04,10.0,1.0,792.5,0.5,745319.840983014,1.0
LU,DSM_shift2,shift,1.0,0.0,0.04,10.0,2.0,2534.75,0.5,1516558.90460672,1.0
LU,DSM_shift3,shift,1.0,0.0,0.04,10.0,3.0,1385.0,50.0,10000.0,1.0
LU,DSM_shift4,shift,1.0,0.0,0.04,10.0,4.0,1450.75,0.5,834723.418921248,1.0
LU,DSM_shift5,shift,1.0,0.0,0.04,10.0,12.0,1050.0,0.5,30000.0,1.0
NL,DSM_curt1,curt,0.0,1000.0,0.04,10.0,4.0,3300.0,500.0,10000.0,24.0
NL,DSM_curt2,curt,0.0,1000.0,0.04,10.0,4.0,1600.0,1500.0,10000.0,24.0
NL,DSM_curt3,curt,0.0,1000.0,0.04,10.0,4.0,5400.0,8000.0,10000.0,24.0
NL,DSM_shift1,shift,1.0,0.0,0.04,10.0,1.0,792.5,0.5,745319.840983014,1.0
NL,DSM_shift2,shift,1.0,0.0,0.04,10.0,2.0,2534.75,0.5,1516558.90460672,1.0
NL,DSM_shift3,shift,1.0,0.0,0.04,10.0,3.0,1385.0,50.0,10000.0,1.0
NL,DSM_shift4,shift,1.0,0.0,0.04,10.0,4.0,1450.75,0.5,834723.418921248,1.0
NL,DSM_shift5,shift,1.0,0.0,0.04,10.0,12.0,1050.0,0.5,30000.0,1.0
PL,DSM_curt1,curt,0.0,1000.0,0.04,10.0,4.0,3300.0,500.0,10000.0,24.0
PL,DSM_curt2,curt,0.0,1000.0,0.04,10.0,4.0,1600.0,1500.0,10000.0,24.0
PL,DSM_curt3,curt,0.0,1000.0,0.04,10.0,4.0,5400.0,8000.0,10000.0,24.0
PL,DSM_shift1,shift,1.0,0.0,0.04,10.0,1.0,792.5,0.5,745319.840983014,1.0
PL,DSM_shift2,shift,1.0,0.0,0.04,10.0,2.0,2534.75,0.5,1516558.90460672,1.0
PL,DSM_shift3,shift,1.0,0.0,0.04,10.0,3.0,1385.0,50.0,10000.0,1.0
PL,DSM_shift4,shift,1.0,0.0,0.04,10.0,4.0,1450.75,0.5,834723.418921248,1.0
PL,DSM_shift5,shift,1.0,0.0,0.04,10.0,12.0,1050.0,0.5,30000.0,1.0
