features,category,sets,dtype,1,2,3,4,5,6,7,8,9,10,11,12,13,14
custom_h2yr,metadata,,Int,30000000,30000000,30000000,30000000,30000000,30000000,30000000,30000000,30000000,30000000,30000000,30000000,30000000,30000000
custom_evnr,metadata,,Int,0,15000000,15000000,15000000,15000000,15000000,15000000,0,15000000,15000000,15000000,15000000,15000000,15000000
custom_weather,metadata,,String,Normal,Normal,Normal,Normal,Normal,Normal,Normal,Normal,Normal,Normal,Normal,Normal,Normal,Normal
custom_extev,metadata,,Int,0,1,1,1,1,1,1,0,1,1,1,1,1,1
custom_exth2,metadata,,Int,1,1,1,1,1,1,1,1,1,1,1,1,1,1
custom_network,metadata,,String,full,full,full,full,full,full,full,full,full,full,full,full,full,full
custom_pipeline,metadata,,String,none,none,none,none,none,none,none,none,none,none,none,none,none,none
custom_bidirectional,metadata,,String,full,full,full,full,full,full,full,full,full,full,full,full,full,full
custom_co2,metadata,,Int,130,130,130,130,130,130,130,130,130,130,130,130,130,130
custom_inflex,metadata,,Float32,0,0,0,0.4,0.7,0.7,1,0,0,0,0.4,0.7,0.7,1
custom_smart,metadata,,Float32,1,1,0,0.3,0.3,0,0,1,1,0,0.3,0.3,0,0
custom_v2g,metadata,,Float32,0,0,1,0.3,0,0.3,0,0,0,1,0.3,0,0.3,0
custom_note,metadata,,String,NoChange,NoChange,NoChange,NoChange,NoChange,NoChange,NoChange,LoCost,LoCost,LoCost,LoCost,LoCost,LoCost,LoCost
ev,extension,DE,Int,0,1,1,1,1,1,1,0,1,1,1,1,1,1
h2,extension,DE,Int,1,1,1,1,1,1,1,1,1,1,1,1,1,1
ev_bidirectional_time,timeseries,,String,,,,,,,,,,,,,,
gen_availability,timeseries,,String,Normal,Normal,Normal,Normal,Normal,Normal,Normal,Normal,Normal,Normal,Normal,Normal,Normal,Normal
gen_min_power,parameter,DE:Onshore Wind,Float32,0,0,0,0,0,0,0,0,0,0,0,0,0,0
gen_min_power,parameter,DE:Solar Photovoltaic,Float32,0,0,0,0,0,0,0,0,0,0,0,0,0,0
gen_fixed_cost,parameter,DE:Onshore Wind,Float32,35000,35000,35000,35000,35000,35000,35000,13455,13455,13455,13455,13455,13455,13455
gen_fixed_cost,parameter,DE:Solar Photovoltaic,Float32,25000,25000,25000,25000,25000,25000,25000,12975,12975,12975,12975,12975,12975,12975
gen_lifetime,parameter,DE:Onshore Wind,Float32,25,25,25,25,25,25,25,27,27,27,27,27,27,27
gen_lifetime,parameter,DE:Solar Photovoltaic,Float32,25,25,25,25,25,25,25,30,30,30,30,30,30,30
node_co2_price,parameter,n,Int,130,130,130,130,130,130,130,130,130,130,130,130,130,130
node_hydrogen_yr_demand,parameter,DE,Int,30000000,30000000,30000000,30000000,30000000,30000000,30000000,30000000,30000000,30000000,30000000,30000000,30000000,30000000
node_hydrogen_hr_fraction,parameter,DE,Float32,0.0001142,0.0001142,0.0001142,0.0001142,0.0001142,0.0001142,0.0001142,0.0001142,0.0001142,0.0001142,0.0001142,0.0001142,0.0001142,0.0001142
node_ev_quantity,parameter,DE,Int,0,15000000,15000000,15000000,15000000,15000000,15000000,0,15000000,15000000,15000000,15000000,15000000,15000000
ev_exogenous_enabled,parameter,DE:ev001,Int,0,0,0,1,1,0,1,0,0,0,1,1,0,1
ev_discharge_enabled,parameter,DE:ev001,Int,0,0,1,0,0,1,0,0,0,1,0,0,1,0
ev_exogenous_enabled,parameter,DE:ev002,Int,0,0,0,0,1,1,1,0,0,0,0,1,1,1
ev_discharge_enabled,parameter,DE:ev002,Int,0,0,1,1,0,0,0,0,0,1,1,0,0,0
ev_exogenous_enabled,parameter,DE:ev003,Int,0,0,0,0,1,0,1,0,0,0,0,1,0,1
ev_discharge_enabled,parameter,DE:ev003,Int,0,0,1,0,0,1,0,0,0,1,0,0,1,0
ev_exogenous_enabled,parameter,DE:ev004,Int,0,0,0,0,1,1,1,0,0,0,0,1,1,1
ev_discharge_enabled,parameter,DE:ev004,Int,0,0,1,1,0,0,0,0,0,1,1,0,0,0
ev_exogenous_enabled,parameter,DE:ev005,Int,0,0,0,1,0,0,1,0,0,0,1,0,0,1
ev_discharge_enabled,parameter,DE:ev005,Int,0,0,1,0,0,1,0,0,0,1,0,0,1,0
ev_exogenous_enabled,parameter,DE:ev006,Int,0,0,0,0,1,1,1,0,0,0,0,1,1,1
ev_discharge_enabled,parameter,DE:ev006,Int,0,0,1,0,0,0,0,0,0,1,0,0,0,0
ev_exogenous_enabled,parameter,DE:ev007,Int,0,0,0,1,1,1,1,0,0,0,1,1,1,1
ev_discharge_enabled,parameter,DE:ev007,Int,0,0,1,0,0,0,0,0,0,1,0,0,0,0
ev_exogenous_enabled,parameter,DE:ev008,Int,0,0,0,1,1,1,1,0,0,0,1,1,1,1
ev_discharge_enabled,parameter,DE:ev008,Int,0,0,1,0,0,0,0,0,0,1,0,0,0,0
ev_exogenous_enabled,parameter,DE:ev009,Int,0,0,0,0,1,1,1,0,0,0,0,1,1,1
ev_discharge_enabled,parameter,DE:ev009,Int,0,0,1,0,0,0,0,0,0,1,0,0,0,0
ev_exogenous_enabled,parameter,DE:ev010,Int,0,0,0,0,1,1,1,0,0,0,0,1,1,1
ev_discharge_enabled,parameter,DE:ev010,Int,0,0,1,0,0,0,0,0,0,1,0,0,0,0
ev_exogenous_enabled,parameter,DE:ev011,Int,0,0,0,1,1,1,1,0,0,0,1,1,1,1
ev_discharge_enabled,parameter,DE:ev011,Int,0,0,1,0,0,0,0,0,0,1,0,0,0,0
ev_exogenous_enabled,parameter,DE:ev012,Int,0,0,0,1,0,1,1,0,0,0,1,0,1,1
ev_discharge_enabled,parameter,DE:ev012,Int,0,0,1,0,0,0,0,0,0,1,0,0,0,0
ev_exogenous_enabled,parameter,DE:ev013,Int,0,0,0,0,1,0,1,0,0,0,0,1,0,1
ev_discharge_enabled,parameter,DE:ev013,Int,0,0,1,0,0,1,0,0,0,1,0,0,1,0
ev_exogenous_enabled,parameter,DE:ev014,Int,0,0,0,1,1,1,1,0,0,0,1,1,1,1
ev_discharge_enabled,parameter,DE:ev014,Int,0,0,1,0,0,0,0,0,0,1,0,0,0,0
ev_exogenous_enabled,parameter,DE:ev015,Int,0,0,0,1,1,0,1,0,0,0,1,1,0,1
ev_discharge_enabled,parameter,DE:ev015,Int,0,0,1,0,0,1,0,0,0,1,0,0,1,0
ev_exogenous_enabled,parameter,DE:ev016,Int,0,0,0,0,1,1,1,0,0,0,0,1,1,1
ev_discharge_enabled,parameter,DE:ev016,Int,0,0,1,1,0,0,0,0,0,1,1,0,0,0
ev_exogenous_enabled,parameter,DE:ev017,Int,0,0,0,0,1,1,1,0,0,0,0,1,1,1
ev_discharge_enabled,parameter,DE:ev017,Int,0,0,1,1,0,0,0,0,0,1,1,0,0,0
ev_exogenous_enabled,parameter,DE:ev018,Int,0,0,0,1,0,1,1,0,0,0,1,0,1,1
ev_discharge_enabled,parameter,DE:ev018,Int,0,0,1,0,0,0,0,0,0,1,0,0,0,0
ev_exogenous_enabled,parameter,DE:ev019,Int,0,0,0,1,1,1,1,0,0,0,1,1,1,1
ev_discharge_enabled,parameter,DE:ev019,Int,0,0,1,0,0,0,0,0,0,1,0,0,0,0
ev_exogenous_enabled,parameter,DE:ev020,Int,0,0,0,0,1,1,1,0,0,0,0,1,1,1
ev_discharge_enabled,parameter,DE:ev020,Int,0,0,1,0,0,0,0,0,0,1,0,0,0,0
ev_exogenous_enabled,parameter,DE:ev021,Int,0,0,0,1,0,0,1,0,0,0,1,0,0,1
ev_discharge_enabled,parameter,DE:ev021,Int,0,0,1,0,0,1,0,0,0,1,0,0,1,0
ev_exogenous_enabled,parameter,DE:ev022,Int,0,0,0,0,1,0,1,0,0,0,0,1,0,1
ev_discharge_enabled,parameter,DE:ev022,Int,0,0,1,1,0,1,0,0,0,1,1,0,1,0
ev_exogenous_enabled,parameter,DE:ev023,Int,0,0,0,0,0,1,1,0,0,0,0,0,1,1
ev_discharge_enabled,parameter,DE:ev023,Int,0,0,1,0,0,0,0,0,0,1,0,0,0,0
ev_exogenous_enabled,parameter,DE:ev024,Int,0,0,0,1,0,0,1,0,0,0,1,0,0,1
ev_discharge_enabled,parameter,DE:ev024,Int,0,0,1,0,0,1,0,0,0,1,0,0,1,0
ev_exogenous_enabled,parameter,DE:ev025,Int,0,0,0,0,1,1,1,0,0,0,0,1,1,1
ev_discharge_enabled,parameter,DE:ev025,Int,0,0,1,0,0,0,0,0,0,1,0,0,0,0
ev_exogenous_enabled,parameter,DE:ev026,Int,0,0,0,0,1,1,1,0,0,0,0,1,1,1
ev_discharge_enabled,parameter,DE:ev026,Int,0,0,1,0,0,0,0,0,0,1,0,0,0,0
ev_exogenous_enabled,parameter,DE:ev027,Int,0,0,0,1,1,0,1,0,0,0,1,1,0,1
ev_discharge_enabled,parameter,DE:ev027,Int,0,0,1,0,0,1,0,0,0,1,0,0,1,0
ev_exogenous_enabled,parameter,DE:ev028,Int,0,0,0,1,0,1,1,0,0,0,1,0,1,1
ev_discharge_enabled,parameter,DE:ev028,Int,0,0,1,0,0,0,0,0,0,1,0,0,0,0
ev_exogenous_enabled,parameter,DE:ev029,Int,0,0,0,1,0,1,1,0,0,0,1,0,1,1
ev_discharge_enabled,parameter,DE:ev029,Int,0,0,1,0,0,0,0,0,0,1,0,0,0,0
ev_exogenous_enabled,parameter,DE:ev030,Int,0,0,0,0,1,1,1,0,0,0,0,1,1,1
ev_discharge_enabled,parameter,DE:ev030,Int,0,0,1,1,0,0,0,0,0,1,1,0,0,0
ev_exogenous_enabled,parameter,DE:ev031,Int,0,0,0,1,0,1,1,0,0,0,1,0,1,1
ev_discharge_enabled,parameter,DE:ev031,Int,0,0,1,0,0,0,0,0,0,1,0,0,0,0
ev_exogenous_enabled,parameter,DE:ev032,Int,0,0,0,1,0,0,1,0,0,0,1,0,0,1
ev_discharge_enabled,parameter,DE:ev032,Int,0,0,1,0,0,1,0,0,0,1,0,0,1,0
ev_exogenous_enabled,parameter,DE:ev033,Int,0,0,0,0,0,1,1,0,0,0,0,0,1,1
ev_discharge_enabled,parameter,DE:ev033,Int,0,0,1,1,0,0,0,0,0,1,1,0,0,0
ev_exogenous_enabled,parameter,DE:ev034,Int,0,0,0,0,1,1,1,0,0,0,0,1,1,1
ev_discharge_enabled,parameter,DE:ev034,Int,0,0,1,1,0,0,0,0,0,1,1,0,0,0
ev_exogenous_enabled,parameter,DE:ev035,Int,0,0,0,1,1,1,1,0,0,0,1,1,1,1
ev_discharge_enabled,parameter,DE:ev035,Int,0,0,1,0,0,0,0,0,0,1,0,0,0,0
ev_exogenous_enabled,parameter,DE:ev036,Int,0,0,0,0,1,1,1,0,0,0,0,1,1,1
ev_discharge_enabled,parameter,DE:ev036,Int,0,0,1,1,0,0,0,0,0,1,1,0,0,0
ev_exogenous_enabled,parameter,DE:ev037,Int,0,0,0,0,1,1,1,0,0,0,0,1,1,1
ev_discharge_enabled,parameter,DE:ev037,Int,0,0,1,1,0,0,0,0,0,1,1,0,0,0
ev_exogenous_enabled,parameter,DE:ev038,Int,0,0,0,0,1,1,1,0,0,0,0,1,1,1
ev_discharge_enabled,parameter,DE:ev038,Int,0,0,1,0,0,0,0,0,0,1,0,0,0,0
ev_exogenous_enabled,parameter,DE:ev039,Int,0,0,0,0,0,1,1,0,0,0,0,0,1,1
ev_discharge_enabled,parameter,DE:ev039,Int,0,0,1,1,0,0,0,0,0,1,1,0,0,0
ev_exogenous_enabled,parameter,DE:ev040,Int,0,0,0,0,0,1,1,0,0,0,0,0,1,1
ev_discharge_enabled,parameter,DE:ev040,Int,0,0,1,0,0,0,0,0,0,1,0,0,0,0
ev_exogenous_enabled,parameter,DE:ev041,Int,0,0,0,1,1,0,1,0,0,0,1,1,0,1
ev_discharge_enabled,parameter,DE:ev041,Int,0,0,1,0,0,1,0,0,0,1,0,0,1,0
ev_exogenous_enabled,parameter,DE:ev042,Int,0,0,0,0,1,1,1,0,0,0,0,1,1,1
ev_discharge_enabled,parameter,DE:ev042,Int,0,0,1,0,0,0,0,0,0,1,0,0,0,0
ev_exogenous_enabled,parameter,DE:ev043,Int,0,0,0,0,1,0,1,0,0,0,0,1,0,1
ev_discharge_enabled,parameter,DE:ev043,Int,0,0,1,0,0,1,0,0,0,1,0,0,1,0
ev_exogenous_enabled,parameter,DE:ev044,Int,0,0,0,0,1,1,1,0,0,0,0,1,1,1
ev_discharge_enabled,parameter,DE:ev044,Int,0,0,1,0,0,0,0,0,0,1,0,0,0,0
ev_exogenous_enabled,parameter,DE:ev045,Int,0,0,0,1,1,1,1,0,0,0,1,1,1,1
ev_discharge_enabled,parameter,DE:ev045,Int,0,0,1,0,0,0,0,0,0,1,0,0,0,0
ev_exogenous_enabled,parameter,DE:ev046,Int,0,0,0,0,1,1,1,0,0,0,0,1,1,1
ev_discharge_enabled,parameter,DE:ev046,Int,0,0,1,1,0,0,0,0,0,1,1,0,0,0
ev_exogenous_enabled,parameter,DE:ev047,Int,0,0,0,1,0,1,1,0,0,0,1,0,1,1
ev_discharge_enabled,parameter,DE:ev047,Int,0,0,1,0,0,0,0,0,0,1,0,0,0,0
ev_exogenous_enabled,parameter,DE:ev048,Int,0,0,0,0,1,1,1,0,0,0,0,1,1,1
ev_discharge_enabled,parameter,DE:ev048,Int,0,0,1,1,0,0,0,0,0,1,1,0,0,0
ev_exogenous_enabled,parameter,DE:ev049,Int,0,0,0,1,1,1,1,0,0,0,1,1,1,1
ev_discharge_enabled,parameter,DE:ev049,Int,0,0,1,0,0,0,0,0,0,1,0,0,0,0
ev_exogenous_enabled,parameter,DE:ev050,Int,0,0,0,1,1,1,1,0,0,0,1,1,1,1
ev_discharge_enabled,parameter,DE:ev050,Int,0,0,1,0,0,0,0,0,0,1,0,0,0,0
ev_exogenous_enabled,parameter,DE:ev051,Int,0,0,0,0,1,1,1,0,0,0,0,1,1,1
ev_discharge_enabled,parameter,DE:ev051,Int,0,0,1,0,0,0,0,0,0,1,0,0,0,0
ev_exogenous_enabled,parameter,DE:ev052,Int,0,0,0,0,1,0,1,0,0,0,0,1,0,1
ev_discharge_enabled,parameter,DE:ev052,Int,0,0,1,0,0,1,0,0,0,1,0,0,1,0
ev_exogenous_enabled,parameter,DE:ev053,Int,0,0,0,1,1,1,1,0,0,0,1,1,1,1
ev_discharge_enabled,parameter,DE:ev053,Int,0,0,1,0,0,0,0,0,0,1,0,0,0,0
ev_exogenous_enabled,parameter,DE:ev054,Int,0,0,0,0,1,1,1,0,0,0,0,1,1,1
ev_discharge_enabled,parameter,DE:ev054,Int,0,0,1,0,0,0,0,0,0,1,0,0,0,0
ev_exogenous_enabled,parameter,DE:ev055,Int,0,0,0,1,1,0,1,0,0,0,1,1,0,1
ev_discharge_enabled,parameter,DE:ev055,Int,0,0,1,0,0,1,0,0,0,1,0,0,1,0
ev_exogenous_enabled,parameter,DE:ev056,Int,0,0,0,0,1,0,1,0,0,0,0,1,0,1
ev_discharge_enabled,parameter,DE:ev056,Int,0,0,1,0,0,1,0,0,0,1,0,0,1,0
ev_exogenous_enabled,parameter,DE:ev057,Int,0,0,0,1,1,0,1,0,0,0,1,1,0,1
ev_discharge_enabled,parameter,DE:ev057,Int,0,0,1,0,0,1,0,0,0,1,0,0,1,0
ev_exogenous_enabled,parameter,DE:ev058,Int,0,0,0,0,0,1,1,0,0,0,0,0,1,1
ev_discharge_enabled,parameter,DE:ev058,Int,0,0,1,0,0,0,0,0,0,1,0,0,0,0
ev_exogenous_enabled,parameter,DE:ev059,Int,0,0,0,0,1,0,1,0,0,0,0,1,0,1
ev_discharge_enabled,parameter,DE:ev059,Int,0,0,1,0,0,1,0,0,0,1,0,0,1,0
ev_exogenous_enabled,parameter,DE:ev060,Int,0,0,0,0,1,0,1,0,0,0,0,1,0,1
ev_discharge_enabled,parameter,DE:ev060,Int,0,0,1,0,0,1,0,0,0,1,0,0,1,0
ev_exogenous_enabled,parameter,DE:ev061,Int,0,0,0,0,1,0,1,0,0,0,0,1,0,1
ev_discharge_enabled,parameter,DE:ev061,Int,0,0,1,1,0,1,0,0,0,1,1,0,1,0
ev_exogenous_enabled,parameter,DE:ev062,Int,0,0,0,0,1,1,1,0,0,0,0,1,1,1
ev_discharge_enabled,parameter,DE:ev062,Int,0,0,1,1,0,0,0,0,0,1,1,0,0,0
ev_exogenous_enabled,parameter,DE:ev063,Int,0,0,0,0,1,0,1,0,0,0,0,1,0,1
ev_discharge_enabled,parameter,DE:ev063,Int,0,0,1,0,0,1,0,0,0,1,0,0,1,0
ev_exogenous_enabled,parameter,DE:ev064,Int,0,0,0,1,0,1,1,0,0,0,1,0,1,1
ev_discharge_enabled,parameter,DE:ev064,Int,0,0,1,0,0,0,0,0,0,1,0,0,0,0
ev_exogenous_enabled,parameter,DE:ev065,Int,0,0,0,0,1,1,1,0,0,0,0,1,1,1
ev_discharge_enabled,parameter,DE:ev065,Int,0,0,1,1,0,0,0,0,0,1,1,0,0,0
ev_exogenous_enabled,parameter,DE:ev066,Int,0,0,0,0,1,0,1,0,0,0,0,1,0,1
ev_discharge_enabled,parameter,DE:ev066,Int,0,0,1,1,0,1,0,0,0,1,1,0,1,0
ev_exogenous_enabled,parameter,DE:ev067,Int,0,0,0,0,1,1,1,0,0,0,0,1,1,1
ev_discharge_enabled,parameter,DE:ev067,Int,0,0,1,1,0,0,0,0,0,1,1,0,0,0
ev_exogenous_enabled,parameter,DE:ev068,Int,0,0,0,0,0,1,1,0,0,0,0,0,1,1
ev_discharge_enabled,parameter,DE:ev068,Int,0,0,1,1,0,0,0,0,0,1,1,0,0,0
ev_exogenous_enabled,parameter,DE:ev069,Int,0,0,0,0,0,0,1,0,0,0,0,0,0,1
ev_discharge_enabled,parameter,DE:ev069,Int,0,0,1,1,0,1,0,0,0,1,1,0,1,0
ev_exogenous_enabled,parameter,DE:ev070,Int,0,0,0,0,1,0,1,0,0,0,0,1,0,1
ev_discharge_enabled,parameter,DE:ev070,Int,0,0,1,1,0,1,0,0,0,1,1,0,1,0
ev_exogenous_enabled,parameter,DE:ev071,Int,0,0,0,0,1,0,1,0,0,0,0,1,0,1
ev_discharge_enabled,parameter,DE:ev071,Int,0,0,1,0,0,1,0,0,0,1,0,0,1,0
ev_exogenous_enabled,parameter,DE:ev072,Int,0,0,0,1,0,0,1,0,0,0,1,0,0,1
ev_discharge_enabled,parameter,DE:ev072,Int,0,0,1,0,0,1,0,0,0,1,0,0,1,0
ev_exogenous_enabled,parameter,DE:ev073,Int,0,0,0,0,1,1,1,0,0,0,0,1,1,1
ev_discharge_enabled,parameter,DE:ev073,Int,0,0,1,1,0,0,0,0,0,1,1,0,0,0
ev_exogenous_enabled,parameter,DE:ev074,Int,0,0,0,1,0,1,1,0,0,0,1,0,1,1
ev_discharge_enabled,parameter,DE:ev074,Int,0,0,1,0,0,0,0,0,0,1,0,0,0,0
ev_exogenous_enabled,parameter,DE:ev075,Int,0,0,0,0,1,1,1,0,0,0,0,1,1,1
ev_discharge_enabled,parameter,DE:ev075,Int,0,0,1,1,0,0,0,0,0,1,1,0,0,0
ev_exogenous_enabled,parameter,DE:ev076,Int,0,0,0,0,0,0,1,0,0,0,0,0,0,1
ev_discharge_enabled,parameter,DE:ev076,Int,0,0,1,1,0,1,0,0,0,1,1,0,1,0
ev_exogenous_enabled,parameter,DE:ev077,Int,0,0,0,1,1,1,1,0,0,0,1,1,1,1
ev_discharge_enabled,parameter,DE:ev077,Int,0,0,1,0,0,0,0,0,0,1,0,0,0,0
ev_exogenous_enabled,parameter,DE:ev078,Int,0,0,0,1,0,1,1,0,0,0,1,0,1,1
ev_discharge_enabled,parameter,DE:ev078,Int,0,0,1,0,0,0,0,0,0,1,0,0,0,0
ev_exogenous_enabled,parameter,DE:ev079,Int,0,0,0,0,1,1,1,0,0,0,0,1,1,1
ev_discharge_enabled,parameter,DE:ev079,Int,0,0,1,0,0,0,0,0,0,1,0,0,0,0
ev_exogenous_enabled,parameter,DE:ev080,Int,0,0,0,1,0,1,1,0,0,0,1,0,1,1
ev_discharge_enabled,parameter,DE:ev080,Int,0,0,1,0,0,0,0,0,0,1,0,0,0,0
ev_exogenous_enabled,parameter,DE:ev081,Int,0,0,0,1,0,1,1,0,0,0,1,0,1,1
ev_discharge_enabled,parameter,DE:ev081,Int,0,0,1,0,0,0,0,0,0,1,0,0,0,0
ev_exogenous_enabled,parameter,DE:ev082,Int,0,0,0,1,0,1,1,0,0,0,1,0,1,1
ev_discharge_enabled,parameter,DE:ev082,Int,0,0,1,0,0,0,0,0,0,1,0,0,0,0
ev_exogenous_enabled,parameter,DE:ev083,Int,0,0,0,1,1,0,1,0,0,0,1,1,0,1
ev_discharge_enabled,parameter,DE:ev083,Int,0,0,1,0,0,1,0,0,0,1,0,0,1,0
ev_exogenous_enabled,parameter,DE:ev084,Int,0,0,0,1,1,1,1,0,0,0,1,1,1,1
ev_discharge_enabled,parameter,DE:ev084,Int,0,0,1,0,0,0,0,0,0,1,0,0,0,0
ev_exogenous_enabled,parameter,DE:ev085,Int,0,0,0,0,1,1,1,0,0,0,0,1,1,1
ev_discharge_enabled,parameter,DE:ev085,Int,0,0,1,1,0,0,0,0,0,1,1,0,0,0
ev_exogenous_enabled,parameter,DE:ev086,Int,0,0,0,1,1,1,1,0,0,0,1,1,1,1
ev_discharge_enabled,parameter,DE:ev086,Int,0,0,1,0,0,0,0,0,0,1,0,0,0,0
ev_exogenous_enabled,parameter,DE:ev087,Int,0,0,0,0,0,1,1,0,0,0,0,0,1,1
ev_discharge_enabled,parameter,DE:ev087,Int,0,0,1,0,0,0,0,0,0,1,0,0,0,0
ev_exogenous_enabled,parameter,DE:ev088,Int,0,0,0,0,1,1,1,0,0,0,0,1,1,1
ev_discharge_enabled,parameter,DE:ev088,Int,0,0,1,0,0,0,0,0,0,1,0,0,0,0
ev_exogenous_enabled,parameter,DE:ev089,Int,0,0,0,1,1,0,1,0,0,0,1,1,0,1
ev_discharge_enabled,parameter,DE:ev089,Int,0,0,1,0,0,1,0,0,0,1,0,0,1,0
ev_exogenous_enabled,parameter,DE:ev090,Int,0,0,0,0,1,1,1,0,0,0,0,1,1,1
ev_discharge_enabled,parameter,DE:ev090,Int,0,0,1,1,0,0,0,0,0,1,1,0,0,0
ev_exogenous_enabled,parameter,DE:ev091,Int,0,0,0,1,1,1,1,0,0,0,1,1,1,1
ev_discharge_enabled,parameter,DE:ev091,Int,0,0,1,0,0,0,0,0,0,1,0,0,0,0
ev_exogenous_enabled,parameter,DE:ev092,Int,0,0,0,0,1,0,1,0,0,0,0,1,0,1
ev_discharge_enabled,parameter,DE:ev092,Int,0,0,1,1,0,1,0,0,0,1,1,0,1,0
ev_exogenous_enabled,parameter,DE:ev093,Int,0,0,0,0,0,1,1,0,0,0,0,0,1,1
ev_discharge_enabled,parameter,DE:ev093,Int,0,0,1,1,0,0,0,0,0,1,1,0,0,0
ev_exogenous_enabled,parameter,DE:ev094,Int,0,0,0,0,1,1,1,0,0,0,0,1,1,1
ev_discharge_enabled,parameter,DE:ev094,Int,0,0,1,0,0,0,0,0,0,1,0,0,0,0
ev_exogenous_enabled,parameter,DE:ev095,Int,0,0,0,0,0,1,1,0,0,0,0,0,1,1
ev_discharge_enabled,parameter,DE:ev095,Int,0,0,1,1,0,0,0,0,0,1,1,0,0,0
ev_exogenous_enabled,parameter,DE:ev096,Int,0,0,0,0,0,1,1,0,0,0,0,0,1,1
ev_discharge_enabled,parameter,DE:ev096,Int,0,0,1,0,0,0,0,0,0,1,0,0,0,0
ev_exogenous_enabled,parameter,DE:ev097,Int,0,0,0,1,1,1,1,0,0,0,1,1,1,1
ev_discharge_enabled,parameter,DE:ev097,Int,0,0,1,0,0,0,0,0,0,1,0,0,0,0
ev_exogenous_enabled,parameter,DE:ev098,Int,0,0,0,0,1,0,1,0,0,0,0,1,0,1
ev_discharge_enabled,parameter,DE:ev098,Int,0,0,1,0,0,1,0,0,0,1,0,0,1,0
ev_exogenous_enabled,parameter,DE:ev099,Int,0,0,0,0,0,1,1,0,0,0,0,0,1,1
ev_discharge_enabled,parameter,DE:ev099,Int,0,0,1,0,0,0,0,0,0,1,0,0,0,0
ev_exogenous_enabled,parameter,DE:ev100,Int,0,0,0,0,1,1,1,0,0,0,0,1,1,1
ev_discharge_enabled,parameter,DE:ev100,Int,0,0,1,1,0,0,0,0,0,1,1,0,0,0
ev_share,parameter,DE:ev001,Float32,0.01,0.01,0.01,0.01,0.01,0.01,0.01,0.01,0.01,0.01,0.01,0.01,0.01,0.01
ev_share,parameter,DE:ev002,Float32,0.01,0.01,0.01,0.01,0.01,0.01,0.01,0.01,0.01,0.01,0.01,0.01,0.01,0.01
ev_share,parameter,DE:ev003,Float32,0.01,0.01,0.01,0.01,0.01,0.01,0.01,0.01,0.01,0.01,0.01,0.01,0.01,0.01
ev_share,parameter,DE:ev004,Float32,0.01,0.01,0.01,0.01,0.01,0.01,0.01,0.01,0.01,0.01,0.01,0.01,0.01,0.01
ev_share,parameter,DE:ev005,Float32,0.01,0.01,0.01,0.01,0.01,0.01,0.01,0.01,0.01,0.01,0.01,0.01,0.01,0.01
ev_share,parameter,DE:ev006,Float32,0.01,0.01,0.01,0.01,0.01,0.01,0.01,0.01,0.01,0.01,0.01,0.01,0.01,0.01
ev_share,parameter,DE:ev007,Float32,0.01,0.01,0.01,0.01,0.01,0.01,0.01,0.01,0.01,0.01,0.01,0.01,0.01,0.01
ev_share,parameter,DE:ev008,Float32,0.01,0.01,0.01,0.01,0.01,0.01,0.01,0.01,0.01,0.01,0.01,0.01,0.01,0.01
ev_share,parameter,DE:ev009,Float32,0.01,0.01,0.01,0.01,0.01,0.01,0.01,0.01,0.01,0.01,0.01,0.01,0.01,0.01
ev_share,parameter,DE:ev010,Float32,0.01,0.01,0.01,0.01,0.01,0.01,0.01,0.01,0.01,0.01,0.01,0.01,0.01,0.01
ev_share,parameter,DE:ev011,Float32,0.01,0.01,0.01,0.01,0.01,0.01,0.01,0.01,0.01,0.01,0.01,0.01,0.01,0.01
ev_share,parameter,DE:ev012,Float32,0.01,0.01,0.01,0.01,0.01,0.01,0.01,0.01,0.01,0.01,0.01,0.01,0.01,0.01
ev_share,parameter,DE:ev013,Float32,0.01,0.01,0.01,0.01,0.01,0.01,0.01,0.01,0.01,0.01,0.01,0.01,0.01,0.01
ev_share,parameter,DE:ev014,Float32,0.01,0.01,0.01,0.01,0.01,0.01,0.01,0.01,0.01,0.01,0.01,0.01,0.01,0.01
ev_share,parameter,DE:ev015,Float32,0.01,0.01,0.01,0.01,0.01,0.01,0.01,0.01,0.01,0.01,0.01,0.01,0.01,0.01
ev_share,parameter,DE:ev016,Float32,0.01,0.01,0.01,0.01,0.01,0.01,0.01,0.01,0.01,0.01,0.01,0.01,0.01,0.01
ev_share,parameter,DE:ev017,Float32,0.01,0.01,0.01,0.01,0.01,0.01,0.01,0.01,0.01,0.01,0.01,0.01,0.01,0.01
ev_share,parameter,DE:ev018,Float32,0.01,0.01,0.01,0.01,0.01,0.01,0.01,0.01,0.01,0.01,0.01,0.01,0.01,0.01
ev_share,parameter,DE:ev019,Float32,0.01,0.01,0.01,0.01,0.01,0.01,0.01,0.01,0.01,0.01,0.01,0.01,0.01,0.01
ev_share,parameter,DE:ev020,Float32,0.01,0.01,0.01,0.01,0.01,0.01,0.01,0.01,0.01,0.01,0.01,0.01,0.01,0.01
ev_share,parameter,DE:ev021,Float32,0.01,0.01,0.01,0.01,0.01,0.01,0.01,0.01,0.01,0.01,0.01,0.01,0.01,0.01
ev_share,parameter,DE:ev022,Float32,0.01,0.01,0.01,0.01,0.01,0.01,0.01,0.01,0.01,0.01,0.01,0.01,0.01,0.01
ev_share,parameter,DE:ev023,Float32,0.01,0.01,0.01,0.01,0.01,0.01,0.01,0.01,0.01,0.01,0.01,0.01,0.01,0.01
ev_share,parameter,DE:ev024,Float32,0.01,0.01,0.01,0.01,0.01,0.01,0.01,0.01,0.01,0.01,0.01,0.01,0.01,0.01
ev_share,parameter,DE:ev025,Float32,0.01,0.01,0.01,0.01,0.01,0.01,0.01,0.01,0.01,0.01,0.01,0.01,0.01,0.01
ev_share,parameter,DE:ev026,Float32,0.01,0.01,0.01,0.01,0.01,0.01,0.01,0.01,0.01,0.01,0.01,0.01,0.01,0.01
ev_share,parameter,DE:ev027,Float32,0.01,0.01,0.01,0.01,0.01,0.01,0.01,0.01,0.01,0.01,0.01,0.01,0.01,0.01
ev_share,parameter,DE:ev028,Float32,0.01,0.01,0.01,0.01,0.01,0.01,0.01,0.01,0.01,0.01,0.01,0.01,0.01,0.01
ev_share,parameter,DE:ev029,Float32,0.01,0.01,0.01,0.01,0.01,0.01,0.01,0.01,0.01,0.01,0.01,0.01,0.01,0.01
ev_share,parameter,DE:ev030,Float32,0.01,0.01,0.01,0.01,0.01,0.01,0.01,0.01,0.01,0.01,0.01,0.01,0.01,0.01
ev_share,parameter,DE:ev031,Float32,0.01,0.01,0.01,0.01,0.01,0.01,0.01,0.01,0.01,0.01,0.01,0.01,0.01,0.01
ev_share,parameter,DE:ev032,Float32,0.01,0.01,0.01,0.01,0.01,0.01,0.01,0.01,0.01,0.01,0.01,0.01,0.01,0.01
ev_share,parameter,DE:ev033,Float32,0.01,0.01,0.01,0.01,0.01,0.01,0.01,0.01,0.01,0.01,0.01,0.01,0.01,0.01
ev_share,parameter,DE:ev034,Float32,0.01,0.01,0.01,0.01,0.01,0.01,0.01,0.01,0.01,0.01,0.01,0.01,0.01,0.01
ev_share,parameter,DE:ev035,Float32,0.01,0.01,0.01,0.01,0.01,0.01,0.01,0.01,0.01,0.01,0.01,0.01,0.01,0.01
ev_share,parameter,DE:ev036,Float32,0.01,0.01,0.01,0.01,0.01,0.01,0.01,0.01,0.01,0.01,0.01,0.01,0.01,0.01
ev_share,parameter,DE:ev037,Float32,0.01,0.01,0.01,0.01,0.01,0.01,0.01,0.01,0.01,0.01,0.01,0.01,0.01,0.01
ev_share,parameter,DE:ev038,Float32,0.01,0.01,0.01,0.01,0.01,0.01,0.01,0.01,0.01,0.01,0.01,0.01,0.01,0.01
ev_share,parameter,DE:ev039,Float32,0.01,0.01,0.01,0.01,0.01,0.01,0.01,0.01,0.01,0.01,0.01,0.01,0.01,0.01
ev_share,parameter,DE:ev040,Float32,0.01,0.01,0.01,0.01,0.01,0.01,0.01,0.01,0.01,0.01,0.01,0.01,0.01,0.01
ev_share,parameter,DE:ev041,Float32,0.01,0.01,0.01,0.01,0.01,0.01,0.01,0.01,0.01,0.01,0.01,0.01,0.01,0.01
ev_share,parameter,DE:ev042,Float32,0.01,0.01,0.01,0.01,0.01,0.01,0.01,0.01,0.01,0.01,0.01,0.01,0.01,0.01
ev_share,parameter,DE:ev043,Float32,0.01,0.01,0.01,0.01,0.01,0.01,0.01,0.01,0.01,0.01,0.01,0.01,0.01,0.01
ev_share,parameter,DE:ev044,Float32,0.01,0.01,0.01,0.01,0.01,0.01,0.01,0.01,0.01,0.01,0.01,0.01,0.01,0.01
ev_share,parameter,DE:ev045,Float32,0.01,0.01,0.01,0.01,0.01,0.01,0.01,0.01,0.01,0.01,0.01,0.01,0.01,0.01
ev_share,parameter,DE:ev046,Float32,0.01,0.01,0.01,0.01,0.01,0.01,0.01,0.01,0.01,0.01,0.01,0.01,0.01,0.01
ev_share,parameter,DE:ev047,Float32,0.01,0.01,0.01,0.01,0.01,0.01,0.01,0.01,0.01,0.01,0.01,0.01,0.01,0.01
ev_share,parameter,DE:ev048,Float32,0.01,0.01,0.01,0.01,0.01,0.01,0.01,0.01,0.01,0.01,0.01,0.01,0.01,0.01
ev_share,parameter,DE:ev049,Float32,0.01,0.01,0.01,0.01,0.01,0.01,0.01,0.01,0.01,0.01,0.01,0.01,0.01,0.01
ev_share,parameter,DE:ev050,Float32,0.01,0.01,0.01,0.01,0.01,0.01,0.01,0.01,0.01,0.01,0.01,0.01,0.01,0.01
ev_share,parameter,DE:ev051,Float32,0.01,0.01,0.01,0.01,0.01,0.01,0.01,0.01,0.01,0.01,0.01,0.01,0.01,0.01
ev_share,parameter,DE:ev052,Float32,0.01,0.01,0.01,0.01,0.01,0.01,0.01,0.01,0.01,0.01,0.01,0.01,0.01,0.01
ev_share,parameter,DE:ev053,Float32,0.01,0.01,0.01,0.01,0.01,0.01,0.01,0.01,0.01,0.01,0.01,0.01,0.01,0.01
ev_share,parameter,DE:ev054,Float32,0.01,0.01,0.01,0.01,0.01,0.01,0.01,0.01,0.01,0.01,0.01,0.01,0.01,0.01
ev_share,parameter,DE:ev055,Float32,0.01,0.01,0.01,0.01,0.01,0.01,0.01,0.01,0.01,0.01,0.01,0.01,0.01,0.01
ev_share,parameter,DE:ev056,Float32,0.01,0.01,0.01,0.01,0.01,0.01,0.01,0.01,0.01,0.01,0.01,0.01,0.01,0.01
ev_share,parameter,DE:ev057,Float32,0.01,0.01,0.01,0.01,0.01,0.01,0.01,0.01,0.01,0.01,0.01,0.01,0.01,0.01
ev_share,parameter,DE:ev058,Float32,0.01,0.01,0.01,0.01,0.01,0.01,0.01,0.01,0.01,0.01,0.01,0.01,0.01,0.01
ev_share,parameter,DE:ev059,Float32,0.01,0.01,0.01,0.01,0.01,0.01,0.01,0.01,0.01,0.01,0.01,0.01,0.01,0.01
ev_share,parameter,DE:ev060,Float32,0.01,0.01,0.01,0.01,0.01,0.01,0.01,0.01,0.01,0.01,0.01,0.01,0.01,0.01
ev_share,parameter,DE:ev061,Float32,0.01,0.01,0.01,0.01,0.01,0.01,0.01,0.01,0.01,0.01,0.01,0.01,0.01,0.01
ev_share,parameter,DE:ev062,Float32,0.01,0.01,0.01,0.01,0.01,0.01,0.01,0.01,0.01,0.01,0.01,0.01,0.01,0.01
ev_share,parameter,DE:ev063,Float32,0.01,0.01,0.01,0.01,0.01,0.01,0.01,0.01,0.01,0.01,0.01,0.01,0.01,0.01
ev_share,parameter,DE:ev064,Float32,0.01,0.01,0.01,0.01,0.01,0.01,0.01,0.01,0.01,0.01,0.01,0.01,0.01,0.01
ev_share,parameter,DE:ev065,Float32,0.01,0.01,0.01,0.01,0.01,0.01,0.01,0.01,0.01,0.01,0.01,0.01,0.01,0.01
ev_share,parameter,DE:ev066,Float32,0.01,0.01,0.01,0.01,0.01,0.01,0.01,0.01,0.01,0.01,0.01,0.01,0.01,0.01
ev_share,parameter,DE:ev067,Float32,0.01,0.01,0.01,0.01,0.01,0.01,0.01,0.01,0.01,0.01,0.01,0.01,0.01,0.01
ev_share,parameter,DE:ev068,Float32,0.01,0.01,0.01,0.01,0.01,0.01,0.01,0.01,0.01,0.01,0.01,0.01,0.01,0.01
ev_share,parameter,DE:ev069,Float32,0.01,0.01,0.01,0.01,0.01,0.01,0.01,0.01,0.01,0.01,0.01,0.01,0.01,0.01
ev_share,parameter,DE:ev070,Float32,0.01,0.01,0.01,0.01,0.01,0.01,0.01,0.01,0.01,0.01,0.01,0.01,0.01,0.01
ev_share,parameter,DE:ev071,Float32,0.01,0.01,0.01,0.01,0.01,0.01,0.01,0.01,0.01,0.01,0.01,0.01,0.01,0.01
ev_share,parameter,DE:ev072,Float32,0.01,0.01,0.01,0.01,0.01,0.01,0.01,0.01,0.01,0.01,0.01,0.01,0.01,0.01
ev_share,parameter,DE:ev073,Float32,0.01,0.01,0.01,0.01,0.01,0.01,0.01,0.01,0.01,0.01,0.01,0.01,0.01,0.01
ev_share,parameter,DE:ev074,Float32,0.01,0.01,0.01,0.01,0.01,0.01,0.01,0.01,0.01,0.01,0.01,0.01,0.01,0.01
ev_share,parameter,DE:ev075,Float32,0.01,0.01,0.01,0.01,0.01,0.01,0.01,0.01,0.01,0.01,0.01,0.01,0.01,0.01
ev_share,parameter,DE:ev076,Float32,0.01,0.01,0.01,0.01,0.01,0.01,0.01,0.01,0.01,0.01,0.01,0.01,0.01,0.01
ev_share,parameter,DE:ev077,Float32,0.01,0.01,0.01,0.01,0.01,0.01,0.01,0.01,0.01,0.01,0.01,0.01,0.01,0.01
ev_share,parameter,DE:ev078,Float32,0.01,0.01,0.01,0.01,0.01,0.01,0.01,0.01,0.01,0.01,0.01,0.01,0.01,0.01
ev_share,parameter,DE:ev079,Float32,0.01,0.01,0.01,0.01,0.01,0.01,0.01,0.01,0.01,0.01,0.01,0.01,0.01,0.01
ev_share,parameter,DE:ev080,Float32,0.01,0.01,0.01,0.01,0.01,0.01,0.01,0.01,0.01,0.01,0.01,0.01,0.01,0.01
ev_share,parameter,DE:ev081,Float32,0.01,0.01,0.01,0.01,0.01,0.01,0.01,0.01,0.01,0.01,0.01,0.01,0.01,0.01
ev_share,parameter,DE:ev082,Float32,0.01,0.01,0.01,0.01,0.01,0.01,0.01,0.01,0.01,0.01,0.01,0.01,0.01,0.01
ev_share,parameter,DE:ev083,Float32,0.01,0.01,0.01,0.01,0.01,0.01,0.01,0.01,0.01,0.01,0.01,0.01,0.01,0.01
ev_share,parameter,DE:ev084,Float32,0.01,0.01,0.01,0.01,0.01,0.01,0.01,0.01,0.01,0.01,0.01,0.01,0.01,0.01
ev_share,parameter,DE:ev085,Float32,0.01,0.01,0.01,0.01,0.01,0.01,0.01,0.01,0.01,0.01,0.01,0.01,0.01,0.01
ev_share,parameter,DE:ev086,Float32,0.01,0.01,0.01,0.01,0.01,0.01,0.01,0.01,0.01,0.01,0.01,0.01,0.01,0.01
ev_share,parameter,DE:ev087,Float32,0.01,0.01,0.01,0.01,0.01,0.01,0.01,0.01,0.01,0.01,0.01,0.01,0.01,0.01
ev_share,parameter,DE:ev088,Float32,0.01,0.01,0.01,0.01,0.01,0.01,0.01,0.01,0.01,0.01,0.01,0.01,0.01,0.01
ev_share,parameter,DE:ev089,Float32,0.01,0.01,0.01,0.01,0.01,0.01,0.01,0.01,0.01,0.01,0.01,0.01,0.01,0.01
ev_share,parameter,DE:ev090,Float32,0.01,0.01,0.01,0.01,0.01,0.01,0.01,0.01,0.01,0.01,0.01,0.01,0.01,0.01
ev_share,parameter,DE:ev091,Float32,0.01,0.01,0.01,0.01,0.01,0.01,0.01,0.01,0.01,0.01,0.01,0.01,0.01,0.01
ev_share,parameter,DE:ev092,Float32,0.01,0.01,0.01,0.01,0.01,0.01,0.01,0.01,0.01,0.01,0.01,0.01,0.01,0.01
ev_share,parameter,DE:ev093,Float32,0.01,0.01,0.01,0.01,0.01,0.01,0.01,0.01,0.01,0.01,0.01,0.01,0.01,0.01
ev_share,parameter,DE:ev094,Float32,0.01,0.01,0.01,0.01,0.01,0.01,0.01,0.01,0.01,0.01,0.01,0.01,0.01,0.01
ev_share,parameter,DE:ev095,Float32,0.01,0.01,0.01,0.01,0.01,0.01,0.01,0.01,0.01,0.01,0.01,0.01,0.01,0.01
ev_share,parameter,DE:ev096,Float32,0.01,0.01,0.01,0.01,0.01,0.01,0.01,0.01,0.01,0.01,0.01,0.01,0.01,0.01
ev_share,parameter,DE:ev097,Float32,0.01,0.01,0.01,0.01,0.01,0.01,0.01,0.01,0.01,0.01,0.01,0.01,0.01,0.01
ev_share,parameter,DE:ev098,Float32,0.01,0.01,0.01,0.01,0.01,0.01,0.01,0.01,0.01,0.01,0.01,0.01,0.01,0.01
ev_share,parameter,DE:ev099,Float32,0.01,0.01,0.01,0.01,0.01,0.01,0.01,0.01,0.01,0.01,0.01,0.01,0.01,0.01
ev_share,parameter,DE:ev100,Float32,0.01,0.01,0.01,0.01,0.01,0.01,0.01,0.01,0.01,0.01,0.01,0.01,0.01,0.01
