n,node_co2_cap,node_min_res_share,node_interest,node_co2_price,node_ev_quantity,node_ev_charge_cap_share,node_ev_discharge_cap_share,node_hydrogen_yr_demand,node_hydrogen_hr_fraction
DE,-1,0,0.04,0,0,0,0,0,0
AT,-1,0,0.04,0,0,0,0,0,0
BE,-1,0,0.04,0,0,0,0,0,0
CH,-1,0,0.04,0,0,0,0,0,0
CZ,-1,0,0.04,0,0,0,0,0,0
DK,-1,0,0.04,0,0,0,0,0,0
FR,-1,0,0.04,0,0,0,0,0,0
IT,-1,0,0.04,0,0,0,0,0,0
LU,-1,0,0.04,0,0,0,0,0,0
NL,-1,0,0.04,0,0,0,0,0,0
PL,-1,0,0.04,0,0,0,0,0,0
