purpose,days,time,parttime,freetime,fulltime
workplace,saturday,3,0.0001667,0,0.0001667
shopping,saturday,3,0,0,0
errands,saturday,3,7.57E-05,7.77E-05,7.57E-05
escort,saturday,3,0.0001459,0.0001497,0.0001459
leisure,saturday,3,0.0005322,0.0005462,0.0005322
home,saturday,3,0.002159,0.0022159,0.002159
workplace,saturday,3.5,0.0001667,0,0.0001667
shopping,saturday,3.5,0,0,0
errands,saturday,3.5,7.57E-05,7.77E-05,7.57E-05
escort,saturday,3.5,0.0001459,0.0001497,0.0001459
leisure,saturday,3.5,0.0005322,0.0005462,0.0005322
home,saturday,3.5,0.002159,0.0022159,0.002159
workplace,saturday,4,0.0001667,0,0.0001667
shopping,saturday,4,0,0,0
errands,saturday,4,7.57E-05,7.77E-05,7.57E-05
escort,saturday,4,0.0001459,0.0001497,0.0001459
leisure,saturday,4,0.0005322,0.0005462,0.0005322
home,saturday,4,0.002159,0.0022159,0.002159
workplace,saturday,4.5,0.0001667,0,0.0001667
shopping,saturday,4.5,0,0,0
errands,saturday,4.5,7.57E-05,7.77E-05,7.57E-05
escort,saturday,4.5,0.0001459,0.0001497,0.0001459
leisure,saturday,4.5,0.0005322,0.0005462,0.0005322
home,saturday,4.5,0.002159,0.0022159,0.002159
workplace,saturday,5,0.0001667,0,0.0001667
shopping,saturday,5,0,0,0
errands,saturday,5,7.57E-05,7.77E-05,7.57E-05
escort,saturday,5,0.0001459,0.0001497,0.0001459
leisure,saturday,5,0.0005322,0.0005462,0.0005322
home,saturday,5,0.002159,0.0022159,0.002159
workplace,saturday,5.5,0.0001667,0,0.0001667
shopping,saturday,5.5,0,0,0
errands,saturday,5.5,7.57E-05,7.77E-05,7.57E-05
escort,saturday,5.5,0.0001459,0.0001497,0.0001459
leisure,saturday,5.5,0.0005322,0.0005462,0.0005322
home,saturday,5.5,0.002159,0.0022159,0.002159
workplace,saturday,6,0.0015559,0,0.0015559
shopping,saturday,6,0.0019108,0.0019611,0.0019108
errands,saturday,6,0.00053,0.0005439,0.00053
escort,saturday,6,0.0002553,0.0002621,0.0002553
leisure,saturday,6,0.0012418,0.0012745,0.0012418
home,saturday,6,0.0012594,0.0012926,0.0012594
workplace,saturday,6.5,0.0015559,0,0.0015559
shopping,saturday,6.5,0.0019108,0.0019611,0.0019108
errands,saturday,6.5,0.00053,0.0005439,0.00053
escort,saturday,6.5,0.0002553,0.0002621,0.0002553
leisure,saturday,6.5,0.0012418,0.0012745,0.0012418
home,saturday,6.5,0.0012594,0.0012926,0.0012594
workplace,saturday,7,0.0015559,0,0.0015559
shopping,saturday,7,0.0019108,0.0019611,0.0019108
errands,saturday,7,0.00053,0.0005439,0.00053
escort,saturday,7,0.0002553,0.0002621,0.0002553
leisure,saturday,7,0.0012418,0.0012745,0.0012418
home,saturday,7,0.0012594,0.0012926,0.0012594
workplace,saturday,7.5,0.0015559,0,0.0015559
shopping,saturday,7.5,0.0019108,0.0019611,0.0019108
errands,saturday,7.5,0.00053,0.0005439,0.00053
escort,saturday,7.5,0.0002553,0.0002621,0.0002553
leisure,saturday,7.5,0.0012418,0.0012745,0.0012418
home,saturday,7.5,0.0012594,0.0012926,0.0012594
workplace,saturday,8,0.0015559,0,0.0015559
shopping,saturday,8,0.0019108,0.0019611,0.0019108
errands,saturday,8,0.00053,0.0005439,0.00053
escort,saturday,8,0.0002553,0.0002621,0.0002553
leisure,saturday,8,0.0012418,0.0012745,0.0012418
home,saturday,8,0.0012594,0.0012926,0.0012594
workplace,saturday,8.5,0.0015559,0,0.0015559
shopping,saturday,8.5,0.0019108,0.0019611,0.0019108
errands,saturday,8.5,0.00053,0.0005439,0.00053
escort,saturday,8.5,0.0002553,0.0002621,0.0002553
leisure,saturday,8.5,0.0012418,0.0012745,0.0012418
home,saturday,8.5,0.0012594,0.0012926,0.0012594
workplace,saturday,9,0.0013614,0,0.0013614
shopping,saturday,9,0.0119422,0.0122569,0.0119422
errands,saturday,9,0.0047698,0.0048955,0.0047698
escort,saturday,9,0.0016596,0.0017034,0.0016596
leisure,saturday,9,0.00683,0.00701,0.00683
home,saturday,9,0.0075565,0.0077556,0.0075565
workplace,saturday,9.5,0.0013614,0,0.0013614
shopping,saturday,9.5,0.0119422,0.0122569,0.0119422
errands,saturday,9.5,0.0047698,0.0048955,0.0047698
escort,saturday,9.5,0.0016596,0.0017034,0.0016596
leisure,saturday,9.5,0.00683,0.00701,0.00683
home,saturday,9.5,0.0075565,0.0077556,0.0075565
workplace,saturday,10,0.0013614,0,0.0013614
shopping,saturday,10,0.0119422,0.0122569,0.0119422
errands,saturday,10,0.0047698,0.0048955,0.0047698
escort,saturday,10,0.0016596,0.0017034,0.0016596
leisure,saturday,10,0.00683,0.00701,0.00683
home,saturday,10,0.0075565,0.0077556,0.0075565
workplace,saturday,10.5,0.0013614,0,0.0013614
shopping,saturday,10.5,0.0119422,0.0122569,0.0119422
errands,saturday,10.5,0.0047698,0.0048955,0.0047698
escort,saturday,10.5,0.0016596,0.0017034,0.0016596
leisure,saturday,10.5,0.00683,0.00701,0.00683
home,saturday,10.5,0.0075565,0.0077556,0.0075565
workplace,saturday,11,0.0007347,0,0.0007347
shopping,saturday,11,0.011783,0.0120935,0.011783
errands,saturday,11,0.0058298,0.0059834,0.0058298
escort,saturday,11,0.0023831,0.0024459,0.0023831
leisure,saturday,11,0.0086927,0.0089218,0.0086927
home,saturday,11,0.0151131,0.0155113,0.0151131
workplace,saturday,11.5,0.0007347,0,0.0007347
shopping,saturday,11.5,0.011783,0.0120935,0.011783
errands,saturday,11.5,0.0058298,0.0059834,0.0058298
escort,saturday,11.5,0.0023831,0.0024459,0.0023831
leisure,saturday,11.5,0.0086927,0.0089218,0.0086927
home,saturday,11.5,0.0151131,0.0155113,0.0151131
workplace,saturday,12,0.0007347,0,0.0007347
shopping,saturday,12,0.011783,0.0120935,0.011783
errands,saturday,12,0.0058298,0.0059834,0.0058298
escort,saturday,12,0.0023831,0.0024459,0.0023831
leisure,saturday,12,0.0086927,0.0089218,0.0086927
home,saturday,12,0.0151131,0.0155113,0.0151131
workplace,saturday,12.5,0.0007347,0,0.0007347
shopping,saturday,12.5,0.011783,0.0120935,0.011783
errands,saturday,12.5,0.0058298,0.0059834,0.0058298
escort,saturday,12.5,0.0023831,0.0024459,0.0023831
leisure,saturday,12.5,0.0086927,0.0089218,0.0086927
home,saturday,12.5,0.0151131,0.0155113,0.0151131
workplace,saturday,13,0.0007347,0,0.0007347
shopping,saturday,13,0.011783,0.0120935,0.011783
errands,saturday,13,0.0058298,0.0059834,0.0058298
escort,saturday,13,0.0023831,0.0024459,0.0023831
leisure,saturday,13,0.0086927,0.0089218,0.0086927
home,saturday,13,0.0151131,0.0155113,0.0151131
workplace,saturday,13.5,0.0007347,0,0.0007347
shopping,saturday,13.5,0.011783,0.0120935,0.011783
errands,saturday,13.5,0.0058298,0.0059834,0.0058298
escort,saturday,13.5,0.0023831,0.0024459,0.0023831
leisure,saturday,13.5,0.0086927,0.0089218,0.0086927
home,saturday,13.5,0.0151131,0.0155113,0.0151131
workplace,saturday,14,0.0003458,0,0.0003458
shopping,saturday,14,0.0057323,0.0058833,0.0057323
errands,saturday,14,0.0042398,0.0043515,0.0042398
escort,saturday,14,0.0019575,0.0020091,0.0019575
leisure,saturday,14,0.0115903,0.0118957,0.0115903
home,saturday,14,0.0125942,0.0129261,0.0125942
workplace,saturday,14.5,0.0003458,0,0.0003458
shopping,saturday,14.5,0.0057323,0.0058833,0.0057323
errands,saturday,14.5,0.0042398,0.0043515,0.0042398
escort,saturday,14.5,0.0019575,0.0020091,0.0019575
leisure,saturday,14.5,0.0115903,0.0118957,0.0115903
home,saturday,14.5,0.0125942,0.0129261,0.0125942
workplace,saturday,15,0.0003458,0,0.0003458
shopping,saturday,15,0.0057323,0.0058833,0.0057323
errands,saturday,15,0.0042398,0.0043515,0.0042398
escort,saturday,15,0.0019575,0.0020091,0.0019575
leisure,saturday,15,0.0115903,0.0118957,0.0115903
home,saturday,15,0.0125942,0.0129261,0.0125942
workplace,saturday,15.5,0.0003458,0,0.0003458
shopping,saturday,15.5,0.0057323,0.0058833,0.0057323
errands,saturday,15.5,0.0042398,0.0043515,0.0042398
escort,saturday,15.5,0.0019575,0.0020091,0.0019575
leisure,saturday,15.5,0.0115903,0.0118957,0.0115903
home,saturday,15.5,0.0125942,0.0129261,0.0125942
workplace,saturday,16,0.0003458,0,0.0003458
shopping,saturday,16,0.0057323,0.0058833,0.0057323
errands,saturday,16,0.0042398,0.0043515,0.0042398
escort,saturday,16,0.0019575,0.0020091,0.0019575
leisure,saturday,16,0.0115903,0.0118957,0.0115903
home,saturday,16,0.0125942,0.0129261,0.0125942
workplace,saturday,16.5,0.0003458,0,0.0003458
shopping,saturday,16.5,0.0057323,0.0058833,0.0057323
errands,saturday,16.5,0.0042398,0.0043515,0.0042398
escort,saturday,16.5,0.0019575,0.0020091,0.0019575
leisure,saturday,16.5,0.0115903,0.0118957,0.0115903
home,saturday,16.5,0.0125942,0.0129261,0.0125942
workplace,saturday,17,0.0002161,0,0.0002161
shopping,saturday,17,0.0038215,0.0039222,0.0038215
errands,saturday,17,0.0028266,0.002901,0.0028266
escort,saturday,17,0.0017873,0.0018344,0.0017873
leisure,saturday,17,0.0099345,0.0101963,0.0099345
home,saturday,17,0.0157428,0.0161576,0.0157428
workplace,saturday,17.5,0.0002161,0,0.0002161
shopping,saturday,17.5,0.0038215,0.0039222,0.0038215
errands,saturday,17.5,0.0028266,0.002901,0.0028266
escort,saturday,17.5,0.0017873,0.0018344,0.0017873
leisure,saturday,17.5,0.0099345,0.0101963,0.0099345
home,saturday,17.5,0.0157428,0.0161576,0.0157428
workplace,saturday,18,0.0002161,0,0.0002161
shopping,saturday,18,0.0038215,0.0039222,0.0038215
errands,saturday,18,0.0028266,0.002901,0.0028266
escort,saturday,18,0.0017873,0.0018344,0.0017873
leisure,saturday,18,0.0099345,0.0101963,0.0099345
home,saturday,18,0.0157428,0.0161576,0.0157428
workplace,saturday,18.5,0.0002161,0,0.0002161
shopping,saturday,18.5,0.0038215,0.0039222,0.0038215
errands,saturday,18.5,0.0028266,0.002901,0.0028266
escort,saturday,18.5,0.0017873,0.0018344,0.0017873
leisure,saturday,18.5,0.0099345,0.0101963,0.0099345
home,saturday,18.5,0.0157428,0.0161576,0.0157428
workplace,saturday,19,0.0002161,0,0.0002161
shopping,saturday,19,0.0038215,0.0039222,0.0038215
errands,saturday,19,0.0028266,0.002901,0.0028266
escort,saturday,19,0.0017873,0.0018344,0.0017873
leisure,saturday,19,0.0099345,0.0101963,0.0099345
home,saturday,19,0.0157428,0.0161576,0.0157428
workplace,saturday,19.5,0.0002161,0,0.0002161
shopping,saturday,19.5,0.0038215,0.0039222,0.0038215
errands,saturday,19.5,0.0028266,0.002901,0.0028266
escort,saturday,19.5,0.0017873,0.0018344,0.0017873
leisure,saturday,19.5,0.0099345,0.0101963,0.0099345
home,saturday,19.5,0.0157428,0.0161576,0.0157428
workplace,saturday,20,0.0001297,0,0.0001297
shopping,saturday,20,0.0006369,0.0006537,0.0006369
errands,saturday,20,0.0008833,0.0009066,0.0008833
escort,saturday,20,0.0006809,0.0006988,0.0006809
leisure,saturday,20,0.0041394,0.0042485,0.0041394
home,saturday,20,0.0081862,0.0084019,0.0081862
workplace,saturday,20.5,0.0001297,0,0.0001297
shopping,saturday,20.5,0.0006369,0.0006537,0.0006369
errands,saturday,20.5,0.0008833,0.0009066,0.0008833
escort,saturday,20.5,0.0006809,0.0006988,0.0006809
leisure,saturday,20.5,0.0041394,0.0042485,0.0041394
home,saturday,20.5,0.0081862,0.0084019,0.0081862
workplace,saturday,21,0.0001297,0,0.0001297
shopping,saturday,21,0.0006369,0.0006537,0.0006369
errands,saturday,21,0.0008833,0.0009066,0.0008833
escort,saturday,21,0.0006809,0.0006988,0.0006809
leisure,saturday,21,0.0041394,0.0042485,0.0041394
home,saturday,21,0.0081862,0.0084019,0.0081862
workplace,saturday,21.5,0.0001297,0,0.0001297
shopping,saturday,21.5,0.0006369,0.0006537,0.0006369
errands,saturday,21.5,0.0008833,0.0009066,0.0008833
escort,saturday,21.5,0.0006809,0.0006988,0.0006809
leisure,saturday,21.5,0.0041394,0.0042485,0.0041394
home,saturday,21.5,0.0081862,0.0084019,0.0081862
workplace,saturday,22,0.0001297,0,0.0001297
shopping,saturday,22,0.0006369,0.0006537,0.0006369
errands,saturday,22,0.0008833,0.0009066,0.0008833
escort,saturday,22,0.0006809,0.0006988,0.0006809
leisure,saturday,22,0.0041394,0.0042485,0.0041394
home,saturday,22,0.0081862,0.0084019,0.0081862
workplace,saturday,22.5,0.0001297,0,0.0001297
shopping,saturday,22.5,0.0006369,0.0006537,0.0006369
errands,saturday,22.5,0.0008833,0.0009066,0.0008833
escort,saturday,22.5,0.0006809,0.0006988,0.0006809
leisure,saturday,22.5,0.0041394,0.0042485,0.0041394
home,saturday,22.5,0.0081862,0.0084019,0.0081862
workplace,saturday,23,0.0001667,0,0.0001667
shopping,saturday,23,0,0,0
errands,saturday,23,7.57E-05,7.77E-05,7.57E-05
escort,saturday,23,0.0001459,0.0001497,0.0001459
leisure,saturday,23,0.0005322,0.0005462,0.0005322
home,saturday,23,0.002159,0.0022159,0.002159
workplace,saturday,23.5,0.0001667,0,0.0001667
shopping,saturday,23.5,0,0,0
errands,saturday,23.5,7.57E-05,7.77E-05,7.57E-05
escort,saturday,23.5,0.0001459,0.0001497,0.0001459
leisure,saturday,23.5,0.0005322,0.0005462,0.0005322
home,saturday,23.5,0.002159,0.0022159,0.002159
workplace,saturday,0,0.0001667,0,0.0001667
shopping,saturday,0,0,0,0
errands,saturday,0,7.57E-05,7.77E-05,7.57E-05
escort,saturday,0,0.0001459,0.0001497,0.0001459
leisure,saturday,0,0.0005322,0.0005462,0.0005322
home,saturday,0,0.002159,0.0022159,0.002159
workplace,saturday,0.5,0.0001667,0,0.0001667
shopping,saturday,0.5,0,0,0
errands,saturday,0.5,7.57E-05,7.77E-05,7.57E-05
escort,saturday,0.5,0.0001459,0.0001497,0.0001459
leisure,saturday,0.5,0.0005322,0.0005462,0.0005322
home,saturday,0.5,0.002159,0.0022159,0.002159
workplace,saturday,1,0.0001667,0,0.0001667
shopping,saturday,1,0,0,0
errands,saturday,1,7.57E-05,7.77E-05,7.57E-05
escort,saturday,1,0.0001459,0.0001497,0.0001459
leisure,saturday,1,0.0005322,0.0005462,0.0005322
home,saturday,1,0.002159,0.0022159,0.002159
workplace,saturday,1.5,0.0001667,0,0.0001667
shopping,saturday,1.5,0,0,0
errands,saturday,1.5,7.57E-05,7.77E-05,7.57E-05
escort,saturday,1.5,0.0001459,0.0001497,0.0001459
leisure,saturday,1.5,0.0005322,0.0005462,0.0005322
home,saturday,1.5,0.002159,0.0022159,0.002159
workplace,saturday,2,0.0001667,0,0.0001667
shopping,saturday,2,0,0,0
errands,saturday,2,7.57E-05,7.77E-05,7.57E-05
escort,saturday,2,0.0001459,0.0001497,0.0001459
leisure,saturday,2,0.0005322,0.0005462,0.0005322
home,saturday,2,0.002159,0.0022159,0.002159
workplace,saturday,2.5,0.0001667,0,0.0001667
shopping,saturday,2.5,0,0,0
errands,saturday,2.5,7.57E-05,7.77E-05,7.57E-05
escort,saturday,2.5,0.0001459,0.0001497,0.0001459
leisure,saturday,2.5,0.0005322,0.0005462,0.0005322
home,saturday,2.5,0.002159,0.0022159,0.002159
workplace,sunday,3,0,0,0
shopping,sunday,3,0,0,0
errands,sunday,3,6.97E-05,6.97E-05,6.97E-05
escort,sunday,3,7.09E-05,7.09E-05,7.09E-05
leisure,sunday,3,0.0002932,0.0002932,0.0002932
home,sunday,3,0.0014662,0.0014662,0.0014662
workplace,sunday,3.5,0,0,0
shopping,sunday,3.5,0,0,0
errands,sunday,3.5,6.97E-05,6.97E-05,6.97E-05
escort,sunday,3.5,7.09E-05,7.09E-05,7.09E-05
leisure,sunday,3.5,0.0002932,0.0002932,0.0002932
home,sunday,3.5,0.0014662,0.0014662,0.0014662
workplace,sunday,4,0,0,0
shopping,sunday,4,0,0,0
errands,sunday,4,6.97E-05,6.97E-05,6.97E-05
escort,sunday,4,7.09E-05,7.09E-05,7.09E-05
leisure,sunday,4,0.0002932,0.0002932,0.0002932
home,sunday,4,0.0014662,0.0014662,0.0014662
workplace,sunday,4.5,0,0,0
shopping,sunday,4.5,0,0,0
errands,sunday,4.5,6.97E-05,6.97E-05,6.97E-05
escort,sunday,4.5,7.09E-05,7.09E-05,7.09E-05
leisure,sunday,4.5,0.0002932,0.0002932,0.0002932
home,sunday,4.5,0.0014662,0.0014662,0.0014662
workplace,sunday,5,0,0,0
shopping,sunday,5,0,0,0
errands,sunday,5,6.97E-05,6.97E-05,6.97E-05
escort,sunday,5,7.09E-05,7.09E-05,7.09E-05
leisure,sunday,5,0.0002932,0.0002932,0.0002932
home,sunday,5,0.0014662,0.0014662,0.0014662
workplace,sunday,5.5,0,0,0
shopping,sunday,5.5,0,0,0
errands,sunday,5.5,6.97E-05,6.97E-05,6.97E-05
escort,sunday,5.5,7.09E-05,7.09E-05,7.09E-05
leisure,sunday,5.5,0.0002932,0.0002932,0.0002932
home,sunday,5.5,0.0014662,0.0014662,0.0014662
workplace,sunday,6,0,0,0
shopping,sunday,6,0.0005562,0.0005562,0.0005562
errands,sunday,6,0.0003251,0.0003251,0.0003251
escort,sunday,6,0.0001654,0.0001654,0.0001654
leisure,sunday,6,0.0013681,0.0013681,0.0013681
home,sunday,6,0.0006842,0.0006842,0.0006842
workplace,sunday,6.5,0,0,0
shopping,sunday,6.5,0.0005562,0.0005562,0.0005562
errands,sunday,6.5,0.0003251,0.0003251,0.0003251
escort,sunday,6.5,0.0001654,0.0001654,0.0001654
leisure,sunday,6.5,0.0013681,0.0013681,0.0013681
home,sunday,6.5,0.0006842,0.0006842,0.0006842
workplace,sunday,7,0,0,0
shopping,sunday,7,0.0005562,0.0005562,0.0005562
errands,sunday,7,0.0003251,0.0003251,0.0003251
escort,sunday,7,0.0001654,0.0001654,0.0001654
leisure,sunday,7,0.0013681,0.0013681,0.0013681
home,sunday,7,0.0006842,0.0006842,0.0006842
workplace,sunday,7.5,0,0,0
shopping,sunday,7.5,0.0005562,0.0005562,0.0005562
errands,sunday,7.5,0.0003251,0.0003251,0.0003251
escort,sunday,7.5,0.0001654,0.0001654,0.0001654
leisure,sunday,7.5,0.0013681,0.0013681,0.0013681
home,sunday,7.5,0.0006842,0.0006842,0.0006842
workplace,sunday,8,0,0,0
shopping,sunday,8,0.0005562,0.0005562,0.0005562
errands,sunday,8,0.0003251,0.0003251,0.0003251
escort,sunday,8,0.0001654,0.0001654,0.0001654
leisure,sunday,8,0.0013681,0.0013681,0.0013681
home,sunday,8,0.0006842,0.0006842,0.0006842
workplace,sunday,8.5,0,0,0
shopping,sunday,8.5,0.0005562,0.0005562,0.0005562
errands,sunday,8.5,0.0003251,0.0003251,0.0003251
escort,sunday,8.5,0.0001654,0.0001654,0.0001654
leisure,sunday,8.5,0.0013681,0.0013681,0.0013681
home,sunday,8.5,0.0006842,0.0006842,0.0006842
workplace,sunday,9,0,0,0
shopping,sunday,9,0.003838,0.003838,0.003838
errands,sunday,9,0.0036571,0.0036571,0.0036571
escort,sunday,9,0.0014882,0.0014882,0.0014882
leisure,sunday,9,0.0123125,0.0123125,0.0123125
home,sunday,9,0.0051317,0.0051317,0.0051317
workplace,sunday,9.5,0,0,0
shopping,sunday,9.5,0.003838,0.003838,0.003838
errands,sunday,9.5,0.0036571,0.0036571,0.0036571
escort,sunday,9.5,0.0014882,0.0014882,0.0014882
leisure,sunday,9.5,0.0123125,0.0123125,0.0123125
home,sunday,9.5,0.0051317,0.0051317,0.0051317
workplace,sunday,10,0,0,0
shopping,sunday,10,0.003838,0.003838,0.003838
errands,sunday,10,0.0036571,0.0036571,0.0036571
escort,sunday,10,0.0014882,0.0014882,0.0014882
leisure,sunday,10,0.0123125,0.0123125,0.0123125
home,sunday,10,0.0051317,0.0051317,0.0051317
workplace,sunday,10.5,0,0,0
shopping,sunday,10.5,0.003838,0.003838,0.003838
errands,sunday,10.5,0.0036571,0.0036571,0.0036571
escort,sunday,10.5,0.0014882,0.0014882,0.0014882
leisure,sunday,10.5,0.0123125,0.0123125,0.0123125
home,sunday,10.5,0.0051317,0.0051317,0.0051317
workplace,sunday,11,0,0,0
shopping,sunday,11,0.0011681,0.0011681,0.0011681
errands,sunday,11,0.0047136,0.0047136,0.0047136
escort,sunday,11,0.0021496,0.0021496,0.0021496
leisure,sunday,11,0.0198367,0.0198367,0.0198367
home,sunday,11,0.0123161,0.0123161,0.0123161
workplace,sunday,11.5,0,0,0
shopping,sunday,11.5,0.0011681,0.0011681,0.0011681
errands,sunday,11.5,0.0047136,0.0047136,0.0047136
escort,sunday,11.5,0.0021496,0.0021496,0.0021496
leisure,sunday,11.5,0.0198367,0.0198367,0.0198367
home,sunday,11.5,0.0123161,0.0123161,0.0123161
workplace,sunday,12,0,0,0
shopping,sunday,12,0.0011681,0.0011681,0.0011681
errands,sunday,12,0.0047136,0.0047136,0.0047136
escort,sunday,12,0.0021496,0.0021496,0.0021496
leisure,sunday,12,0.0198367,0.0198367,0.0198367
home,sunday,12,0.0123161,0.0123161,0.0123161
workplace,sunday,12.5,0,0,0
shopping,sunday,12.5,0.0011681,0.0011681,0.0011681
errands,sunday,12.5,0.0047136,0.0047136,0.0047136
escort,sunday,12.5,0.0021496,0.0021496,0.0021496
leisure,sunday,12.5,0.0198367,0.0198367,0.0198367
home,sunday,12.5,0.0123161,0.0123161,0.0123161
workplace,sunday,13,0,0,0
shopping,sunday,13,0.0011681,0.0011681,0.0011681
errands,sunday,13,0.0047136,0.0047136,0.0047136
escort,sunday,13,0.0021496,0.0021496,0.0021496
leisure,sunday,13,0.0198367,0.0198367,0.0198367
home,sunday,13,0.0123161,0.0123161,0.0123161
workplace,sunday,13.5,0,0,0
shopping,sunday,13.5,0.0011681,0.0011681,0.0011681
errands,sunday,13.5,0.0047136,0.0047136,0.0047136
escort,sunday,13.5,0.0021496,0.0021496,0.0021496
leisure,sunday,13.5,0.0198367,0.0198367,0.0198367
home,sunday,13.5,0.0123161,0.0123161,0.0123161
workplace,sunday,14,0,0,0
shopping,sunday,14,0.0008344,0.0008344,0.0008344
errands,sunday,14,0.0043885,0.0043885,0.0043885
escort,sunday,14,0.0023976,0.0023976,0.0023976
leisure,sunday,14,0.0232569,0.0232569,0.0232569
home,sunday,14,0.015053,0.015053,0.015053
workplace,sunday,14.5,0,0,0
shopping,sunday,14.5,0.0008344,0.0008344,0.0008344
errands,sunday,14.5,0.0043885,0.0043885,0.0043885
escort,sunday,14.5,0.0023976,0.0023976,0.0023976
leisure,sunday,14.5,0.0232569,0.0232569,0.0232569
home,sunday,14.5,0.015053,0.015053,0.015053
workplace,sunday,15,0,0,0
shopping,sunday,15,0.0008344,0.0008344,0.0008344
errands,sunday,15,0.0043885,0.0043885,0.0043885
escort,sunday,15,0.0023976,0.0023976,0.0023976
leisure,sunday,15,0.0232569,0.0232569,0.0232569
home,sunday,15,0.015053,0.015053,0.015053
workplace,sunday,15.5,0,0,0
shopping,sunday,15.5,0.0008344,0.0008344,0.0008344
errands,sunday,15.5,0.0043885,0.0043885,0.0043885
escort,sunday,15.5,0.0023976,0.0023976,0.0023976
leisure,sunday,15.5,0.0232569,0.0232569,0.0232569
home,sunday,15.5,0.015053,0.015053,0.015053
workplace,sunday,16,0,0,0
shopping,sunday,16,0.0008344,0.0008344,0.0008344
errands,sunday,16,0.0043885,0.0043885,0.0043885
escort,sunday,16,0.0023976,0.0023976,0.0023976
leisure,sunday,16,0.0232569,0.0232569,0.0232569
home,sunday,16,0.015053,0.015053,0.015053
workplace,sunday,16.5,0,0,0
shopping,sunday,16.5,0.0008344,0.0008344,0.0008344
errands,sunday,16.5,0.0043885,0.0043885,0.0043885
escort,sunday,16.5,0.0023976,0.0023976,0.0023976
leisure,sunday,16.5,0.0232569,0.0232569,0.0232569
home,sunday,16.5,0.015053,0.015053,0.015053
workplace,sunday,17,0,0,0
shopping,sunday,17,0.0003337,0.0003337,0.0003337
errands,sunday,17,0.0030882,0.0030882,0.0030882
escort,sunday,17,0.0017362,0.0017362,0.0017362
leisure,sunday,17,0.0116284,0.0116284,0.0116284
home,sunday,17,0.0225795,0.0225795,0.0225795
workplace,sunday,17.5,0,0,0
shopping,sunday,17.5,0.0003337,0.0003337,0.0003337
errands,sunday,17.5,0.0030882,0.0030882,0.0030882
escort,sunday,17.5,0.0017362,0.0017362,0.0017362
leisure,sunday,17.5,0.0116284,0.0116284,0.0116284
home,sunday,17.5,0.0225795,0.0225795,0.0225795
workplace,sunday,18,0,0,0
shopping,sunday,18,0.0003337,0.0003337,0.0003337
errands,sunday,18,0.0030882,0.0030882,0.0030882
escort,sunday,18,0.0017362,0.0017362,0.0017362
leisure,sunday,18,0.0116284,0.0116284,0.0116284
home,sunday,18,0.0225795,0.0225795,0.0225795
workplace,sunday,18.5,0,0,0
shopping,sunday,18.5,0.0003337,0.0003337,0.0003337
errands,sunday,18.5,0.0030882,0.0030882,0.0030882
escort,sunday,18.5,0.0017362,0.0017362,0.0017362
leisure,sunday,18.5,0.0116284,0.0116284,0.0116284
home,sunday,18.5,0.0225795,0.0225795,0.0225795
workplace,sunday,19,0,0,0
shopping,sunday,19,0.0003337,0.0003337,0.0003337
errands,sunday,19,0.0030882,0.0030882,0.0030882
escort,sunday,19,0.0017362,0.0017362,0.0017362
leisure,sunday,19,0.0116284,0.0116284,0.0116284
home,sunday,19,0.0225795,0.0225795,0.0225795
workplace,sunday,19.5,0,0,0
shopping,sunday,19.5,0.0003337,0.0003337,0.0003337
errands,sunday,19.5,0.0030882,0.0030882,0.0030882
escort,sunday,19.5,0.0017362,0.0017362,0.0017362
leisure,sunday,19.5,0.0116284,0.0116284,0.0116284
home,sunday,19.5,0.0225795,0.0225795,0.0225795
workplace,sunday,20,0,0,0
shopping,sunday,20,0.0001112,0.0001112,0.0001112
errands,sunday,20,0.0008127,0.0008127,0.0008127
escort,sunday,20,0.0007441,0.0007441,0.0007441
leisure,sunday,20,0.0034201,0.0034201,0.0034201
home,sunday,20,0.0109477,0.0109477,0.0109477
workplace,sunday,20.5,0,0,0
shopping,sunday,20.5,0.0001112,0.0001112,0.0001112
errands,sunday,20.5,0.0008127,0.0008127,0.0008127
escort,sunday,20.5,0.0007441,0.0007441,0.0007441
leisure,sunday,20.5,0.0034201,0.0034201,0.0034201
home,sunday,20.5,0.0109477,0.0109477,0.0109477
workplace,sunday,21,0,0,0
shopping,sunday,21,0.0001112,0.0001112,0.0001112
errands,sunday,21,0.0008127,0.0008127,0.0008127
escort,sunday,21,0.0007441,0.0007441,0.0007441
leisure,sunday,21,0.0034201,0.0034201,0.0034201
home,sunday,21,0.0109477,0.0109477,0.0109477
workplace,sunday,21.5,0,0,0
shopping,sunday,21.5,0.0001112,0.0001112,0.0001112
errands,sunday,21.5,0.0008127,0.0008127,0.0008127
escort,sunday,21.5,0.0007441,0.0007441,0.0007441
leisure,sunday,21.5,0.0034201,0.0034201,0.0034201
home,sunday,21.5,0.0109477,0.0109477,0.0109477
workplace,sunday,22,0,0,0
shopping,sunday,22,0.0001112,0.0001112,0.0001112
errands,sunday,22,0.0008127,0.0008127,0.0008127
escort,sunday,22,0.0007441,0.0007441,0.0007441
leisure,sunday,22,0.0034201,0.0034201,0.0034201
home,sunday,22,0.0109477,0.0109477,0.0109477
workplace,sunday,22.5,0,0,0
shopping,sunday,22.5,0.0001112,0.0001112,0.0001112
errands,sunday,22.5,0.0008127,0.0008127,0.0008127
escort,sunday,22.5,0.0007441,0.0007441,0.0007441
leisure,sunday,22.5,0.0034201,0.0034201,0.0034201
home,sunday,22.5,0.0109477,0.0109477,0.0109477
workplace,sunday,23,0,0,0
shopping,sunday,23,0,0,0
errands,sunday,23,6.97E-05,6.97E-05,6.97E-05
escort,sunday,23,7.09E-05,7.09E-05,7.09E-05
leisure,sunday,23,0.0002932,0.0002932,0.0002932
home,sunday,23,0.0014662,0.0014662,0.0014662
workplace,sunday,23.5,0,0,0
shopping,sunday,23.5,0,0,0
errands,sunday,23.5,6.97E-05,6.97E-05,6.97E-05
escort,sunday,23.5,7.09E-05,7.09E-05,7.09E-05
leisure,sunday,23.5,0.0002932,0.0002932,0.0002932
home,sunday,23.5,0.0014662,0.0014662,0.0014662
workplace,sunday,0,0,0,0
shopping,sunday,0,0,0,0
errands,sunday,0,6.97E-05,6.97E-05,6.97E-05
escort,sunday,0,7.09E-05,7.09E-05,7.09E-05
leisure,sunday,0,0.0002932,0.0002932,0.0002932
home,sunday,0,0.0014662,0.0014662,0.0014662
workplace,sunday,0.5,0,0,0
shopping,sunday,0.5,0,0,0
errands,sunday,0.5,6.97E-05,6.97E-05,6.97E-05
escort,sunday,0.5,7.09E-05,7.09E-05,7.09E-05
leisure,sunday,0.5,0.0002932,0.0002932,0.0002932
home,sunday,0.5,0.0014662,0.0014662,0.0014662
workplace,sunday,1,0,0,0
shopping,sunday,1,0,0,0
errands,sunday,1,6.97E-05,6.97E-05,6.97E-05
escort,sunday,1,7.09E-05,7.09E-05,7.09E-05
leisure,sunday,1,0.0002932,0.0002932,0.0002932
home,sunday,1,0.0014662,0.0014662,0.0014662
workplace,sunday,1.5,0,0,0
shopping,sunday,1.5,0,0,0
errands,sunday,1.5,6.97E-05,6.97E-05,6.97E-05
escort,sunday,1.5,7.09E-05,7.09E-05,7.09E-05
leisure,sunday,1.5,0.0002932,0.0002932,0.0002932
home,sunday,1.5,0.0014662,0.0014662,0.0014662
workplace,sunday,2,0,0,0
shopping,sunday,2,0,0,0
errands,sunday,2,6.97E-05,6.97E-05,6.97E-05
escort,sunday,2,7.09E-05,7.09E-05,7.09E-05
leisure,sunday,2,0.0002932,0.0002932,0.0002932
home,sunday,2,0.0014662,0.0014662,0.0014662
workplace,sunday,2.5,0,0,0
shopping,sunday,2.5,0,0,0
errands,sunday,2.5,6.97E-05,6.97E-05,6.97E-05
escort,sunday,2.5,7.09E-05,7.09E-05,7.09E-05
leisure,sunday,2.5,0.0002932,0.0002932,0.0002932
home,sunday,2.5,0.0014662,0.0014662,0.0014662
workplace,weekdays,3,0.0005086,0,0.0005086
shopping,weekdays,3,0,0,0
errands,weekdays,3,6.58E-05,0.0001201,6.58E-05
escort,weekdays,3,8.87E-05,5.54E-05,8.87E-05
leisure,weekdays,3,0.0002358,0.0002879,0.0002358
home,weekdays,3,0.0017049,0.0008422,0.0017049
workplace,weekdays,3.5,0.0005086,0,0.0005086
shopping,weekdays,3.5,0,0,0
errands,weekdays,3.5,6.58E-05,0.0001201,6.58E-05
escort,weekdays,3.5,8.87E-05,5.54E-05,8.87E-05
leisure,weekdays,3.5,0.0002358,0.0002879,0.0002358
home,weekdays,3.5,0.0017049,0.0008422,0.0017049
workplace,weekdays,4,0.0005086,0,0.0005086
shopping,weekdays,4,0,0,0
errands,weekdays,4,6.58E-05,0.0001201,6.58E-05
escort,weekdays,4,8.87E-05,5.54E-05,8.87E-05
leisure,weekdays,4,0.0002358,0.0002879,0.0002358
home,weekdays,4,0.0017049,0.0008422,0.0017049
workplace,weekdays,4.5,0.0005086,0,0.0005086
shopping,weekdays,4.5,0,0,0
errands,weekdays,4.5,6.58E-05,0.0001201,6.58E-05
escort,weekdays,4.5,8.87E-05,5.54E-05,8.87E-05
leisure,weekdays,4.5,0.0002358,0.0002879,0.0002358
home,weekdays,4.5,0.0017049,0.0008422,0.0017049
workplace,weekdays,5,0.0005086,0,0.0005086
shopping,weekdays,5,0,0,0
errands,weekdays,5,6.58E-05,0.0001201,6.58E-05
escort,weekdays,5,8.87E-05,5.54E-05,8.87E-05
leisure,weekdays,5,0.0002358,0.0002879,0.0002358
home,weekdays,5,0.0017049,0.0008422,0.0017049
workplace,weekdays,5.5,0.0005086,0,0.0005086
shopping,weekdays,5.5,0,0,0
errands,weekdays,5.5,6.58E-05,0.0001201,6.58E-05
escort,weekdays,5.5,8.87E-05,5.54E-05,8.87E-05
leisure,weekdays,5.5,0.0002358,0.0002879,0.0002358
home,weekdays,5.5,0.0017049,0.0008422,0.0017049
workplace,weekdays,6,0.018394,0,0.018394
shopping,weekdays,6,0.0007058,0.0010059,0.0007058
errands,weekdays,6,0.0007669,0.0016849,0.0007669
escort,weekdays,6,0.0017582,0.0012179,0.0017582
leisure,weekdays,6,0.0008257,0.0013436,0.0008257
home,weekdays,6,0.0013259,0.0006538,0.0013259
workplace,weekdays,6.5,0.018394,0,0.018394
shopping,weekdays,6.5,0.0007058,0.0010059,0.0007058
errands,weekdays,6.5,0.0007669,0.0016849,0.0007669
escort,weekdays,6.5,0.0017582,0.0012179,0.0017582
leisure,weekdays,6.5,0.0008257,0.0013436,0.0008257
home,weekdays,6.5,0.0013259,0.0006538,0.0013259
workplace,weekdays,7,0.018394,0,0.018394
shopping,weekdays,7,0.0007058,0.0010059,0.0007058
errands,weekdays,7,0.0007669,0.0016849,0.0007669
escort,weekdays,7,0.0017582,0.0012179,0.0017582
leisure,weekdays,7,0.0008257,0.0013436,0.0008257
home,weekdays,7,0.0013259,0.0006538,0.0013259
workplace,weekdays,7.5,0.018394,0,0.018394
shopping,weekdays,7.5,0.0007058,0.0010059,0.0007058
errands,weekdays,7.5,0.0007669,0.0016849,0.0007669
escort,weekdays,7.5,0.0017582,0.0012179,0.0017582
leisure,weekdays,7.5,0.0008257,0.0013436,0.0008257
home,weekdays,7.5,0.0013259,0.0006538,0.0013259
workplace,weekdays,8,0.018394,0,0.018394
shopping,weekdays,8,0.0007058,0.0010059,0.0007058
errands,weekdays,8,0.0007669,0.0016849,0.0007669
escort,weekdays,8,0.0017582,0.0012179,0.0017582
leisure,weekdays,8,0.0008257,0.0013436,0.0008257
home,weekdays,8,0.0013259,0.0006538,0.0013259
workplace,weekdays,8.5,0.018394,0,0.018394
shopping,weekdays,8.5,0.0007058,0.0010059,0.0007058
errands,weekdays,8.5,0.0007669,0.0016849,0.0007669
escort,weekdays,8.5,0.0017582,0.0012179,0.0017582
leisure,weekdays,8.5,0.0008257,0.0013436,0.0008257
home,weekdays,8.5,0.0013259,0.0006538,0.0013259
workplace,weekdays,9,0.0075654,0,0.0075654
shopping,weekdays,9,0.0045005,0.0145658,0.0045005
errands,weekdays,9,0.0034519,0.0109607,0.0034519
escort,weekdays,9,0.0020163,0.0021178,0.0020163
leisure,weekdays,9,0.0037155,0.0070485,0.0037155
home,weekdays,9,0.0049728,0.0098183,0.0049728
workplace,weekdays,9.5,0.0075654,0,0.0075654
shopping,weekdays,9.5,0.0045005,0.0145658,0.0045005
errands,weekdays,9.5,0.0034519,0.0109607,0.0034519
escort,weekdays,9.5,0.0020163,0.0021178,0.0020163
leisure,weekdays,9.5,0.0037155,0.0070485,0.0037155
home,weekdays,9.5,0.0049728,0.0098183,0.0049728
workplace,weekdays,10,0.0075654,0,0.0075654
shopping,weekdays,10,0.0045005,0.0145658,0.0045005
errands,weekdays,10,0.0034519,0.0109607,0.0034519
escort,weekdays,10,0.0020163,0.0021178,0.0020163
leisure,weekdays,10,0.0037155,0.0070485,0.0037155
home,weekdays,10,0.0049728,0.0098183,0.0049728
workplace,weekdays,10.5,0.0075654,0,0.0075654
shopping,weekdays,10.5,0.0045005,0.0145658,0.0045005
errands,weekdays,10.5,0.0034519,0.0109607,0.0034519
escort,weekdays,10.5,0.0020163,0.0021178,0.0020163
leisure,weekdays,10.5,0.0037155,0.0070485,0.0037155
home,weekdays,10.5,0.0049728,0.0098183,0.0049728
workplace,weekdays,11,0.0020769,0,0.0020769
shopping,weekdays,11,0.0044124,0.0120564,0.0044124
errands,weekdays,11,0.0036821,0.0092758,0.0036821
escort,weekdays,11,0.0012412,0.0008981,0.0012412
leisure,weekdays,11,0.0052289,0.0077203,0.0052289
home,weekdays,11,0.0092822,0.0196402,0.0092822
workplace,weekdays,11.5,0.0020769,0,0.0020769
shopping,weekdays,11.5,0.0044124,0.0120564,0.0044124
errands,weekdays,11.5,0.0036821,0.0092758,0.0036821
escort,weekdays,11.5,0.0012412,0.0008981,0.0012412
leisure,weekdays,11.5,0.0052289,0.0077203,0.0052289
home,weekdays,11.5,0.0092822,0.0196402,0.0092822
workplace,weekdays,12,0.0020769,0,0.0020769
shopping,weekdays,12,0.0044124,0.0120564,0.0044124
errands,weekdays,12,0.0036821,0.0092758,0.0036821
escort,weekdays,12,0.0012412,0.0008981,0.0012412
leisure,weekdays,12,0.0052289,0.0077203,0.0052289
home,weekdays,12,0.0092822,0.0196402,0.0092822
workplace,weekdays,12.5,0.0020769,0,0.0020769
shopping,weekdays,12.5,0.0044124,0.0120564,0.0044124
errands,weekdays,12.5,0.0036821,0.0092758,0.0036821
escort,weekdays,12.5,0.0012412,0.0008981,0.0012412
leisure,weekdays,12.5,0.0052289,0.0077203,0.0052289
home,weekdays,12.5,0.0092822,0.0196402,0.0092822
workplace,weekdays,13,0.0020769,0,0.0020769
shopping,weekdays,13,0.0044124,0.0120564,0.0044124
errands,weekdays,13,0.0036821,0.0092758,0.0036821
escort,weekdays,13,0.0012412,0.0008981,0.0012412
leisure,weekdays,13,0.0052289,0.0077203,0.0052289
home,weekdays,13,0.0092822,0.0196402,0.0092822
workplace,weekdays,13.5,0.0020769,0,0.0020769
shopping,weekdays,13.5,0.0044124,0.0120564,0.0044124
errands,weekdays,13.5,0.0036821,0.0092758,0.0036821
escort,weekdays,13.5,0.0012412,0.0008981,0.0012412
leisure,weekdays,13.5,0.0052289,0.0077203,0.0052289
home,weekdays,13.5,0.0092822,0.0196402,0.0092822
workplace,weekdays,14,0.0020769,0,0.0020769
shopping,weekdays,14,0.0038828,0.0060282,0.0038828
errands,weekdays,14,0.0038352,0.0061827,0.0038352
escort,weekdays,14,0.0028954,0.0019256,0.0028954
leisure,weekdays,14,0.0063295,0.0104039,0.0063295
home,weekdays,14,0.0152492,0.0150562,0.0152492
workplace,weekdays,14.5,0.0020769,0,0.0020769
shopping,weekdays,14.5,0.0038828,0.0060282,0.0038828
errands,weekdays,14.5,0.0038352,0.0061827,0.0038352
escort,weekdays,14.5,0.0028954,0.0019256,0.0028954
leisure,weekdays,14.5,0.0063295,0.0104039,0.0063295
home,weekdays,14.5,0.0152492,0.0150562,0.0152492
workplace,weekdays,15,0.0020769,0,0.0020769
shopping,weekdays,15,0.0038828,0.0060282,0.0038828
errands,weekdays,15,0.0038352,0.0061827,0.0038352
escort,weekdays,15,0.0028954,0.0019256,0.0028954
leisure,weekdays,15,0.0063295,0.0104039,0.0063295
home,weekdays,15,0.0152492,0.0150562,0.0152492
workplace,weekdays,15.5,0.0020769,0,0.0020769
shopping,weekdays,15.5,0.0038828,0.0060282,0.0038828
errands,weekdays,15.5,0.0038352,0.0061827,0.0038352
escort,weekdays,15.5,0.0028954,0.0019256,0.0028954
leisure,weekdays,15.5,0.0063295,0.0104039,0.0063295
home,weekdays,15.5,0.0152492,0.0150562,0.0152492
workplace,weekdays,16,0.0020769,0,0.0020769
shopping,weekdays,16,0.0038828,0.0060282,0.0038828
errands,weekdays,16,0.0038352,0.0061827,0.0038352
escort,weekdays,16,0.0028954,0.0019256,0.0028954
leisure,weekdays,16,0.0063295,0.0104039,0.0063295
home,weekdays,16,0.0152492,0.0150562,0.0152492
workplace,weekdays,16.5,0.0020769,0,0.0020769
shopping,weekdays,16.5,0.0038828,0.0060282,0.0038828
errands,weekdays,16.5,0.0038352,0.0061827,0.0038352
escort,weekdays,16.5,0.0028954,0.0019256,0.0028954
leisure,weekdays,16.5,0.0063295,0.0104039,0.0063295
home,weekdays,16.5,0.0152492,0.0150562,0.0152492
workplace,weekdays,17,0.0005931,0,0.0005931
shopping,weekdays,17,0.0047653,0.00402,0.0047653
errands,weekdays,17,0.0036821,0.0030931,0.0036821
escort,weekdays,17,0.0022753,0.0007041,0.0022753
leisure,weekdays,17,0.0079809,0.0067144,0.0079809
home,weekdays,17,0.023205,0.0150562,0.023205
workplace,weekdays,17.5,0.0005931,0,0.0005931
shopping,weekdays,17.5,0.0047653,0.00402,0.0047653
errands,weekdays,17.5,0.0036821,0.0030931,0.0036821
escort,weekdays,17.5,0.0022753,0.0007041,0.0022753
leisure,weekdays,17.5,0.0079809,0.0067144,0.0079809
home,weekdays,17.5,0.023205,0.0150562,0.023205
workplace,weekdays,18,0.0005931,0,0.0005931
shopping,weekdays,18,0.0047653,0.00402,0.0047653
errands,weekdays,18,0.0036821,0.0030931,0.0036821
escort,weekdays,18,0.0022753,0.0007041,0.0022753
leisure,weekdays,18,0.0079809,0.0067144,0.0079809
home,weekdays,18,0.023205,0.0150562,0.023205
workplace,weekdays,18.5,0.0005931,0,0.0005931
shopping,weekdays,18.5,0.0047653,0.00402,0.0047653
errands,weekdays,18.5,0.0036821,0.0030931,0.0036821
escort,weekdays,18.5,0.0022753,0.0007041,0.0022753
leisure,weekdays,18.5,0.0079809,0.0067144,0.0079809
home,weekdays,18.5,0.023205,0.0150562,0.023205
workplace,weekdays,19,0.0005931,0,0.0005931
shopping,weekdays,19,0.0047653,0.00402,0.0047653
errands,weekdays,19,0.0036821,0.0030931,0.0036821
escort,weekdays,19,0.0022753,0.0007041,0.0022753
leisure,weekdays,19,0.0079809,0.0067144,0.0079809
home,weekdays,19,0.023205,0.0150562,0.023205
workplace,weekdays,19.5,0.0005931,0,0.0005931
shopping,weekdays,19.5,0.0047653,0.00402,0.0047653
errands,weekdays,19.5,0.0036821,0.0030931,0.0036821
escort,weekdays,19.5,0.0022753,0.0007041,0.0022753
leisure,weekdays,19.5,0.0079809,0.0067144,0.0079809
home,weekdays,19.5,0.023205,0.0150562,0.023205
workplace,weekdays,20,0.0005931,0,0.0005931
shopping,weekdays,20,0.0007058,0.0006682,0.0007058
errands,weekdays,20,0.0009205,0.0005604,0.0009205
escort,weekdays,20,0.0006206,0.0001293,0.0006206
leisure,weekdays,20,0.003853,0.0020154,0.003853
home,weekdays,20,0.0099452,0.0058917,0.0099452
workplace,weekdays,20.5,0.0005931,0,0.0005931
shopping,weekdays,20.5,0.0007058,0.0006682,0.0007058
errands,weekdays,20.5,0.0009205,0.0005604,0.0009205
escort,weekdays,20.5,0.0006206,0.0001293,0.0006206
leisure,weekdays,20.5,0.003853,0.0020154,0.003853
home,weekdays,20.5,0.0099452,0.0058917,0.0099452
workplace,weekdays,21,0.0005931,0,0.0005931
shopping,weekdays,21,0.0007058,0.0006682,0.0007058
errands,weekdays,21,0.0009205,0.0005604,0.0009205
escort,weekdays,21,0.0006206,0.0001293,0.0006206
leisure,weekdays,21,0.003853,0.0020154,0.003853
home,weekdays,21,0.0099452,0.0058917,0.0099452
workplace,weekdays,21.5,0.0005931,0,0.0005931
shopping,weekdays,21.5,0.0007058,0.0006682,0.0007058
errands,weekdays,21.5,0.0009205,0.0005604,0.0009205
escort,weekdays,21.5,0.0006206,0.0001293,0.0006206
leisure,weekdays,21.5,0.003853,0.0020154,0.003853
home,weekdays,21.5,0.0099452,0.0058917,0.0099452
workplace,weekdays,22,0.0005931,0,0.0005931
shopping,weekdays,22,0.0007058,0.0006682,0.0007058
errands,weekdays,22,0.0009205,0.0005604,0.0009205
escort,weekdays,22,0.0006206,0.0001293,0.0006206
leisure,weekdays,22,0.003853,0.0020154,0.003853
home,weekdays,22,0.0099452,0.0058917,0.0099452
workplace,weekdays,22.5,0.0005931,0,0.0005931
shopping,weekdays,22.5,0.0007058,0.0006682,0.0007058
errands,weekdays,22.5,0.0009205,0.0005604,0.0009205
escort,weekdays,22.5,0.0006206,0.0001293,0.0006206
leisure,weekdays,22.5,0.003853,0.0020154,0.003853
home,weekdays,22.5,0.0099452,0.0058917,0.0099452
workplace,weekdays,23,0.0005086,0,0.0005086
shopping,weekdays,23,0,0,0
errands,weekdays,23,6.58E-05,0.0001201,6.58E-05
escort,weekdays,23,8.87E-05,5.54E-05,8.87E-05
leisure,weekdays,23,0.0002358,0.0002879,0.0002358
home,weekdays,23,0.0017049,0.0008422,0.0017049
workplace,weekdays,23.5,0.0005086,0,0.0005086
shopping,weekdays,23.5,0,0,0
errands,weekdays,23.5,6.58E-05,0.0001201,6.58E-05
escort,weekdays,23.5,8.87E-05,5.54E-05,8.87E-05
leisure,weekdays,23.5,0.0002358,0.0002879,0.0002358
home,weekdays,23.5,0.0017049,0.0008422,0.0017049
workplace,weekdays,0,0.0005086,0,0.0005086
shopping,weekdays,0,0,0,0
errands,weekdays,0,6.58E-05,0.0001201,6.58E-05
escort,weekdays,0,8.87E-05,5.54E-05,8.87E-05
leisure,weekdays,0,0.0002358,0.0002879,0.0002358
home,weekdays,0,0.0017049,0.0008422,0.0017049
workplace,weekdays,0.5,0.0005086,0,0.0005086
shopping,weekdays,0.5,0,0,0
errands,weekdays,0.5,6.58E-05,0.0001201,6.58E-05
escort,weekdays,0.5,8.87E-05,5.54E-05,8.87E-05
leisure,weekdays,0.5,0.0002358,0.0002879,0.0002358
home,weekdays,0.5,0.0017049,0.0008422,0.0017049
workplace,weekdays,1,0.0005086,0,0.0005086
shopping,weekdays,1,0,0,0
errands,weekdays,1,6.58E-05,0.0001201,6.58E-05
escort,weekdays,1,8.87E-05,5.54E-05,8.87E-05
leisure,weekdays,1,0.0002358,0.0002879,0.0002358
home,weekdays,1,0.0017049,0.0008422,0.0017049
workplace,weekdays,1.5,0.0005086,0,0.0005086
shopping,weekdays,1.5,0,0,0
errands,weekdays,1.5,6.58E-05,0.0001201,6.58E-05
escort,weekdays,1.5,8.87E-05,5.54E-05,8.87E-05
leisure,weekdays,1.5,0.0002358,0.0002879,0.0002358
home,weekdays,1.5,0.0017049,0.0008422,0.0017049
workplace,weekdays,2,0.0005086,0,0.0005086
shopping,weekdays,2,0,0,0
errands,weekdays,2,6.58E-05,0.0001201,6.58E-05
escort,weekdays,2,8.87E-05,5.54E-05,8.87E-05
leisure,weekdays,2,0.0002358,0.0002879,0.0002358
home,weekdays,2,0.0017049,0.0008422,0.0017049
workplace,weekdays,2.5,0.0005086,0,0.0005086
shopping,weekdays,2.5,0,0,0
errands,weekdays,2.5,6.58E-05,0.0001201,6.58E-05
escort,weekdays,2.5,8.87E-05,5.54E-05,8.87E-05
leisure,weekdays,2.5,0.0002358,0.0002879,0.0002358
home,weekdays,2.5,0.0017049,0.0008422,0.0017049
