days,ev_user,purpose,time
weekdays,0,home,0
weekdays,0,shopping,0
weekdays,0,leisure,0
weekdays,0,home,0.5
weekdays,0,shopping,0.5
weekdays,0,leisure,0.5
weekdays,0,home,1
weekdays,0,shopping,1
weekdays,0,leisure,1
weekdays,0,home,1.5
weekdays,0,shopping,1.5
weekdays,0,leisure,1.5
weekdays,0,home,2
weekdays,0,shopping,2
weekdays,0,leisure,2
weekdays,0,home,2.5
weekdays,0,shopping,2.5
weekdays,0,leisure,2.5
weekdays,0,home,3
weekdays,0,shopping,3
weekdays,0,leisure,3
weekdays,0,home,3.5
weekdays,0,shopping,3.5
weekdays,0,leisure,3.5
weekdays,0,home,4
weekdays,0,shopping,4
weekdays,0,leisure,4
weekdays,0,home,4.5
weekdays,0,shopping,4.5
weekdays,0,leisure,4.5
weekdays,0,home,5
weekdays,0,shopping,5
weekdays,0,leisure,5
weekdays,0,home,5.5
weekdays,0,shopping,5.5
weekdays,0,leisure,5.5
weekdays,0,home,6
weekdays,0,shopping,6
weekdays,0,leisure,6
weekdays,0,home,6.5
weekdays,0,shopping,6.5
weekdays,0,leisure,6.5
weekdays,0,home,7
weekdays,0,shopping,7
weekdays,0,leisure,7
weekdays,0,home,7.5
weekdays,0,shopping,7.5
weekdays,0,leisure,7.5
weekdays,0,home,8
weekdays,0,shopping,8
weekdays,0,leisure,8
weekdays,0,home,8.5
weekdays,0,shopping,8.5
weekdays,0,leisure,8.5
weekdays,0,home,9
weekdays,0,shopping,9
weekdays,0,leisure,9
weekdays,0,home,9.5
weekdays,0.021276595744681,shopping,9.5
weekdays,0,leisure,9.5
weekdays,0,home,10
weekdays,0.021276595744681,shopping,10
weekdays,0,leisure,10
weekdays,0,home,10.5
weekdays,0.021276595744681,shopping,10.5
weekdays,0,leisure,10.5
weekdays,0,home,11
weekdays,0.021276595744681,shopping,11
weekdays,0,leisure,11
weekdays,0,home,11.5
weekdays,0.021276595744681,shopping,11.5
weekdays,0,leisure,11.5
weekdays,0,home,12
weekdays,0.021276595744681,shopping,12
weekdays,0,leisure,12
weekdays,0.021276595744681,home,12.5
weekdays,0.021276595744681,shopping,12.5
weekdays,0,leisure,12.5
weekdays,0.021276595744681,home,13
weekdays,0.021276595744681,shopping,13
weekdays,0,leisure,13
weekdays,0.021276595744681,home,13.5
weekdays,0.021276595744681,shopping,13.5
weekdays,0,leisure,13.5
weekdays,0.021276595744681,home,14
weekdays,0.021276595744681,shopping,14
weekdays,0,leisure,14
weekdays,0.021276595744681,home,14.5
weekdays,0.021276595744681,shopping,14.5
weekdays,0,leisure,14.5
weekdays,0.021276595744681,home,15
weekdays,0,shopping,15
weekdays,0,leisure,15
weekdays,0.021276595744681,home,15.5
weekdays,0,shopping,15.5
weekdays,0.021276595744681,leisure,15.5
weekdays,0.021276595744681,home,16
weekdays,0,shopping,16
weekdays,0.021276595744681,leisure,16
weekdays,0.021276595744681,home,16.5
weekdays,0,shopping,16.5
weekdays,0.021276595744681,leisure,16.5
weekdays,0.021276595744681,home,17
weekdays,0,shopping,17
weekdays,0.021276595744681,leisure,17
weekdays,0.021276595744681,home,17.5
weekdays,0,shopping,17.5
weekdays,0.021276595744681,leisure,17.5
weekdays,0.021276595744681,home,18
weekdays,0,shopping,18
weekdays,0.021276595744681,leisure,18
weekdays,0.021276595744681,home,18.5
weekdays,0,shopping,18.5
weekdays,0.021276595744681,leisure,18.5
weekdays,0.021276595744681,home,19
weekdays,0,shopping,19
weekdays,0.021276595744681,leisure,19
weekdays,0.021276595744681,home,19.5
weekdays,0,shopping,19.5
weekdays,0.021276595744681,leisure,19.5
weekdays,0.021276595744681,home,20
weekdays,0,shopping,20
weekdays,0.021276595744681,leisure,20
weekdays,0.021276595744681,home,20.5
weekdays,0,shopping,20.5
weekdays,0.021276595744681,leisure,20.5
weekdays,0.021276595744681,home,21
weekdays,0,shopping,21
weekdays,0.021276595744681,leisure,21
weekdays,0.021276595744681,home,21.5
weekdays,0,shopping,21.5
weekdays,0.021276595744681,leisure,21.5
weekdays,0.021276595744681,home,22
weekdays,0,shopping,22
weekdays,0,leisure,22
weekdays,0.021276595744681,home,22.5
weekdays,0,shopping,22.5
weekdays,0,leisure,22.5
weekdays,0.021276595744681,home,23
weekdays,0,shopping,23
weekdays,0,leisure,23
weekdays,0.021276595744681,home,23.5
weekdays,0,shopping,23.5
weekdays,0,leisure,23.5
saturday,0,home,0
saturday,0,shopping,0
saturday,0,leisure,0
saturday,0,home,0.5
saturday,0,shopping,0.5
saturday,0,leisure,0.5
saturday,0,home,1
saturday,0,shopping,1
saturday,0,leisure,1
saturday,0,home,1.5
saturday,0,shopping,1.5
saturday,0,leisure,1.5
saturday,0,home,2
saturday,0,shopping,2
saturday,0,leisure,2
saturday,0,home,2.5
saturday,0,shopping,2.5
saturday,0,leisure,2.5
saturday,0,home,3
saturday,0,shopping,3
saturday,0,leisure,3
saturday,0,home,3.5
saturday,0,shopping,3.5
saturday,0,leisure,3.5
saturday,0,home,4
saturday,0,shopping,4
saturday,0,leisure,4
saturday,0,home,4.5
saturday,0,shopping,4.5
saturday,0,leisure,4.5
saturday,0,home,5
saturday,0,shopping,5
saturday,0,leisure,5
saturday,0,home,5.5
saturday,0,shopping,5.5
saturday,0,leisure,5.5
saturday,0,home,6
saturday,0,shopping,6
saturday,0,leisure,6
saturday,0,home,6.5
saturday,0,shopping,6.5
saturday,0,leisure,6.5
saturday,0,home,7
saturday,0,shopping,7
saturday,0,leisure,7
saturday,0,home,7.5
saturday,0,shopping,7.5
saturday,0,leisure,7.5
saturday,0,home,8
saturday,0,shopping,8
saturday,0,leisure,8
saturday,0,home,8.5
saturday,0,shopping,8.5
saturday,0,leisure,8.5
saturday,0,home,9
saturday,0,shopping,9
saturday,0,leisure,9
saturday,0,home,9.5
saturday,0.021276595744681,shopping,9.5
saturday,0,leisure,9.5
saturday,0,home,10
saturday,0.021276595744681,shopping,10
saturday,0,leisure,10
saturday,0,home,10.5
saturday,0.021276595744681,shopping,10.5
saturday,0,leisure,10.5
saturday,0,home,11
saturday,0.021276595744681,shopping,11
saturday,0,leisure,11
saturday,0,home,11.5
saturday,0.021276595744681,shopping,11.5
saturday,0,leisure,11.5
saturday,0,home,12
saturday,0.021276595744681,shopping,12
saturday,0,leisure,12
saturday,0.021276595744681,home,12.5
saturday,0.021276595744681,shopping,12.5
saturday,0,leisure,12.5
saturday,0.021276595744681,home,13
saturday,0.021276595744681,shopping,13
saturday,0,leisure,13
saturday,0.021276595744681,home,13.5
saturday,0.021276595744681,shopping,13.5
saturday,0,leisure,13.5
saturday,0.021276595744681,home,14
saturday,0.021276595744681,shopping,14
saturday,0,leisure,14
saturday,0.021276595744681,home,14.5
saturday,0.021276595744681,shopping,14.5
saturday,0,leisure,14.5
saturday,0.021276595744681,home,15
saturday,0,shopping,15
saturday,0,leisure,15
saturday,0.021276595744681,home,15.5
saturday,0,shopping,15.5
saturday,0.021276595744681,leisure,15.5
saturday,0.021276595744681,home,16
saturday,0,shopping,16
saturday,0.021276595744681,leisure,16
saturday,0.021276595744681,home,16.5
saturday,0,shopping,16.5
saturday,0.021276595744681,leisure,16.5
saturday,0.021276595744681,home,17
saturday,0,shopping,17
saturday,0.021276595744681,leisure,17
saturday,0.021276595744681,home,17.5
saturday,0,shopping,17.5
saturday,0.021276595744681,leisure,17.5
saturday,0.021276595744681,home,18
saturday,0,shopping,18
saturday,0.021276595744681,leisure,18
saturday,0.021276595744681,home,18.5
saturday,0,shopping,18.5
saturday,0.021276595744681,leisure,18.5
saturday,0.021276595744681,home,19
saturday,0,shopping,19
saturday,0.021276595744681,leisure,19
saturday,0.021276595744681,home,19.5
saturday,0,shopping,19.5
saturday,0.021276595744681,leisure,19.5
saturday,0.021276595744681,home,20
saturday,0,shopping,20
saturday,0.021276595744681,leisure,20
saturday,0.021276595744681,home,20.5
saturday,0,shopping,20.5
saturday,0.021276595744681,leisure,20.5
saturday,0.021276595744681,home,21
saturday,0,shopping,21
saturday,0.021276595744681,leisure,21
saturday,0.021276595744681,home,21.5
saturday,0,shopping,21.5
saturday,0.021276595744681,leisure,21.5
saturday,0.021276595744681,home,22
saturday,0,shopping,22
saturday,0,leisure,22
saturday,0.021276595744681,home,22.5
saturday,0,shopping,22.5
saturday,0,leisure,22.5
saturday,0.021276595744681,home,23
saturday,0,shopping,23
saturday,0,leisure,23
saturday,0.021276595744681,home,23.5
saturday,0,shopping,23.5
saturday,0,leisure,23.5
sunday,0,home,0
sunday,0,shopping,0
sunday,0,leisure,0
sunday,0,home,0.5
sunday,0,shopping,0.5
sunday,0,leisure,0.5
sunday,0,home,1
sunday,0,shopping,1
sunday,0,leisure,1
sunday,0,home,1.5
sunday,0,shopping,1.5
sunday,0,leisure,1.5
sunday,0,home,2
sunday,0,shopping,2
sunday,0,leisure,2
sunday,0,home,2.5
sunday,0,shopping,2.5
sunday,0,leisure,2.5
sunday,0,home,3
sunday,0,shopping,3
sunday,0,leisure,3
sunday,0,home,3.5
sunday,0,shopping,3.5
sunday,0,leisure,3.5
sunday,0,home,4
sunday,0,shopping,4
sunday,0,leisure,4
sunday,0,home,4.5
sunday,0,shopping,4.5
sunday,0,leisure,4.5
sunday,0,home,5
sunday,0,shopping,5
sunday,0,leisure,5
sunday,0,home,5.5
sunday,0,shopping,5.5
sunday,0,leisure,5.5
sunday,0,home,6
sunday,0,shopping,6
sunday,0,leisure,6
sunday,0,home,6.5
sunday,0,shopping,6.5
sunday,0,leisure,6.5
sunday,0,home,7
sunday,0,shopping,7
sunday,0,leisure,7
sunday,0,home,7.5
sunday,0,shopping,7.5
sunday,0,leisure,7.5
sunday,0,home,8
sunday,0,shopping,8
sunday,0,leisure,8
sunday,0,home,8.5
sunday,0,shopping,8.5
sunday,0,leisure,8.5
sunday,0,home,9
sunday,0,shopping,9
sunday,0,leisure,9
sunday,0,home,9.5
sunday,0.021276595744681,shopping,9.5
sunday,0,leisure,9.5
sunday,0,home,10
sunday,0.021276595744681,shopping,10
sunday,0,leisure,10
sunday,0,home,10.5
sunday,0.021276595744681,shopping,10.5
sunday,0,leisure,10.5
sunday,0,home,11
sunday,0.021276595744681,shopping,11
sunday,0,leisure,11
sunday,0,home,11.5
sunday,0.021276595744681,shopping,11.5
sunday,0,leisure,11.5
sunday,0,home,12
sunday,0.021276595744681,shopping,12
sunday,0,leisure,12
sunday,0.021276595744681,home,12.5
sunday,0.021276595744681,shopping,12.5
sunday,0,leisure,12.5
sunday,0.021276595744681,home,13
sunday,0.021276595744681,shopping,13
sunday,0,leisure,13
sunday,0.021276595744681,home,13.5
sunday,0.021276595744681,shopping,13.5
sunday,0,leisure,13.5
sunday,0.021276595744681,home,14
sunday,0.021276595744681,shopping,14
sunday,0,leisure,14
sunday,0.021276595744681,home,14.5
sunday,0.021276595744681,shopping,14.5
sunday,0,leisure,14.5
sunday,0.021276595744681,home,15
sunday,0,shopping,15
sunday,0,leisure,15
sunday,0.021276595744681,home,15.5
sunday,0,shopping,15.5
sunday,0.021276595744681,leisure,15.5
sunday,0.021276595744681,home,16
sunday,0,shopping,16
sunday,0.021276595744681,leisure,16
sunday,0.021276595744681,home,16.5
sunday,0,shopping,16.5
sunday,0.021276595744681,leisure,16.5
sunday,0.021276595744681,home,17
sunday,0,shopping,17
sunday,0.021276595744681,leisure,17
sunday,0.021276595744681,home,17.5
sunday,0,shopping,17.5
sunday,0.021276595744681,leisure,17.5
sunday,0.021276595744681,home,18
sunday,0,shopping,18
sunday,0.021276595744681,leisure,18
sunday,0.021276595744681,home,18.5
sunday,0,shopping,18.5
sunday,0.021276595744681,leisure,18.5
sunday,0.021276595744681,home,19
sunday,0,shopping,19
sunday,0.021276595744681,leisure,19
sunday,0.021276595744681,home,19.5
sunday,0,shopping,19.5
sunday,0.021276595744681,leisure,19.5
sunday,0.021276595744681,home,20
sunday,0,shopping,20
sunday,0.021276595744681,leisure,20
sunday,0.021276595744681,home,20.5
sunday,0,shopping,20.5
sunday,0.021276595744681,leisure,20.5
sunday,0.021276595744681,home,21
sunday,0,shopping,21
sunday,0.021276595744681,leisure,21
sunday,0.021276595744681,home,21.5
sunday,0,shopping,21.5
sunday,0.021276595744681,leisure,21.5
sunday,0.021276595744681,home,22
sunday,0,shopping,22
sunday,0,leisure,22
sunday,0.021276595744681,home,22.5
sunday,0,shopping,22.5
sunday,0,leisure,22.5
sunday,0.021276595744681,home,23
sunday,0,shopping,23
sunday,0,leisure,23
sunday,0.021276595744681,home,23.5
sunday,0,shopping,23.5
sunday,0,leisure,23.5
