n,h2_channel,h2_tech_recon,eta_recon_aux,recon_aux_c_fix,recon_aux_c_fix2,recon_aux_c_overnight,recon_aux_ed,recon_aux_lifetime,recon_aux_sw
DE,P2gas,CCGT,0.0,0.0,0.0,0.0,0.0,1.0,0.0
DE,P2gas,DUMMY,0.0,0.0,0.0,0.0,0.0,1.0,0.0
DE,P2gas,GE,0.0,0.0,0.0,0.0,0.0,1.0,0.0
DE,P2gas,GT,0.0,0.0,0.0,0.0,0.0,1.0,0.0
DE,P2gas,PEM-FC,0.0,0.0,0.0,0.0,0.0,1.0,0.0
DE,P2gas,SO-FC,0.0,0.0,0.0,0.0,0.0,1.0,0.0
DE,P2liquid,CCGT,0.0,0.0,0.0,0.0,0.0,1.0,0.0
DE,P2liquid,DUMMY,0.0,0.0,0.0,0.0,0.0,1.0,0.0
DE,P2liquid,GE,0.0,0.0,0.0,0.0,0.0,1.0,0.0
DE,P2liquid,GT,0.0,0.0,0.0,0.0,0.0,1.0,0.0
DE,P2liquid,PEM-FC,0.0,0.0,0.0,0.0,0.0,1.0,0.0
DE,P2liquid,SO-FC,0.0,0.0,0.0,0.0,0.0,1.0,0.0
DE,fuel_cent_GH2,CCGT,0.0,0.0,0.0,0.0,0.0,1.0,0.0
DE,fuel_cent_GH2,DUMMY,0.0,0.0,0.0,0.0,0.0,1.0,0.0
DE,fuel_cent_GH2,GE,0.0,0.0,0.0,0.0,0.0,1.0,0.0
DE,fuel_cent_GH2,GT,0.0,0.0,0.0,0.0,0.0,1.0,0.0
DE,fuel_cent_GH2,PEM-FC,0.0,0.0,0.0,0.0,0.0,1.0,0.0
DE,fuel_cent_GH2,SO-FC,0.0,0.0,0.0,0.0,0.0,1.0,0.0
DE,fuel_cent_GH2_cav,CCGT,0.0,0.0,0.0,0.0,0.0,1.0,0.0
DE,fuel_cent_GH2_cav,DUMMY,0.0,0.0,0.0,0.0,0.0,1.0,0.0
DE,fuel_cent_GH2_cav,GE,0.0,0.0,0.0,0.0,0.0,1.0,0.0
DE,fuel_cent_GH2_cav,GT,0.0,0.0,0.0,0.0,0.0,1.0,0.0
DE,fuel_cent_GH2_cav,PEM-FC,0.0,0.0,0.0,0.0,0.0,1.0,0.0
DE,fuel_cent_GH2_cav,SO-FC,0.0,0.0,0.0,0.0,0.0,1.0,0.0
DE,fuel_cent_LH2,CCGT,0.0,0.0,0.0,0.0,0.0,1.0,0.0
DE,fuel_cent_LH2,DUMMY,0.0,0.0,0.0,0.0,0.0,1.0,0.0
DE,fuel_cent_LH2,GE,0.0,0.0,0.0,0.0,0.0,1.0,0.0
DE,fuel_cent_LH2,GT,0.0,0.0,0.0,0.0,0.0,1.0,0.0
DE,fuel_cent_LH2,PEM-FC,0.0,0.0,0.0,0.0,0.0,1.0,0.0
DE,fuel_cent_LH2,SO-FC,0.0,0.0,0.0,0.0,0.0,1.0,0.0
DE,fuel_cent_LOHC,CCGT,0.0,0.0,0.0,0.0,0.0,1.0,0.0
DE,fuel_cent_LOHC,DUMMY,0.0,0.0,0.0,0.0,0.0,1.0,0.0
DE,fuel_cent_LOHC,GE,0.0,0.0,0.0,0.0,0.0,1.0,0.0
DE,fuel_cent_LOHC,GT,0.0,0.0,0.0,0.0,0.0,1.0,0.0
DE,fuel_cent_LOHC,PEM-FC,0.0,0.0,0.0,0.0,0.0,1.0,0.0
DE,fuel_cent_LOHC,SO-FC,0.0,0.0,0.0,0.0,0.0,1.0,0.0
DE,fuel_decent,CCGT,0.0,0.0,0.0,0.0,0.0,1.0,0.0
DE,fuel_decent,DUMMY,0.0,0.0,0.0,0.0,0.0,1.0,0.0
DE,fuel_decent,GE,0.0,0.0,0.0,0.0,0.0,1.0,0.0
DE,fuel_decent,GT,0.0,0.0,0.0,0.0,0.0,1.0,0.0
DE,fuel_decent,PEM-FC,0.0,0.0,0.0,0.0,0.0,1.0,0.0
DE,fuel_decent,SO-FC,0.0,0.0,0.0,0.0,0.0,1.0,0.0
DE,recon_cent_GH2,CCGT,0.0,0.0,0.0,0.0,0.0,1.0,0.0
DE,recon_cent_GH2,DUMMY,0.0,0.0,0.0,0.0,0.0,1.0,0.0
DE,recon_cent_GH2,GE,0.0,0.0,0.0,0.0,0.0,1.0,0.0
DE,recon_cent_GH2,GT,0.0,0.0,0.0,0.0,0.0,1.0,0.0
DE,recon_cent_GH2,PEM-FC,0.0,0.0,0.0,0.0,0.0,1.0,0.0
DE,recon_cent_GH2,SO-FC,0.0,0.0,0.0,0.0,0.0,1.0,0.0
DE,recon_cent_GH2_cav,CCGT,0.0,0.0,0.0,0.0,0.0,1.0,0.0
DE,recon_cent_GH2_cav,DUMMY,0.0,0.0,0.0,0.0,0.0,1.0,0.0
DE,recon_cent_GH2_cav,GE,0.0,0.0,0.0,0.0,0.0,1.0,0.0
DE,recon_cent_GH2_cav,GT,0.0,0.0,0.0,0.0,0.0,1.0,0.0
DE,recon_cent_GH2_cav,PEM-FC,0.0,0.0,0.0,0.0,0.0,1.0,0.0
DE,recon_cent_GH2_cav,SO-FC,0.0,0.0,0.0,0.0,0.0,1.0,0.0
DE,recon_cent_LH2,CCGT,0.0,0.0,0.0,0.0,0.0,1.0,0.0
DE,recon_cent_LH2,DUMMY,0.0,0.0,0.0,0.0,0.0,1.0,0.0
DE,recon_cent_LH2,GE,0.0,0.0,0.0,0.0,0.0,1.0,0.0
DE,recon_cent_LH2,GT,0.0,0.0,0.0,0.0,0.0,1.0,0.0
DE,recon_cent_LH2,PEM-FC,0.0,0.0,0.0,0.0,0.0,1.0,0.0
DE,recon_cent_LH2,SO-FC,0.0,0.0,0.0,0.0,0.0,1.0,0.0
DE,recon_cent_LOHC,CCGT,0.005,0.603,0.0,15.069,0.0234,15.0,1.0
DE,recon_cent_LOHC,DUMMY,0.0,0.0,0.0,0.0,0.0,1.0,0.0
DE,recon_cent_LOHC,GE,0.005,0.603,0.0,15.069,0.0234,15.0,1.0
DE,recon_cent_LOHC,GT,0.005,0.603,0.0,15.069,0.0234,15.0,1.0
DE,recon_cent_LOHC,PEM-FC,0.0,0.0,0.0,0.0,0.0,1.0,0.0
DE,recon_cent_LOHC,SO-FC,0.0,0.0,0.0,0.0,0.0,1.0,0.0
