n,h2_ely,availability,compression_electrical_demand,efficiency_compression,efficiency_electrolysis,fixed_capacities,fixed_costs_compression,fixed_costs_electrolysis,interest_rate,lifetime_compression,lifetime_electrolysis,max_installable,min_installable,oc_compression,oc_electrolysis,variable_om_compression
AT,PEM,1.0,0.0421,0.995,0.71,0.0,3207.0,13575.0,0.04,15.0,10.0,inf,0.0,80166.0,400000.0,0.0
BE,PEM,1.0,0.0421,0.995,0.71,0.0,3207.0,13575.0,0.04,15.0,10.0,inf,0.0,80166.0,400000.0,0.0
BG,PEM,1.0,0.0421,0.995,0.71,0.0,3207.0,13575.0,0.04,15.0,10.0,inf,0.0,80166.0,400000.0,0.0
CH,PEM,1.0,0.0421,0.995,0.71,0.0,3207.0,13575.0,0.04,15.0,10.0,inf,0.0,80166.0,400000.0,0.0
CY,PEM,1.0,0.0421,0.995,0.71,0.0,3207.0,13575.0,0.04,15.0,10.0,inf,0.0,80166.0,400000.0,0.0
CZ,PEM,1.0,0.0421,0.995,0.71,0.0,3207.0,13575.0,0.04,15.0,10.0,inf,0.0,80166.0,400000.0,0.0
DE,PEM,1.0,0.0421,0.995,0.71,0.0,3207.0,13575.0,0.04,15.0,10.0,inf,0.0,80166.0,400000.0,0.0
DK,PEM,1.0,0.0421,0.995,0.71,0.0,3207.0,13575.0,0.04,15.0,10.0,inf,0.0,80166.0,400000.0,0.0
EE,PEM,1.0,0.0421,0.995,0.71,0.0,3207.0,13575.0,0.04,15.0,10.0,inf,0.0,80166.0,400000.0,0.0
ES,PEM,1.0,0.0421,0.995,0.71,0.0,3207.0,13575.0,0.04,15.0,10.0,inf,0.0,80166.0,400000.0,0.0
FI,PEM,1.0,0.0421,0.995,0.71,0.0,3207.0,13575.0,0.04,15.0,10.0,inf,0.0,80166.0,400000.0,0.0
FR,PEM,1.0,0.0421,0.995,0.71,0.0,3207.0,13575.0,0.04,15.0,10.0,inf,0.0,80166.0,400000.0,0.0
GB,PEM,1.0,0.0421,0.995,0.71,0.0,3207.0,13575.0,0.04,15.0,10.0,inf,0.0,80166.0,400000.0,0.0
GR,PEM,1.0,0.0421,0.995,0.71,0.0,3207.0,13575.0,0.04,15.0,10.0,inf,0.0,80166.0,400000.0,0.0
HR,PEM,1.0,0.0421,0.995,0.71,0.0,3207.0,13575.0,0.04,15.0,10.0,inf,0.0,80166.0,400000.0,0.0
HU,PEM,1.0,0.0421,0.995,0.71,0.0,3207.0,13575.0,0.04,15.0,10.0,inf,0.0,80166.0,400000.0,0.0
IE,PEM,1.0,0.0421,0.995,0.71,0.0,3207.0,13575.0,0.04,15.0,10.0,inf,0.0,80166.0,400000.0,0.0
IEsem,PEM,1.0,0.0421,0.995,0.71,0.0,3207.0,13575.0,0.04,15.0,10.0,inf,0.0,80166.0,400000.0,0.0
IT,PEM,1.0,0.0421,0.995,0.71,0.0,3207.0,13575.0,0.04,15.0,10.0,inf,0.0,80166.0,400000.0,0.0
LT,PEM,1.0,0.0421,0.995,0.71,0.0,3207.0,13575.0,0.04,15.0,10.0,inf,0.0,80166.0,400000.0,0.0
LU,PEM,1.0,0.0421,0.995,0.71,0.0,3207.0,13575.0,0.04,15.0,10.0,inf,0.0,80166.0,400000.0,0.0
LV,PEM,1.0,0.0421,0.995,0.71,0.0,3207.0,13575.0,0.04,15.0,10.0,inf,0.0,80166.0,400000.0,0.0
NL,PEM,1.0,0.0421,0.995,0.71,0.0,3207.0,13575.0,0.04,15.0,10.0,inf,0.0,80166.0,400000.0,0.0
NO,PEM,1.0,0.0421,0.995,0.71,0.0,3207.0,13575.0,0.04,15.0,10.0,inf,0.0,80166.0,400000.0,0.0
PL,PEM,1.0,0.0421,0.995,0.71,0.0,3207.0,13575.0,0.04,15.0,10.0,inf,0.0,80166.0,400000.0,0.0
PT,PEM,1.0,0.0421,0.995,0.71,0.0,3207.0,13575.0,0.04,15.0,10.0,inf,0.0,80166.0,400000.0,0.0
RO,PEM,1.0,0.0421,0.995,0.71,0.0,3207.0,13575.0,0.04,15.0,10.0,inf,0.0,80166.0,400000.0,0.0
SE,PEM,1.0,0.0421,0.995,0.71,0.0,3207.0,13575.0,0.04,15.0,10.0,inf,0.0,80166.0,400000.0,0.0
SI,PEM,1.0,0.0421,0.995,0.71,0.0,3207.0,13575.0,0.04,15.0,10.0,inf,0.0,80166.0,400000.0,0.0
SK,PEM,1.0,0.0421,0.995,0.71,0.0,3207.0,13575.0,0.04,15.0,10.0,inf,0.0,80166.0,400000.0,0.0
