n,h2_channel,channel_avail_sw,h2_mobility_sw,p2x_sw,recon_sw
DE,P2gas,0,0,1,0
DE,P2liquid,0,0,1,0
DE,fuel_cent_GH2,0,1,0,0
DE,fuel_cent_GH2_cav,0,1,0,0
DE,fuel_cent_LH2,1,1,0,0
DE,fuel_cent_LOHC,0,1,0,0
DE,fuel_decent,0,1,0,0
DE,recon_cent_GH2,0,0,0,1
DE,recon_cent_GH2_cav,0,0,0,1
DE,recon_cent_LH2,0,0,0,1
DE,recon_cent_LOHC,0,0,0,1
