n,h2_sto,availability,efficiency_self,fixed_capacities,fixed_costs,interest_rate,level_min,lifetime,max_installable,min_installable,oc
AT,cavern,1.0,1.0,0.0,3.0,0.04,0.33,100.0,inf,0.0,105.0
BE,cavern,1.0,1.0,0.0,3.0,0.04,0.33,100.0,inf,0.0,105.0
BG,cavern,1.0,1.0,0.0,3.0,0.04,0.33,100.0,inf,0.0,105.0
CH,cavern,1.0,1.0,0.0,3.0,0.04,0.33,100.0,inf,0.0,105.0
CY,cavern,1.0,1.0,0.0,3.0,0.04,0.33,100.0,inf,0.0,105.0
CZ,cavern,1.0,1.0,0.0,3.0,0.04,0.33,100.0,inf,0.0,105.0
DE,cavern,1.0,1.0,0.0,3.0,0.04,0.33,100.0,inf,0.0,105.0
DK,cavern,1.0,1.0,0.0,3.0,0.04,0.33,100.0,inf,0.0,105.0
EE,cavern,1.0,1.0,0.0,3.0,0.04,0.33,100.0,inf,0.0,105.0
ES,cavern,1.0,1.0,0.0,3.0,0.04,0.33,100.0,inf,0.0,105.0
FI,cavern,1.0,1.0,0.0,3.0,0.04,0.33,100.0,inf,0.0,105.0
FR,cavern,1.0,1.0,0.0,3.0,0.04,0.33,100.0,inf,0.0,105.0
GB,cavern,1.0,1.0,0.0,3.0,0.04,0.33,100.0,inf,0.0,105.0
GR,cavern,1.0,1.0,0.0,3.0,0.04,0.33,100.0,inf,0.0,105.0
HR,cavern,1.0,1.0,0.0,3.0,0.04,0.33,100.0,inf,0.0,105.0
HU,cavern,1.0,1.0,0.0,3.0,0.04,0.33,100.0,inf,0.0,105.0
IE,cavern,1.0,1.0,0.0,3.0,0.04,0.33,100.0,inf,0.0,105.0
IEsem,cavern,1.0,1.0,0.0,3.0,0.04,0.33,100.0,inf,0.0,105.0
IT,cavern,1.0,1.0,0.0,3.0,0.04,0.33,100.0,inf,0.0,105.0
LT,cavern,1.0,1.0,0.0,3.0,0.04,0.33,100.0,inf,0.0,105.0
LU,cavern,1.0,1.0,0.0,3.0,0.04,0.33,100.0,inf,0.0,105.0
LV,cavern,1.0,1.0,0.0,3.0,0.04,0.33,100.0,inf,0.0,105.0
NL,cavern,1.0,1.0,0.0,3.0,0.04,0.33,100.0,inf,0.0,105.0
NO,cavern,1.0,1.0,0.0,3.0,0.04,0.33,100.0,inf,0.0,105.0
PL,cavern,1.0,1.0,0.0,3.0,0.04,0.33,100.0,inf,0.0,105.0
PT,cavern,1.0,1.0,0.0,3.0,0.04,0.33,100.0,inf,0.0,105.0
RO,cavern,1.0,1.0,0.0,3.0,0.04,0.33,100.0,inf,0.0,105.0
SE,cavern,1.0,1.0,0.0,3.0,0.04,0.33,100.0,inf,0.0,105.0
SI,cavern,1.0,1.0,0.0,3.0,0.04,0.33,100.0,inf,0.0,105.0
SK,cavern,1.0,1.0,0.0,3.0,0.04,0.33,100.0,inf,0.0,105.0
