n,tech,max_power
AT,bio,0
AT,pv,0
AT,ror,0
AT,wind_off,0
AT,wind_on,0
BE,bio,0
BE,pv,0
BE,ror,0
BE,wind_off,0
BE,wind_on,0
CH,bio,0
CH,pv,0
CH,ror,0
CH,wind_off,0
CH,wind_on,0
CZ,bio,0
CZ,pv,0
CZ,ror,0
CZ,wind_off,0
CZ,wind_on,0
DE,bio,0
DE,pv,100000
DE,ror,0
DE,wind_off,0
DE,wind_on,0
DK,bio,0
DK,pv,0
DK,ror,0
DK,wind_off,0
DK,wind_on,0
FR,bio,0
FR,pv,0
FR,ror,0
FR,wind_off,0
FR,wind_on,0
IT,bio,0
IT,pv,0
IT,ror,0
IT,wind_off,0
IT,wind_on,0
LU,bio,0
LU,pv,0
LU,ror,0
LU,wind_off,0
LU,wind_on,0
NL,bio,0
NL,pv,0
NL,ror,0
NL,wind_off,0
NL,wind_on,0
PL,bio,0
PL,pv,0
PL,ror,0
PL,wind_off,0
PL,wind_on,0
