{
    "h": {
        "type": "set",
        "file_name": [
            "h.csv"
        ]
    },
    "headers_time": {
        "type": "set",
        "file_name": [
            "xsets",
            "headers_time.csv"
        ]
    },
    "headers_time_ev": {
        "type": "set",
        "file_name": [
            "xsets",
            "headers_time_ev.csv"
        ]
    },
    "headers_h2_time_data": {
        "type": "set",
        "file_name": [
            "xsets",
            "headers_h2_time_data.csv"
        ]
    },
    "time_data_upload": {
        "type": "par",
        "file_name": [
            "0_Core",
            "time_data_upload.csv"
        ],
        "set_row": [
            "headers_time",
            "n"
        ],
        "set_col": "h",
        "col_loc": -1
    },
    "ev_time_data_upload": {
        "type": "par",
        "file_name": [
            "2_EV",
            "ev_time_data_upload.csv"
        ],
        "set_row": [
            "headers_time_ev",
            "n",
            "ev"
        ],
        "set_col": "h",
        "col_loc": -1
    },
    "dh_upload": {
        "type": "par",
        "file_name": [
            "1_Heat",
            "dh_upload.csv"
        ],
        "set_row": [
            "n",
            "bu"
        ],
        "set_col": "h",
        "col_loc": -1
    },
    "d_dhw_upload": {
        "type": "par",
        "file_name": [
            "1_Heat",
            "d_dhw_upload.csv"
        ],
        "set_row": [
            "n",
            "bu"
        ],
        "set_col": "h",
        "col_loc": -1
    },
    "temp_source_upload": {
        "type": "par",
        "file_name": [
            "1_Heat",
            "temp_source_upload.csv"
        ],
        "set_row": [
            "n",
            "ch"
        ],
        "set_col": "h",
        "col_loc": -1
    },
    "h2_time_data_upload": {
        "type": "par",
        "file_name": [
            "6_H2_parsimonious",
            "h2_time_data_upload.csv"
        ],
        "set_row": [
            "headers_h2_time_data",
            "n"
        ],
        "set_col": "h",
        "col_loc": -1
    },
    "h2_time_data": {
        "type": "par",
        "file_name": [
            "5_H2_extensive",
            "h2_time_data.csv"
        ],
        "set_row": [
            "n"
        ],
        "set_col": "h",
        "col_loc": -1
    },
    "h2_p2x_time_data": {
        "type": "par",
        "file_name": [
            "5_H2_extensive",
            "h2_p2x_time_data.csv"
        ],
        "set_row": [
            "n",
            "h2_channel"
        ],
        "set_col": "h",
        "col_loc": -1
    },
    "dsm_data_upload": {
        "type": "par",
        "file_name": [
            "3_DSM",
            "dsm_data_upload.csv"
        ],
        "set_row": [
            "n",
            "dsm",
            "dsm_type"
        ],
        "set_col": "headers_dsm",
        "col_loc": 0
    },
    "dsm": {
        "type": "set",
        "file_name": [
            "dsm.csv"
        ]
    },
    "dsm_type": {
        "type": "set",
        "file_name": [
            "dsm_type.csv"
        ]
    },
    "headers_dsm": {
        "type": "set",
        "file_name": [
            "xsets",
            "headers_dsm.csv"
        ]
    },
    "ev_data": {
        "type": "par",
        "file_name": [
            "2_EV",
            "ev_data.csv"
        ],
        "set_row": [
            "n",
            "ev"
        ],
        "set_col": "headers_ev",
        "col_loc": 0
    },
    "ev": {
        "type": "set",
        "file_name": [
            "ev.csv"
        ]
    },
    "headers_ev": {
        "type": "set",
        "file_name": [
            "xsets",
            "headers_ev.csv"
        ]
    },
    "h2_ely_data_upload": {
        "type": "par",
        "file_name": [
            "6_H2_parsimonious",
            "h2_ely_data_upload.csv"
        ],
        "set_row": [
            "n",
            "h2_ely"
        ],
        "set_col": "headers_h2_ely",
        "col_loc": 0
    },
    "h2_ely": {
        "type": "set",
        "file_name": [
            "h2_ely.csv"
        ]
    },
    "headers_h2_ely": {
        "type": "set",
        "file_name": [
            "xsets",
            "headers_h2_ely.csv"
        ]
    },
    "h2_recon_data_upload": {
        "type": "par",
        "file_name": [
            "6_H2_parsimonious",
            "h2_recon_data_upload.csv"
        ],
        "set_row": [
            "n",
            "h2_recon"
        ],
        "set_col": "headers_h2_recon",
        "col_loc": 0
    },
    "h2_recon": {
        "type": "set",
        "file_name": [
            "h2_recon.csv"
        ]
    },
    "headers_h2_recon": {
        "type": "set",
        "file_name": [
            "xsets",
            "headers_h2_recon.csv"
        ]
    },
    "h2_sto_data_upload": {
        "type": "par",
        "file_name": [
            "6_H2_parsimonious",
            "h2_sto_data_upload.csv"
        ],
        "set_row": [
            "n",
            "h2_sto"
        ],
        "set_col": "headers_h2_sto",
        "col_loc": 0
    },
    "h2_sto": {
        "type": "set",
        "file_name": [
            "h2_sto.csv"
        ]
    },
    "headers_h2_sto": {
        "type": "set",
        "file_name": [
            "xsets",
            "headers_h2_sto.csv"
        ]
    },
    "heat_data_upload": {
        "type": "par",
        "file_name": [
            "1_Heat",
            "heat_data_upload.csv"
        ],
        "set_row": [
            "n",
            "bu",
            "ch",
            "heat_storage",
            "heat_hp",
            "heat_elec",
            "heat_fossil"
        ],
        "set_col": "headers_heat",
        "col_loc": 0
    },
    "bu": {
        "type": "set",
        "file_name": [
            "bu.csv"
        ]
    },
    "ch": {
        "type": "set",
        "file_name": [
            "ch.csv"
        ]
    },
    "heat_storage": {
        "type": "set",
        "file_name": [
            "heat_storage.csv"
        ]
    },
    "heat_hp": {
        "type": "set",
        "file_name": [
            "heat_hp.csv"
        ]
    },
    "heat_elec": {
        "type": "set",
        "file_name": [
            "heat_elec.csv"
        ]
    },
    "heat_fossil": {
        "type": "set",
        "file_name": [
            "heat_fossil.csv"
        ]
    },
    "headers_heat": {
        "type": "set",
        "file_name": [
            "xsets",
            "headers_heat.csv"
        ]
    },
    "nodes_data_upload": {
        "type": "par",
        "file_name": [
            "0_Core",
            "nodes_data_upload.csv"
        ],
        "set_row": [
            "n"
        ],
        "set_col": "headers_nodes",
        "col_loc": 0
    },
    "headers_nodes": {
        "type": "set",
        "file_name": [
            "xsets",
            "headers_nodes.csv"
        ]
    },
    "h2_parameter_data_table1": {
        "type": "par",
        "file_name": [
            "5_H2_extensive",
            "h2_parameter_data_table1.csv"
        ],
        "set_row": [
            "n",
            "h2_tech"
        ],
        "set_col": "headers_h2_parameters_table1",
        "col_loc": 0
    },
    "h2_parameter_data_table5": {
        "type": "par",
        "file_name": [
            "5_H2_extensive",
            "h2_parameter_data_table5.csv"
        ],
        "set_row": [
            "n",
            "h2_tech",
            "h2_channel"
        ],
        "set_col": "headers_h2_parameters_table5",
        "col_loc": 0
    },
    "headers_h2_parameters_table5": {
        "type": "set",
        "file_name": [
            "xsets",
            "headers_h2_parameters_table5.csv"
        ]
    },
    "h2_parameter_data_table6": {
        "type": "par",
        "file_name": [
            "5_H2_extensive",
            "h2_parameter_data_table6.csv"
        ],
        "set_row": [
            "n",
            "h2_channel"
        ],
        "set_col": "headers_h2_parameters_table6",
        "col_loc": 0
    },
    "headers_h2_parameters_table6": {
        "type": "set",
        "file_name": [
            "xsets",
            "headers_h2_parameters_table6.csv"
        ]
    },
    "h2_tech": {
        "type": "set",
        "file_name": [
            "h2_tech.csv"
        ]
    },
    "headers_h2_parameters_table1": {
        "type": "set",
        "file_name": [
            "xsets",
            "headers_h2_parameters_table1.csv"
        ]
    },
    "h2_parameter_data_table7": {
        "type": "par",
        "file_name": [
            "5_H2_extensive",
            "h2_parameter_data_table7.csv"
        ],
        "set_row": [
            "n",
            "h2_channel",
            "h2_tech_recon"
        ],
        "set_col": "headers_h2_parameters_table7",
        "col_loc": 0
    },
    "headers_h2_parameters_table7": {
        "type": "set",
        "file_name": [
            "xsets",
            "headers_h2_parameters_table7.csv"
        ]
    },
    "h2_parameter_data_table8": {
        "type": "par",
        "file_name": [
            "5_H2_extensive",
            "h2_parameter_data_table8.csv"
        ],
        "set_row": [
            "n",
            "h2_tech_recon"
        ],
        "set_col": "headers_h2_parameters_table8",
        "col_loc": 0
    },
    "headers_h2_parameters_table8": {
        "type": "set",
        "file_name": [
            "xsets",
            "headers_h2_parameters_table8.csv"
        ]
    },
    "h2_parameter_data_table9": {
        "type": "par",
        "file_name": [
            "5_H2_extensive",
            "h2_parameter_data_table9.csv"
        ],
        "set_row": [
            "n"
        ],
        "set_col": "headers_h2_parameters_table9",
        "col_loc": 0
    },
    "headers_h2_parameters_table9": {
        "type": "set",
        "file_name": [
            "xsets",
            "headers_h2_parameters_table9.csv"
        ]
    },
    "h2_parameter_data_table2": {
        "type": "par",
        "file_name": [
            "5_H2_extensive",
            "h2_parameter_data_table2.csv"
        ],
        "set_row": [
            "n",
            "h2_channel"
        ],
        "set_col": "headers_h2_parameters_table2",
        "col_loc": 0
    },
    "h2_parameter_data_table10": {
        "type": "par",
        "file_name": [
            "5_H2_extensive",
            "h2_parameter_data_table10.csv"
        ],
        "set_row": [
            "n"
        ],
        "set_col": "headers_h2_parameters_table10",
        "col_loc": 0
    },
    "headers_h2_parameters_table10": {
        "type": "set",
        "file_name": [
            "xsets",
            "headers_h2_parameters_table10.csv"
        ]
    },
    "h2_channel": {
        "type": "set",
        "file_name": [
            "h2_channel.csv"
        ]
    },
    "headers_h2_parameters_table2": {
        "type": "set",
        "file_name": [
            "xsets",
            "headers_h2_parameters_table2.csv"
        ]
    },
    "h2_parameter_data_table3": {
        "type": "par",
        "file_name": [
            "5_H2_extensive",
            "h2_parameter_data_table3.csv"
        ],
        "set_row": [
            "n",
            "h2_tech_recon"
        ],
        "set_col": "headers_h2_parameters_table3",
        "col_loc": 0
    },
    "h2_tech_recon": {
        "type": "set",
        "file_name": [
            "h2_tech_recon.csv"
        ]
    },
    "headers_h2_parameters_table3": {
        "type": "set",
        "file_name": [
            "xsets",
            "headers_h2_parameters_table3.csv"
        ]
    },
    "h2_parameter_data_table4": {
        "type": "par",
        "file_name": [
            "5_H2_extensive",
            "h2_parameter_data_table4.csv"
        ],
        "set_row": [
            "n",
            "h2_tech"
        ],
        "set_col": "headers_h2_parameters_table4",
        "col_loc": 0
    },
    "headers_h2_parameters_table4": {
        "type": "set",
        "file_name": [
            "xsets",
            "headers_h2_parameters_table4.csv"
        ]
    },
    "prosumage_data_generation": {
        "type": "par",
        "file_name": [
            "4_Prosumage",
            "prosumage_data_generation.csv"
        ],
        "set_row": [
            "n",
            "tech"
        ],
        "set_col": "headers_prosumage_generation",
        "col_loc": 0
    },
    "headers_prosumage_generation": {
        "type": "set",
        "file_name": [
            "xsets",
            "headers_prosumage_generation.csv"
        ]
    },
    "prosumage_data_storage": {
        "type": "par",
        "file_name": [
            "4_Prosumage",
            "prosumage_data_storage.csv"
        ],
        "set_row": [
            "n",
            "sto"
        ],
        "set_col": "headers_prosumage_storage",
        "col_loc": 0
    },
    "headers_prosumage_storage": {
        "type": "set",
        "file_name": [
            "xsets",
            "headers_prosumage_storage.csv"
        ]
    },
    "scalar_data_upload": {
        "type": "par",
        "file_name": [
            "0_Core",
            "scalar_data_upload.csv"
        ],
        "set_row": ["headers_scalar"],
        "set_col": null,
        "col_loc": null
    },
    "headers_scalar": {
        "type": "set",
        "file_name": [
            "xsets",
            "headers_scalar.csv"
        ]
    },
    "topology_data": {
        "type": "par",
        "file_name": [
            "0_Core",
            "topology_data.csv"
        ],
        "set_row": [
            "l"
        ],
        "set_col": "headers_topology",
        "col_loc": 0
    },
    "l": {
        "type": "set",
        "file_name": [
            "l.csv"
        ]
    },
    "headers_topology": {
        "type": "set",
        "file_name": [
            "xsets",
            "headers_topology.csv"
        ]
    },
    "inc": {
        "type": "par",
        "file_name": [
            "0_Core",
            "inc.csv"
        ],
        "set_row": [
            "l"
        ],
        "set_col": "n",
        "col_loc": 0
    },
    "n": {
        "type": "set",
        "file_name": [
            "n.csv"
        ]
    },
    "storage_data": {
        "type": "par",
        "file_name": [
            "0_Core",
            "storage_data.csv"
        ],
        "set_row": [
            "n",
            "sto"
        ],
        "set_col": "headers_sto",
        "col_loc": 0
    },
    "sto": {
        "type": "set",
        "file_name": [
            "sto.csv"
        ]
    },
    "headers_sto": {
        "type": "set",
        "file_name": [
            "xsets",
            "headers_sto.csv"
        ]
    },
    "technology_data_upload": {
        "type": "par",
        "file_name": [
            "0_Core",
            "technology_data_upload.csv"
        ],
        "set_row": [
            "n",
            "tech",
            "tech_res_con",
            "tech_dispatch"
        ],
        "set_col": "headers_tech",
        "col_loc": 0
    },
    "tech": {
        "type": "set",
        "file_name": [
            "tech.csv"
        ]
    },
    "tech_res_con": {
        "type": "set",
        "file_name": [
            "tech_res_con.csv"
        ]
    },
    "tech_dispatch": {
        "type": "set",
        "file_name": [
            "tech_dispatch.csv"
        ]
    },
    "headers_tech": {
        "type": "set",
        "file_name": [
            "xsets",
            "headers_tech.csv"
        ]
    }
}