<svg width="10" height="7" viewBox="0 0 10 7" fill="none" xmlns="http://www.w3.org/2000/svg">
<path d="M4.52454 6.50632L0.698343 2.55665C0.433886 2.28366 0.433886 1.84223 0.698343 1.57214L1.33417 0.915803C1.59862 0.642812 2.02626 0.642812 2.2879 0.915803L5 3.71542L7.7121 0.915803C7.97656 0.642812 8.40419 0.642812 8.66583 0.915803L9.30166 1.57214C9.56611 1.84514 9.56611 2.28657 9.30166 2.55665L5.47546 6.50632C5.21663 6.77931 4.789 6.77931 4.52454 6.50632Z" fill="#8D8D8D"/>
</svg>
