Text,cleaned_text,stemmed_text,lemmatized_text,treated_stemmed_text,treated_lemmatized_text
"Pakistan targets innocent civilians in J&K with 4 ceasefire violations in 24 hours
Oct 10, 2020, 05:26PM ISTSource: Times Now
Pakistan is targeting unarmed innocent civilians in Jammu and Kashmir as it continues to violate ceasefire.Pakistan has violated ceasefire 4 times during last 24 hours. Meanwhile, two terrorists were killed by security forces in an encounter in Jammu and Kashmir. The encounter took place in Chingam area of Kulgam district. Also a video has emerged which shows Indian Army deployed at the","pakistan targets innocent civilians in j & k with 4 ceasefire violations in 24 hours oct 10 , 2020 , pm outsource  times now pakistan is targeting unarmed innocent civilians in jammy and kashmir as it continues to violate ceasefire pakistan has violated ceasefire 4 times during last 24 hours . meanwhile , two terrorists were killed by security forces in an encounter in jammy and kashmir . the encounter took place in china area of vulgar district . also a video has emerged which shows indian army deployed at the",pakistan targets innocent civilians j k ceasefire violations hours oct pm outsource times pakistan targeting unarmed innocent civilians jammy kashmir continues violate ceasefire pakistan violated ceasefire times last hours meanwhile two terrorists killed security forces encounter jammy kashmir encounter took place china area vulgar district also video emerged shows indian army deployed,pakistan targets innocent civilians j k ceasefire violations hours oct pm outsource times pakistan targeting unarmed innocent civilians jammy kashmir continues violate ceasefire pakistan violated ceasefire times last hours meanwhile two terrorists killed security forces encounter jammy kashmir encounter took place china area vulgar district also video emerged shows indian army deployed,pakistan targets innocent civilians j k ceasefire violations hours oct pm outsource times pakistan targeting unarmed innocent civilians jammy kashmir continues violate ceasefire pakistan violated ceasefire times last hours meanwhile two terrorists killed security forces encounter jammy kashmir encounter took place china area vulgar district also video emerged shows indian army deployed,pakistan targets innocent civilians j k ceasefire violations hours oct pm outsource times pakistan targeting unarmed innocent civilians jammy kashmir continues violate ceasefire pakistan violated ceasefire times last hours meanwhile two terrorists killed security forces encounter jammy kashmir encounter took place china area vulgar district also video emerged shows indian army deployed
