<svg id="ppower" xmlns="http://www.w3.org/2000/svg" width="24" height="24" viewBox="0 0 24 24">
  <path id="Path_19" data-name="Path 19" d="M0,0H24V24H0Z" fill="none"/>
  <path id="Path_20" data-name="Path 20" d="M13,3H11V13h2Zm4.83,2.17L16.41,6.59A6.92,6.92,0,0,1,19,12,7,7,0,1,1,7.58,6.58L6.17,5.17A8.992,8.992,0,1,0,21,12,8.932,8.932,0,0,0,17.83,5.17Z" fill="#555"/>
</svg>
