<svg xmlns="http://www.w3.org/2000/svg" width="36.494" height="24.004" viewBox="0 0 36.494 24.004">
  <g id="credit-card" transform="translate(0 -22.588)">
    <path id="Path_259" data-name="Path 259" d="M32.964,199.231H3.53A3.53,3.53,0,0,1,0,195.7V178.756a3.53,3.53,0,0,1,3.53-3.53H32.964a3.53,3.53,0,0,1,3.53,3.53V195.7A3.53,3.53,0,0,1,32.964,199.231Zm0,0" transform="translate(0 -152.639)" fill="#00c3ff"/>
    <path id="Path_260" data-name="Path 260" d="M32.964,175.227H3.53A3.53,3.53,0,0,0,0,178.756V180.1a3.53,3.53,0,0,1,3.53-3.53H32.964a3.53,3.53,0,0,1,3.53,3.53v-1.346A3.53,3.53,0,0,0,32.964,175.227Zm0,0" transform="translate(0 -152.639)" fill="#007dc8"/>
    <path id="Path_261" data-name="Path 261" d="M3.53,448.473H32.964a3.53,3.53,0,0,0,3.53-3.53V443.6a3.53,3.53,0,0,1-3.53,3.53H3.53A3.53,3.53,0,0,1,0,443.6v1.346A3.53,3.53,0,0,0,3.53,448.473Zm0,0" transform="translate(0 -401.881)" fill="#00aaf0"/>
    <path id="Path_262" data-name="Path 262" d="M87.238,232.926a.186.186,0,0,0-.184.184v3.568a.186.186,0,0,0,.184.184h1.725a.186.186,0,0,0,.184-.184V233.11a.186.186,0,0,0-.184-.184Zm0,0" transform="translate(-80.85 -206.225)" fill="#69ebfc"/>
    <path id="Path_263" data-name="Path 263" d="M57.059,246.652H58.5v1.979H57.059Zm0,0" transform="translate(-52.992 -218.974)" fill="#69ebfc"/>
    <path id="Path_264" data-name="Path 264" d="M126.188,246.652h1.442v1.979h-1.442Zm0,0" transform="translate(-117.193 -218.974)" fill="#69ebfc"/>
    <path id="Path_265" data-name="Path 265" d="M61.986,284.188v.1a.881.881,0,0,1-.88.88H59.38a.881.881,0,0,1-.88-.88v-.1H57.059v.535a1.4,1.4,0,0,0,1.4,1.4h3.579a1.4,1.4,0,0,0,1.4-1.4v-.535Zm0,0" transform="translate(-52.992 -253.833)" fill="#69ebfc"/>
    <path id="Path_266" data-name="Path 266" d="M62.032,209.8H58.454a1.4,1.4,0,0,0-1.4,1.4v.535H58.5v-.1a.881.881,0,0,1,.88-.88h1.725a.882.882,0,0,1,.88.88v.1h1.441V211.2A1.4,1.4,0,0,0,62.032,209.8Zm0,0" transform="translate(-52.992 -184.749)" fill="#69ebfc"/>
    <g id="Group_6498" data-name="Group 6498" transform="translate(4.067 34.207)">
      <path id="Path_267" data-name="Path 267" d="M62.312,340.478H58.175a1.116,1.116,0,0,1,0-2.232h4.137a1.116,1.116,0,0,1,0,2.232Zm0,0" transform="translate(-57.059 -338.246)" fill="#64daff"/>
      <path id="Path_268" data-name="Path 268" d="M66.08,423.556h-7.9a1.116,1.116,0,0,1,0-2.232h7.9a1.116,1.116,0,0,1,0,2.232Zm0,0" transform="translate(-57.059 -415.403)" fill="#64daff"/>
      <path id="Path_269" data-name="Path 269" d="M165.155,340.478h-4.137a1.116,1.116,0,0,1,0-2.232h4.137a1.116,1.116,0,1,1,0,2.232Zm0,0" transform="translate(-152.572 -338.246)" fill="#64daff"/>
      <path id="Path_270" data-name="Path 270" d="M268,340.478h-4.137a1.116,1.116,0,1,1,0-2.232H268a1.116,1.116,0,1,1,0,2.232Zm0,0" transform="translate(-248.082 -338.246)" fill="#64daff"/>
      <path id="Path_271" data-name="Path 271" d="M370.839,340.478H366.7a1.116,1.116,0,0,1,0-2.232h4.137a1.116,1.116,0,0,1,0,2.232Zm0,0" transform="translate(-343.595 -338.246)" fill="#64daff"/>
    </g>
    <path id="Path_272" data-name="Path 272" d="M330.855,399.422a2.883,2.883,0,1,1-2.883-2.883A2.883,2.883,0,0,1,330.855,399.422Zm0,0" transform="translate(-301.919 -358.177)" fill="#ffc850"/>
    <path id="Path_273" data-name="Path 273" d="M379.82,399.422a2.883,2.883,0,1,1-2.883-2.883A2.883,2.883,0,0,1,379.82,399.422Zm0,0" transform="translate(-347.393 -358.177)" fill="#ffc850"/>
    <path id="Path_274" data-name="Path 274" d="M374.055,407.138a1.428,1.428,0,1,0,1.138-2.291A2.874,2.874,0,0,0,374.055,407.138Zm0,0" transform="translate(-347.393 -365.893)" fill="#d476e2"/>
  </g>
</svg>
