Frequency (Hz)	Level (dB)
46.875000	-29.997070
93.750000	-33.119976
140.625000	-39.500748
187.500000	-46.268456
234.375000	-54.226482
281.250000	-57.702282
328.125000	-58.874405
375.000000	-52.968651
421.875000	-45.466251
468.750000	-44.301647
515.625000	-46.635700
562.500000	-49.552288
609.375000	-52.673748
656.250000	-56.135696
703.125000	-59.921024
750.000000	-60.500801
796.875000	-56.787369
843.750000	-55.170113
890.625000	-54.764271
937.500000	-56.550480
984.375000	-56.979855
1031.250000	-55.204399
1078.125000	-55.898247
1125.000000	-58.662491
1171.875000	-56.776657
1218.750000	-53.170593
1265.625000	-50.432713
1312.500000	-48.687790
1359.375000	-47.019012
1406.250000	-45.968788
1453.125000	-45.290951
1500.000000	-45.328938
1546.875000	-46.393780
1593.750000	-47.997341
1640.625000	-44.766541
1687.500000	-38.462910
1734.375000	-32.856869
1781.250000	-28.688259
1828.125000	-26.387495
1875.000000	-27.191628
1921.875000	-31.579206
1968.750000	-38.173527
2015.625000	-44.924896
2062.500000	-48.846790
2109.375000	-53.422520
2156.250000	-53.428211
2203.125000	-50.771881
2250.000000	-50.713097
2296.875000	-52.966984
2343.750000	-53.309689
2390.625000	-49.628277
2437.500000	-46.834888
2484.375000	-47.371548
2531.250000	-45.919922
2578.125000	-47.219311
2625.000000	-53.057678
2671.875000	-42.876442
2718.750000	-39.508801
2765.625000	-39.028751
2812.500000	-38.439075
2859.375000	-39.376556
2906.250000	-41.522190
2953.125000	-42.713039
3000.000000	-45.801521
3046.875000	-47.130249
3093.750000	-46.591110
3140.625000	-48.314049
3187.500000	-48.896484
3234.375000	-50.489624
3281.250000	-52.015198
3328.125000	-51.537498
3375.000000	-55.038486
3421.875000	-57.802910
3468.750000	-50.476414
3515.625000	-44.894978
3562.500000	-43.650913
3609.375000	-44.442410
3656.250000	-44.242561
3703.125000	-46.831345
3750.000000	-48.102371
3796.875000	-41.769146
3843.750000	-37.963909
3890.625000	-36.231956
3937.500000	-37.591702
3984.375000	-41.480728
4031.250000	-46.841389
4078.125000	-48.545788
4125.000000	-48.620590
4171.875000	-50.604080
4218.750000	-53.468956
4265.625000	-57.614811
4312.500000	-61.096989
4359.375000	-56.316406
4406.250000	-52.628040
4453.125000	-53.680370
4500.000000	-52.999660
4546.875000	-52.389271
4593.750000	-53.619743
4640.625000	-54.426701
4687.500000	-50.735966
4734.375000	-47.472462
4781.250000	-46.239254
4828.125000	-43.631214
4875.000000	-42.584156
4921.875000	-43.159882
4968.750000	-44.347683
5015.625000	-41.556095
5062.500000	-40.295933
5109.375000	-37.619877
5156.250000	-34.216423
5203.125000	-32.636391
5250.000000	-32.267433
5296.875000	-33.134354
5343.750000	-35.178684
5390.625000	-37.684193
5437.500000	-39.213989
5484.375000	-39.315098
5531.250000	-39.830009
5578.125000	-42.428043
5625.000000	-45.478313
5671.875000	-45.057858
5718.750000	-43.683567
5765.625000	-44.250889
5812.500000	-42.321125
5859.375000	-40.783829
5906.250000	-41.593533
5953.125000	-41.875610
6000.000000	-43.393776
6046.875000	-48.009132
6093.750000	-49.211842
6140.625000	-51.782970
6187.500000	-49.672649
6234.375000	-49.424831
6281.250000	-46.841007
6328.125000	-43.610935
6375.000000	-41.840591
6421.875000	-41.901630
6468.750000	-44.721451
6515.625000	-48.844082
6562.500000	-44.118038
6609.375000	-40.888714
6656.250000	-40.365330
6703.125000	-41.785225
6750.000000	-43.372288
6796.875000	-43.281242
6843.750000	-42.954380
6890.625000	-48.525005
6937.500000	-46.601925
6984.375000	-43.203590
7031.250000	-45.969769
7078.125000	-48.804634
7125.000000	-45.712749
7171.875000	-45.872868
7218.750000	-47.434341
7265.625000	-51.978336
7312.500000	-46.803261
7359.375000	-45.870937
7406.250000	-48.276241
7453.125000	-46.499363
7500.000000	-43.025158
7546.875000	-41.670902
7593.750000	-42.849354
7640.625000	-43.847366
7687.500000	-43.470673
7734.375000	-44.627281
7781.250000	-49.204330
7828.125000	-53.172073
7875.000000	-50.199528
7921.875000	-51.388561
7968.750000	-56.622952
8015.625000	-52.524200
8062.500000	-49.147690
8109.375000	-45.293522
8156.250000	-43.140984
8203.125000	-39.586239
8250.000000	-37.211128
8296.875000	-36.033726
8343.750000	-36.944767
8390.625000	-40.001514
8437.500000	-43.098061
8484.375000	-46.040974
8531.250000	-45.352409
8578.125000	-46.360641
8625.000000	-48.436436
8671.875000	-51.137688
8718.750000	-50.430252
8765.625000	-52.924835
8812.500000	-55.233250
8859.375000	-52.735950
8906.250000	-51.470066
8953.125000	-50.287941
9000.000000	-49.320267
9046.875000	-51.325562
9093.750000	-49.994854
9140.625000	-47.836399
9187.500000	-49.523720
9234.375000	-51.869358
9281.250000	-49.982395
9328.125000	-49.698811
9375.000000	-48.722919
9421.875000	-49.386589
9468.750000	-50.993210
9515.625000	-51.755856
9562.500000	-56.385311
9609.375000	-60.433876
9656.250000	-56.140484
9703.125000	-53.722420
9750.000000	-49.336945
9796.875000	-46.367893
9843.750000	-44.025017
9890.625000	-43.351433
9937.500000	-43.486160
9984.375000	-44.324390
10031.250000	-46.227638
10078.125000	-49.413567
10125.000000	-58.930302
10171.875000	-54.399258
10218.750000	-48.727409
10265.625000	-46.186707
10312.500000	-45.523560
10359.375000	-45.350975
10406.250000	-46.265629
10453.125000	-46.486179
10500.000000	-46.482578
10546.875000	-48.335819
10593.750000	-50.347588
10640.625000	-52.368896
10687.500000	-54.743904
10734.375000	-55.861580
10781.250000	-54.204224
10828.125000	-52.237915
10875.000000	-53.996979
10921.875000	-52.266556
10968.750000	-50.424679
11015.625000	-48.822144
11062.500000	-48.430168
11109.375000	-48.427902
11156.250000	-48.315331
11203.125000	-48.913769
11250.000000	-49.436123
11296.875000	-50.032303
11343.750000	-50.178226
11390.625000	-49.862740
11437.500000	-48.424522
11484.375000	-48.055096
11531.250000	-48.520599
11578.125000	-49.790302
11625.000000	-51.873306
11671.875000	-55.821774
11718.750000	-59.900776
11765.625000	-60.596519
11812.500000	-56.250332
11859.375000	-53.595398
11906.250000	-51.809250
11953.125000	-51.621132
12000.000000	-52.454731
12046.875000	-54.112270
12093.750000	-56.040546
12140.625000	-57.192066
12187.500000	-56.507542
12234.375000	-56.311050
12281.250000	-55.566097
12328.125000	-55.210083
12375.000000	-55.738762
12421.875000	-55.961086
12468.750000	-57.179504
12515.625000	-57.725163
12562.500000	-58.157482
12609.375000	-58.054840
12656.250000	-56.734989
12703.125000	-55.641464
12750.000000	-55.418568
12796.875000	-55.586758
12843.750000	-55.397499
12890.625000	-55.922428
12937.500000	-58.433571
12984.375000	-61.874199
13031.250000	-68.266075
13078.125000	-63.241989
13125.000000	-59.076401
13171.875000	-57.793900
13218.750000	-56.028221
13265.625000	-54.869354
13312.500000	-55.656071
13359.375000	-57.856804
13406.250000	-61.801590
13453.125000	-63.175652
13500.000000	-61.155155
13546.875000	-57.812046
13593.750000	-54.850185
13640.625000	-52.945221
13687.500000	-51.989235
13734.375000	-50.630150
13781.250000	-51.093277
13828.125000	-51.581703
13875.000000	-51.767910
13921.875000	-51.848660
13968.750000	-52.075085
14015.625000	-52.419914
14062.500000	-53.674065
14109.375000	-56.292358
14156.250000	-59.213417
14203.125000	-61.374741
14250.000000	-63.057198
14296.875000	-62.602257
14343.750000	-60.506771
14390.625000	-60.862148
14437.500000	-64.109764
14484.375000	-67.949669
14531.250000	-67.237068
14578.125000	-68.032372
14625.000000	-68.322914
14671.875000	-67.235451
14718.750000	-71.895065
14765.625000	-74.353050
14812.500000	-71.333595
14859.375000	-63.177883
14906.250000	-59.539257
14953.125000	-58.538723
15000.000000	-58.443295
15046.875000	-59.339138
15093.750000	-60.876537
15140.625000	-62.686928
15187.500000	-64.864090
15234.375000	-63.952461
15281.250000	-62.092175
15328.125000	-58.630661
15375.000000	-55.856720
15421.875000	-54.464741
15468.750000	-53.298862
15515.625000	-52.470413
15562.500000	-52.316700
15609.375000	-52.336758
15656.250000	-52.550552
15703.125000	-52.426891
15750.000000	-52.166374
15796.875000	-52.106197
15843.750000	-52.135323
15890.625000	-52.866589
15937.500000	-53.790524
15984.375000	-54.436275
16031.250000	-55.268478
16078.125000	-56.057301
16125.000000	-57.165565
16171.875000	-57.881523
16218.750000	-58.305004
16265.625000	-58.738106
16312.500000	-58.563347
16359.375000	-58.189438
16406.250000	-57.606625
16453.125000	-56.951763
16500.000000	-57.012974
16546.875000	-57.821274
16593.750000	-58.860092
16640.625000	-61.138500
16687.500000	-65.703453
16734.375000	-71.764603
16781.250000	-69.420715
16828.125000	-64.916878
16875.000000	-61.922909
16921.875000	-60.326542
16968.750000	-59.731907
17015.625000	-59.442314
17062.500000	-59.618549
17109.375000	-60.928329
17156.250000	-63.194454
17203.125000	-66.810707
17250.000000	-65.935112
17296.875000	-62.349468
17343.750000	-59.729115
17390.625000	-57.942387
17437.500000	-56.834782
17484.375000	-55.741409
17531.250000	-54.755878
17578.125000	-54.104366
17625.000000	-53.860126
17671.875000	-54.036930
17718.750000	-54.665421
17765.625000	-55.460262
17812.500000	-56.464272
17859.375000	-57.101871
17906.250000	-57.006725
17953.125000	-56.215191
18000.000000	-55.272270
18046.875000	-54.340210
18093.750000	-53.662113
18140.625000	-53.441597
18187.500000	-53.973053
18234.375000	-55.229733
18281.250000	-57.063030
18328.125000	-59.940208
18375.000000	-63.411671
18421.875000	-65.061729
18468.750000	-63.320992
18515.625000	-61.242748
18562.500000	-59.876144
18609.375000	-58.749725
18656.250000	-57.708546
18703.125000	-56.988705
18750.000000	-56.480312
18796.875000	-56.082912
18843.750000	-55.852272
18890.625000	-55.812794
18937.500000	-56.200127
18984.375000	-56.887123
19031.250000	-57.444157
19078.125000	-58.064507
19125.000000	-59.191177
19171.875000	-60.980072
19218.750000	-63.557308
19265.625000	-67.094986
19312.500000	-69.268364
19359.375000	-67.170311
19406.250000	-63.612080
19453.125000	-61.385426
19500.000000	-60.123219
19546.875000	-59.866329
19593.750000	-60.303822
19640.625000	-61.531216
19687.500000	-63.872829
19734.375000	-68.610367
19781.250000	-76.000580
19828.125000	-67.644737
19875.000000	-62.605927
19921.875000	-59.666088
19968.750000	-57.989132
20015.625000	-57.058365
20062.500000	-56.353321
20109.375000	-55.762814
20156.250000	-55.414742
20203.125000	-55.187447
20250.000000	-55.116409
20296.875000	-55.219360
20343.750000	-55.404160
20390.625000	-55.657238
20437.500000	-55.912056
20484.375000	-56.160976
20531.250000	-56.308289
20578.125000	-56.380066
20625.000000	-56.539196
20671.875000	-56.905609
20718.750000	-57.530437
20765.625000	-58.387505
20812.500000	-59.335796
20859.375000	-60.338284
20906.250000	-61.315678
20953.125000	-62.187004
21000.000000	-63.626026
21046.875000	-65.452843
21093.750000	-66.796150
21140.625000	-67.732399
21187.500000	-68.282524
21234.375000	-68.576340
21281.250000	-69.243004
21328.125000	-69.781540
21375.000000	-69.666977
21421.875000	-68.072395
21468.750000	-65.155220
21515.625000	-62.173466
21562.500000	-59.785793
21609.375000	-57.861023
21656.250000	-56.588062
21703.125000	-56.061848
21750.000000	-56.024967
21796.875000	-56.458904
21843.750000	-57.127346
21890.625000	-57.485161
21937.500000	-57.452591
21984.375000	-56.950214
22031.250000	-56.089790
22078.125000	-55.140057
22125.000000	-54.321541
22171.875000	-53.772617
22218.750000	-53.501678
22265.625000	-53.566376
22312.500000	-53.982994
22359.375000	-54.767410
22406.250000	-55.930691
22453.125000	-57.268738
22500.000000	-58.335186
22546.875000	-58.738514
22593.750000	-58.460327
22640.625000	-57.514046
22687.500000	-56.278271
22734.375000	-55.023151
22781.250000	-53.986969
22828.125000	-53.271587
22875.000000	-52.874100
22921.875000	-52.790379
22968.750000	-53.026966
23015.625000	-53.687950
23062.500000	-54.807514
23109.375000	-56.467758
23156.250000	-58.600258
23203.125000	-60.749615
23250.000000	-61.355354
23296.875000	-59.882149
23343.750000	-58.014843
23390.625000	-56.693085
23437.500000	-55.958847
23484.375000	-55.671528
23531.250000	-55.659641
23578.125000	-55.770451
23625.000000	-55.967899
23671.875000	-56.024563
23718.750000	-55.938965
23765.625000	-55.823513
23812.500000	-55.669903
23859.375000	-55.502121
23906.250000	-55.330406
23953.125000	-55.199738
