{
    "name": "json-ld",
    "version": "0.1.0",
    "private": true,
    "dependencies": {
      "@solid/react": "^1.7.0",
      "react": "^16.9.0",
      "react-dom": "^16.9.0",
      "spectacle-code-slide": "^0.5.2",
      "spectacle-scripts": "2.4.0"
    },
    "scripts": {
      "start": "react-scripts start",
      "build": "react-scripts build",
      "test": "react-scripts test",
      "eject": "react-scripts eject"
    },
    "eslintConfig": {
      "extends": "react-app"
    },
    "browserslist": [
      ">0.2%",
      "not dead",
      "not ie <= 11",
      "not op_mini all"
    ]
  }
  