{
    "Galeria": {
        "Responsavel": "Ítalo de Azevedo Albuquerque",
        "caminho": "https://onibusbrasil.com/italodea",
        "Fotos": {
            "7105609":{
            	"linkFoto":"https://onibusbrasil.com/storage/i/2019/9/30/p/57f906100f82e71c9de36294e6445866.jpg",
                "Empresa":{
                	"Nome" : "Auto Viação Jardinense",
                	"Logo" : "https://onibusbrasil.com/img/emp_logo/1613.jpg",
                	"Link" : "https://onibusbrasil.com/empresa/auto-viacao-jardinense"
                },
                "Prefixo" : "3265",
                "Placa" : "MZI-6434",
            	"Carroceria":{
            		"Fabricante":"Comil",
            		"Modelo" : "Piá 2008",
            		"Logo" : "https://onibusbrasil.com/img/emblems/makers/150/comil_2.png"
            	},
            	"Chassi":{
            		"Fabricante" : "Agrale",
            		"Modelo" : "MA 8.5",
            		"Logo" : "https://onibusbrasil.com/img/emblems/makers/150/agrale.png" 
            	},
            	"Local" : "Caicó-RN",
            	"Curtidas" : "23",
            	"Visualizações" : "27",
            	"Comentários" : "13",
            	"Detalhes" : ["30/09/2019","07:13:55"] 
            },
           "7075569":{
           		"linkFoto":"https://onibusbrasil.com/storage/i/2019/9/20/p/bf152307fc1c3bdbdfb6586ac97fb47f.jpg",
           		"Empresa":{
                	"Nome" : "Auto Viação Jardinense",
                	"Logo" : "https://onibusbrasil.com/img/emp_logo/1613.jpg",
                	"Link" : "https://onibusbrasil.com/empresa/auto-viacao-jardinense"
                },
                "Prefixo" : "3075",
                "Placa" : "NPX-9209",
            	"Carroceria":{
            		"Fabricante":"Marcopolo",
            		"Modelo" : "Viaggio G7 1050",
            		"Logo" : "https://onibusbrasil.com/img/emblems/makers/150/marcopolo_2.png"
            	},
            	"Chassi":{
            		"Fabricante" : "Mercedes-Benz",
            		"Modelo" : "O-500M",
            		"Logo" : "https://onibusbrasil.com/img/emblems/makers/150/mercedes-benz_2.png" 
            	},
            	"Local" : "Caicó-RN",
            	"Curtidas" : "44",
            	"Visualizações" : "102",
            	"Comentários" : "19",
            	"Detalhes" : ["10/09/2019","10:54:50"]
           }
        }
    }
}
