[{
    "id": 1,
    "driver_name": "Jeanette",
    "fathers_name": "Penddreth",
    "email": "jpenddreth0@census.gov",
    "gender": "Female"
    
  }, {
    "id": 2,
    "driver_name": "Jeanette2",
    "fathers_name": "Penddreth",
    "email": "gfrediani1@senate.gov",
    "gender": "Male"
    
  }, {
    "id": 3,
    "driver_name": "Jeanette3",
    "fathers_name": "Penddreth",
    "email": "nbea2@imageshack.us",
    "gender": "Female"
  
  }, {
    "id": 4,
    "driver_name": "Jeanette4",
    "fathers_name": "Penddreth",
    "email": "wvalek3@vk.com",
    "gender": "Male"
  
  }]