                    //1.Send Slack Notification for OTA Test Started

                    //2.Send Msg "Hello FNM!!" over topic OTATEST_CONTROL_CHANNEL and wait for reply

                    //3.Wait for timeout of 2min, within this time reply has to come from FNM, else repeat 2 & 3 two more time for expected output.

                    //4.Parse the reply from FNM
                    //if(didn't get_reply as "Hi Jenkins!!")
                    //Abort and and send slack notification as "OTA Failed, FNM Down"
                    //else

                    //5.Send msg "SUBSCRIBE_TO_JOBID OTATest/${env.BUILD_NUMBER}" over topic OTATEST_CONTROL_CHANNEL  and wait for reply
                    //6.Wait for timeout of 2min for reply if got no reply or incorrect reply repepeat 5 & 6 two more times for expected output
                    //7.Parse the reply from FNM
                    //if(didn't get_reply as "SUBSCRIBED")
                    //Abort and and send slack notification as "OTA Failed, FNM Down"
                    //else

                    //8.Send msg "DUT_AVAILABLE? for meta:OTA version,OTA zip path, compatible ISO location, target, arch, model" on topic OTATest/${env.
                    BUILD_NUMBER}
                    //9. Wait for timeout of 5min for reply if got no reply or incorrect reply repepeat 8 & 9 two more times for expected output
                    //10.Parse the reply from FNM
                    //if(didn't get_reply as "Resource Available")
                    //Abort and and send slack notification as "OTA Failed, DUT Resources not Available"
                    //else

                    //11.Send msg "Start OTA Test" on topic OTATest/${env.BUILD_NUMBER} and wait for reply
                    //12.Wait for timeout for 5min for the reply
                    //13.Parse the reply from FNM
                    //if(didn't get_reply as "OTA Success")
                    //Abort and send slack notification as "OTA Failed, Fix the OTA zip"
                    //else
                    //send slack notification as "OTA Successful"

                    //mqtt.disconnect()
