2.528245626068115257e+02
2.743733217239379840e+01
1.834135786056518569e+01
1.636268758773803711e+01
1.529552467346191413e+01
1.413989991188049267e+01
1.346058795928955121e+01
1.289499230384826589e+01
1.220603596687316816e+01
1.156302303314208935e+01
1.113940753936767614e+01
1.075599851608276403e+01
1.025146638870239180e+01
9.941507406234741495e+00
9.708590774536132173e+00
9.378386545181275125e+00
9.207190322875977273e+00
9.059863309860229919e+00
8.988651900291442232e+00
8.766833143234253001e+00
8.578268370628357786e+00
8.495649461746216602e+00
8.418717832565308257e+00
8.486407127380370952e+00
8.283108048439025595e+00
8.251531982421875355e+00
8.174219288825987917e+00
8.164903979301453063e+00
8.084267444610595987e+00
7.892197051048278844e+00
8.002829570770263246e+00
7.810328249931335343e+00
7.945059032440185298e+00
7.955346064567565989e+00
7.811710796356201136e+00
7.479792065620422647e+00
7.441696763038635254e+00
7.490529184341430557e+00
7.441144647598266992e+00
7.425695953369140234e+00
7.393730545043945668e+00
7.213589811325073597e+00
7.141757478713989471e+00
7.112771601676940669e+00
7.128325424194335902e+00
7.169629101753234757e+00
7.147744288444519256e+00
7.082879333496093999e+00
6.963916773796081650e+00
6.901088352203369247e+00
