2.499147026062011605e+02
2.901505172729492088e+01
2.079833448410034080e+01
1.889411565780639535e+01
1.773627091407776035e+01
1.676389132499694767e+01
1.584253987312316880e+01
1.501781880378723066e+01
1.451467067718505888e+01
1.392046899795532156e+01
1.345219963073730440e+01
1.308922908782959027e+01
1.270795461654663150e+01
1.232256781578063887e+01
1.203855334281921330e+01
1.193405802726745613e+01
1.172046071052551319e+01
1.159620980262756262e+01
1.134697558403015094e+01
1.137150335311889648e+01
1.097544342041015675e+01
1.098657967567443805e+01
1.079621509552001868e+01
1.071709049224853594e+01
1.058388074874877915e+01
1.066605233192443869e+01
1.052158382415771420e+01
1.051404372215271010e+01
1.047832777023315387e+01
1.045380195617675767e+01
1.044113698005676305e+01
1.028145690917968835e+01
1.006456366539001479e+01
1.011994276046752894e+01
1.004523013114929242e+01
9.967479181289672141e+00
9.998949818611144735e+00
9.835346641540526846e+00
9.755926818847656889e+00
9.749278669357300586e+00
9.742825174331665394e+00
9.743505663871765421e+00
9.724887938499451323e+00
9.709202680587768697e+00
9.689493145942687846e+00
9.635863904953003711e+00
9.605506854057312083e+00
9.678856158256531117e+00
9.656175961494446014e+00
9.640813875198364968e+00
