1.691882647132873672e+02
2.475556356430053739e+01
1.787045993804931499e+01
1.617097026824951200e+01
1.484027229309081974e+01
1.373020526885986392e+01
1.288500917434692461e+01
1.218526356697082491e+01
1.152856648445129473e+01
1.099678019523620520e+01
1.043558162689208935e+01
1.018886301040649478e+01
9.715749568939209269e+00
9.475790843963622478e+00
9.276955966949463672e+00
9.045031614303589151e+00
8.951091632843017010e+00
8.755000920295715972e+00
8.607751626968383363e+00
8.196948776245116974e+00
8.102448797225951793e+00
7.989257006645202885e+00
7.969373960494994691e+00
7.979371643066405895e+00
7.825851960182189870e+00
7.871310982704162740e+00
7.761552138328552175e+00
7.721471443176269212e+00
7.677397723197937118e+00
7.618562951087951340e+00
7.631934990882873748e+00
7.534792966842651651e+00
7.375911493301391175e+00
7.291745185852050781e+00
7.244114408493041779e+00
7.131828422546386825e+00
7.087803297042846395e+00
7.040909032821655700e+00
7.057603793144226145e+00
7.019955639839172257e+00
7.017613978385925044e+00
7.000787458419799769e+00
6.996716127395630203e+00
6.984265174865722514e+00
6.912061734199523855e+00
6.957140545845032165e+00
6.870207576751709233e+00
6.819313039779663299e+00
6.785382790565490652e+00
6.860804228782654057e+00
