# Fdb version 3
["xdvipdfmx"] 1610915082 "/home/leonardo/Documentos/Disciplinas/MC920/T5/relatorio/build/main.xdv" "/home/leonardo/Documentos/Disciplinas/MC920/T5/relatorio/build/main.pdf" "/home/leonardo/Documentos/Disciplinas/MC920/T5/relatorio/build/main" 1610915094
  "/home/leonardo/Documentos/Disciplinas/MC920/T5/relatorio/build/main.xdv" 1610915081 85884 f192e66b95c8a1fba16b142515db2a7f "xelatex"
  (generated)
  "/home/leonardo/Documentos/Disciplinas/MC920/T5/relatorio/build/main.pdf"
["xelatex"] 1610915081 "/home/leonardo/Documentos/Disciplinas/MC920/T5/relatorio/main.tex" "/home/leonardo/Documentos/Disciplinas/MC920/T5/relatorio/build/main.xdv" "main" 1610915094
  "../projeto/entrada/baboon.png" 1603049742 238713 d13abdf16227e20d6730edb81fc4296c ""
  "../projeto/entrada/butterfly.png" 1603049774 159677 86f66f4173fbc38a528181e613b5f065 ""
  "../projeto/entrada/city.png" 1603049778 220056 d9dba5eedb2658e7000e810bf5df159e ""
  "../projeto/entrada/dados.png" 1610842371 227963 3942b3b4bed2e098ea28a0a81fd38e91 ""
  "../projeto/entrada/galinha.png" 1610823075 292647 6b91af6b4efd6ecc0c6efbb3f3554c32 ""
  "../projeto/entrada/house.png" 1603049782 166043 fe2a606b6757c1a17a2bffb4009b9ec3 ""
  "../projeto/entrada/mario.png" 1610909833 1764904 2b46d42cfc6070d3a41776bc2227f34b ""
  "../projeto/entrada/seagull.png" 1603049786 100139 ff0cfc762d5f77e897cdf18a2cb39a1d ""
  "../projeto/saida/bicubica/dados.png" 1610912966 401599 26292192bb560d849f34af514062b497 ""
  "../projeto/saida/bicubica/house.png" 1610912792 634260 673cbac43bf9d5ea6bcbf975aa4420c2 ""
  "../projeto/saida/bilinear/galinha.png" 1610911792 40223 1f2f5802343a0c18a638200aca8b0840 ""
  "../projeto/saida/bilinear/seagull.png" 1610911955 107934 b4fb853f03367326b9eeba738debc705 ""
  "../projeto/saida/lagrange/baboon.png" 1610913437 560806 d56d90d59e1ec93297e6775103102d58 ""
  "../projeto/saida/lagrange/butterfly.png" 1610913704 855752 18bc23bac62eec07b1b7bea4615022b9 ""
  "../projeto/saida/vizinho/city.png" 1610910892 27337 954604c4fc564d42d7f8f5be44f95004 ""
  "../projeto/saida/vizinho/mario.png" 1610910590 2263909 b8ac07ca6eb26f44cf0f01d7c93d353a ""
  "/etc/texmf/web2c/texmf.cnf" 1600691096 475 c0e671620eb5563b2130f56340a5fde8 ""
  "/home/leonardo/Documentos/Disciplinas/MC920/T5/relatorio/build/main.aux" 1610915081 4654 ca492d256d9b80b6ef4744e137c50e7d ""
  "/home/leonardo/Documentos/Disciplinas/MC920/T5/relatorio/main.tex" 1610915080 16337 5ae282f9fdeaf1107bba7def673556fe ""
  "/usr/share/texlive/texmf-dist/fonts/map/fontname/texfonts.map" 1577235249 3524 cb3e574dea2d1052e39280babc910dc8 ""
  "/usr/share/texlive/texmf-dist/fonts/tfm/adobe/zapfding/pzdr.tfm" 1136768653 1528 f853c4d1b4e0550255e02831fdc8496f ""
  "/usr/share/texlive/texmf-dist/fonts/tfm/public/amsfonts/cmextra/cmex7.tfm" 1246382020 1004 54797486969f23fa377b128694d548df ""
  "/usr/share/texlive/texmf-dist/fonts/tfm/public/amsfonts/cmextra/cmex8.tfm" 1246382020 988 bdf658c3bfc2d96d3c8b02cfc1c94c20 ""
  "/usr/share/texlive/texmf-dist/fonts/tfm/public/amsfonts/symbols/msam10.tfm" 1246382020 916 f87d7c45f9c908e672703b83b72241a3 ""
  "/usr/share/texlive/texmf-dist/fonts/tfm/public/amsfonts/symbols/msam5.tfm" 1246382020 924 9904cf1d39e9767e7a3622f2a125a565 ""
  "/usr/share/texlive/texmf-dist/fonts/tfm/public/amsfonts/symbols/msam7.tfm" 1246382020 928 2dc8d444221b7a635bb58038579b861a ""
  "/usr/share/texlive/texmf-dist/fonts/tfm/public/amsfonts/symbols/msbm10.tfm" 1246382020 908 2921f8a10601f252058503cc6570e581 ""
  "/usr/share/texlive/texmf-dist/fonts/tfm/public/amsfonts/symbols/msbm5.tfm" 1246382020 940 75ac932a52f80982a9f8ea75d03a34cf ""
  "/usr/share/texlive/texmf-dist/fonts/tfm/public/amsfonts/symbols/msbm7.tfm" 1246382020 940 228d6584342e91276bf566bcf9716b83 ""
  "/usr/share/texlive/texmf-dist/fonts/tfm/public/cm/cmex10.tfm" 1136768653 992 662f679a0b3d2d53c1b94050fdaa3f50 ""
  "/usr/share/texlive/texmf-dist/fonts/tfm/public/cm/cmmi10.tfm" 1136768653 1528 abec98dbc43e172678c11b3b9031252a ""
  "/usr/share/texlive/texmf-dist/fonts/tfm/public/cm/cmmi6.tfm" 1136768653 1512 f21f83efb36853c0b70002322c1ab3ad ""
  "/usr/share/texlive/texmf-dist/fonts/tfm/public/cm/cmmi8.tfm" 1136768653 1520 eccf95517727cb11801f4f1aee3a21b4 ""
  "/usr/share/texlive/texmf-dist/fonts/tfm/public/cm/cmr10.tfm" 1136768653 1296 45809c5a464d5f32c8f98ba97c1bb47f ""
  "/usr/share/texlive/texmf-dist/fonts/tfm/public/cm/cmr6.tfm" 1136768653 1300 b62933e007d01cfd073f79b963c01526 ""
  "/usr/share/texlive/texmf-dist/fonts/tfm/public/cm/cmr8.tfm" 1136768653 1292 21c1c5bfeaebccffdb478fd231a0997d ""
  "/usr/share/texlive/texmf-dist/fonts/tfm/public/cm/cmss10.tfm" 1136768653 1316 b636689f1933f24d1294acdf6041daaa ""
  "/usr/share/texlive/texmf-dist/fonts/tfm/public/cm/cmss8.tfm" 1136768653 1296 d77f431d10d47c8ea2cc18cf45346274 ""
  "/usr/share/texlive/texmf-dist/fonts/tfm/public/cm/cmsy10.tfm" 1136768653 1124 6c73e740cf17375f03eec0ee63599741 ""
  "/usr/share/texlive/texmf-dist/fonts/tfm/public/cm/cmsy6.tfm" 1136768653 1116 933a60c408fc0a863a92debe84b2d294 ""
  "/usr/share/texlive/texmf-dist/fonts/tfm/public/cm/cmsy8.tfm" 1136768653 1120 8b7d695260f3cff42e636090a8002094 ""
  "/usr/share/texlive/texmf-dist/fonts/tfm/public/cm/cmtt10.tfm" 1136768653 768 1321e9409b4137d6fb428ac9dc956269 ""
  "/usr/share/texlive/texmf-dist/fonts/tfm/public/cm/cmtt8.tfm" 1136768653 768 d7b9a2629a0c353102ad947dc9221d49 ""
  "/usr/share/texlive/texmf-dist/tex/generic/atbegshi/atbegshi.sty" 1575674566 24708 5584a51a7101caf7e6bbf1fc27d8f7b1 ""
  "/usr/share/texlive/texmf-dist/tex/generic/babel-portuges/portuges.ldf" 1367878976 6605 2bd2937f1ce929b4a1367cc2d320364e ""
  "/usr/share/texlive/texmf-dist/tex/generic/babel/babel.def" 1581719732 87344 ec128793fb5196bbcc1741e5366ddac1 ""
  "/usr/share/texlive/texmf-dist/tex/generic/babel/babel.sty" 1581719732 18844 909add1631725af40d27125357ea816e ""
  "/usr/share/texlive/texmf-dist/tex/generic/babel/switch.def" 1581719732 15529 e761dc130df77f0ce9717a25d1b52a95 ""
  "/usr/share/texlive/texmf-dist/tex/generic/babel/txtbabel.def" 1580769195 5220 42a6518b499d20676051f269c61f4d9a ""
  "/usr/share/texlive/texmf-dist/tex/generic/babel/xebabel.def" 1580769195 11494 9f717f2e20ed9697bb4b84020941f936 ""
  "/usr/share/texlive/texmf-dist/tex/generic/bigintcalc/bigintcalc.sty" 1576625341 40635 c40361e206be584d448876bba8a64a3b ""
  "/usr/share/texlive/texmf-dist/tex/generic/bitset/bitset.sty" 1576016050 33961 6b5c75130e435b2bfdb9f480a09a39f9 ""
  "/usr/share/texlive/texmf-dist/tex/generic/etexcmds/etexcmds.sty" 1576625273 7734 b98cbb34c81f667027c1e3ebdbfce34b ""
  "/usr/share/texlive/texmf-dist/tex/generic/gettitlestring/gettitlestring.sty" 1576625223 8371 9d55b8bd010bc717624922fb3477d92e ""
  "/usr/share/texlive/texmf-dist/tex/generic/iftex/iftex.sty" 1573336935 6902 30fdaf7dc5636b8e3afa306210c45cae ""
  "/usr/share/texlive/texmf-dist/tex/generic/iftex/ifvtex.sty" 1572645307 1057 525c2192b5febbd8c1f662c9468335bb ""
  "/usr/share/texlive/texmf-dist/tex/generic/infwarerr/infwarerr.sty" 1575499628 8356 7bbb2c2373aa810be568c29e333da8ed ""
  "/usr/share/texlive/texmf-dist/tex/generic/intcalc/intcalc.sty" 1576625065 31769 002a487f55041f8e805cfbf6385ffd97 ""
  "/usr/share/texlive/texmf-dist/tex/generic/kvdefinekeys/kvdefinekeys.sty" 1576878844 5412 d5a2436094cd7be85769db90f29250a6 ""
  "/usr/share/texlive/texmf-dist/tex/generic/kvsetkeys/kvsetkeys.sty" 1576624944 13807 952b0226d4efca026f0e19dd266dcc22 ""
  "/usr/share/texlive/texmf-dist/tex/generic/ltxcmds/ltxcmds.sty" 1576624883 18552 1e1cc7b75da0dfaacce7cdcb27d306bf ""
  "/usr/share/texlive/texmf-dist/tex/generic/pdfescape/pdfescape.sty" 1576015897 19007 15924f7228aca6c6d184b115f4baa231 ""
  "/usr/share/texlive/texmf-dist/tex/generic/stringenc/se-ascii-print.def" 1575152242 3257 357e44871446bf7a67d5b44617e25103 ""
  "/usr/share/texlive/texmf-dist/tex/generic/stringenc/stringenc.sty" 1575152242 21514 b7557edcee22835ef6b03ede1802dad4 ""
  "/usr/share/texlive/texmf-dist/tex/generic/uniquecounter/uniquecounter.sty" 1576624663 7008 f92eaa0a3872ed622bbf538217cd2ab7 ""
  "/usr/share/texlive/texmf-dist/tex/latex/amsfonts/amsfonts.sty" 1359763108 5949 3f3fd50a8cc94c3d4cbf4fc66cd3df1c ""
  "/usr/share/texlive/texmf-dist/tex/latex/amsfonts/amssymb.sty" 1359763108 13829 94730e64147574077f8ecfea9bb69af4 ""
  "/usr/share/texlive/texmf-dist/tex/latex/amsfonts/umsa.fd" 1359763108 961 6518c6525a34feb5e8250ffa91731cff ""
  "/usr/share/texlive/texmf-dist/tex/latex/amsfonts/umsb.fd" 1359763108 961 d02606146ba5601b5645f987c92e6193 ""
  "/usr/share/texlive/texmf-dist/tex/latex/amsmath/amsbsy.sty" 1523134290 2211 ca7ce284ab93c8eecdc6029dc5ccbd73 ""
  "/usr/share/texlive/texmf-dist/tex/latex/amsmath/amsgen.sty" 1523134290 4161 7f6eb9092061a11f87d08ed13515b48d ""
  "/usr/share/texlive/texmf-dist/tex/latex/amsmath/amsmath.sty" 1580683321 85660 baee036978c7a91f4e2bba43f05e5945 ""
  "/usr/share/texlive/texmf-dist/tex/latex/amsmath/amsopn.sty" 1523134290 4116 32e6abd27229755a83a8b7f18e583890 ""
  "/usr/share/texlive/texmf-dist/tex/latex/amsmath/amstext.sty" 1523134290 2432 8ff93b1137020e8f21930562a874ae66 ""
  "/usr/share/texlive/texmf-dist/tex/latex/atveryend/atveryend.sty" 1576191570 19336 ce7ae9438967282886b3b036cfad1e4d ""
  "/usr/share/texlive/texmf-dist/tex/latex/auxhook/auxhook.sty" 1576625391 3935 57aa3c3e203a5c2effb4d2bd2efbc323 ""
  "/usr/share/texlive/texmf-dist/tex/latex/base/article.cls" 1580683321 20023 e427dd9e17e239bf926ef3aab67fe35e ""
  "/usr/share/texlive/texmf-dist/tex/latex/base/ifthen.sty" 1580683321 5159 892429808d9e0e2b3548aaefd9a06ed0 ""
  "/usr/share/texlive/texmf-dist/tex/latex/base/size11.clo" 1580683321 8462 61fdf79debfc3dc4dab35ec6cf83fbf7 ""
  "/usr/share/texlive/texmf-dist/tex/latex/base/ts1cmr.fd" 1580683321 2431 b6cead9f069ed55f4fba0c637aa047b6 ""
  "/usr/share/texlive/texmf-dist/tex/latex/booktabs/booktabs.sty" 1579038678 6078 f1cb470c9199e7110a27851508ed7a5c ""
  "/usr/share/texlive/texmf-dist/tex/latex/caption/caption.sty" 1578175482 57350 70b0c251b0022f1db12ad7dd4c1aa547 ""
  "/usr/share/texlive/texmf-dist/tex/latex/caption/caption3.sty" 1578175482 62012 5e9d40ecd926a6f500919e4c7e1480de ""
  "/usr/share/texlive/texmf-dist/tex/latex/caption/subcaption.sty" 1579816624 5937 3a338c8462fea6d5e61cecda091f49cf ""
  "/usr/share/texlive/texmf-dist/tex/latex/chemgreek/chemgreek.sty" 1579297960 47530 64600845afa9c25b782d42fa33f66772 ""
  "/usr/share/texlive/texmf-dist/tex/latex/cleveref/cleveref.sty" 1525128982 329481 7fc6b003158402a4c694bc0a1b729308 ""
  "/usr/share/texlive/texmf-dist/tex/latex/eso-pic/eso-pic.sty" 1526160256 11991 c1669f88e13f8bb6243df144e456b477 ""
  "/usr/share/texlive/texmf-dist/tex/latex/etoolbox/etoolbox.sty" 1569190624 45259 743c52a37a6e5ed83cfe0e128b2da10d ""
  "/usr/share/texlive/texmf-dist/tex/latex/fancyhdr/fancyhdr.sty" 1548974385 11128 a53805799bebfed6358fc1658a18e41f ""
  "/usr/share/texlive/texmf-dist/tex/latex/float/float.sty" 1137110151 6749 16d2656a1984957e674b149555f1ea1d ""
  "/usr/share/texlive/texmf-dist/tex/latex/geometry/geometry.sty" 1578002852 41601 9cf6c5257b1bc7af01a58859749dd37a ""
  "/usr/share/texlive/texmf-dist/tex/latex/graphics-cfg/color.cfg" 1459978653 1213 620bba36b25224fa9b7e1ccb4ecb76fd ""
  "/usr/share/texlive/texmf-dist/tex/latex/graphics-cfg/graphics.cfg" 1465944070 1224 978390e9c2234eab29404bc21b268d1e ""
  "/usr/share/texlive/texmf-dist/tex/latex/graphics-def/xetex.def" 1498427493 12707 672c620846df0fecf0a7a99fed83566d ""
  "/usr/share/texlive/texmf-dist/tex/latex/graphics/graphics.sty" 1580683321 16932 04729abe63b66ec59ea56edcd722b058 ""
  "/usr/share/texlive/texmf-dist/tex/latex/graphics/graphicx.sty" 1580683321 9067 1b996612394a52e1efe89c8bfe8a5892 ""
  "/usr/share/texlive/texmf-dist/tex/latex/graphics/keyval.sty" 1580683321 2590 e3b24ff953e5b58d924f163d25380312 ""
  "/usr/share/texlive/texmf-dist/tex/latex/graphics/lscape.sty" 1580683321 1753 f80abc75c0e3a4915097779c2649cc98 ""
  "/usr/share/texlive/texmf-dist/tex/latex/graphics/trig.sty" 1580683321 3976 d7fa7d81d2870d509d25b17d0245e735 ""
  "/usr/share/texlive/texmf-dist/tex/latex/hycolor/hycolor.sty" 1580250785 17914 4c28a13fc3d975e6e81c9bea1d697276 ""
  "/usr/share/texlive/texmf-dist/tex/latex/hyperref/hxetex.def" 1579642962 45261 3bba7c0845f8b8f283ed50816c338f20 ""
  "/usr/share/texlive/texmf-dist/tex/latex/hyperref/hyperref.sty" 1579642962 238752 60dd338d71b6a4ab2192131f73dc908b ""
  "/usr/share/texlive/texmf-dist/tex/latex/hyperref/nameref.sty" 1579642962 13244 0070bcab7b5a88187847128d22faf4d8 ""
  "/usr/share/texlive/texmf-dist/tex/latex/hyperref/pd1enc.def" 1579642962 14134 32b36577d311ddb6522413c7581ee968 ""
  "/usr/share/texlive/texmf-dist/tex/latex/hyperref/puenc.def" 1579642962 122447 2f3bff59bea0a0fa94e11cc69e0f3066 ""
  "/usr/share/texlive/texmf-dist/tex/latex/kvoptions/kvoptions.sty" 1575152344 22520 c4c2dab203104295e1e618be7e5c0f5b ""
  "/usr/share/texlive/texmf-dist/tex/latex/l3backend/l3backend-xdvipdfmx.def" 1580854751 24128 c4ebbe7ec59ef4686329b8f63a49f10b ""
  "/usr/share/texlive/texmf-dist/tex/latex/l3kernel/expl3.sty" 1581719662 4381 04628f3002bdd1d9c43ef984fd60ae18 ""
  "/usr/share/texlive/texmf-dist/tex/latex/l3packages/l3keys2e/l3keys2e.sty" 1581719662 4603 36e20d23ad4e5fdd8990f0c8ded4c131 ""
  "/usr/share/texlive/texmf-dist/tex/latex/l3packages/xparse/xparse.sty" 1581719662 81717 e93576ac4b24ce6e121ebd6ec6cf2893 ""
  "/usr/share/texlive/texmf-dist/tex/latex/letltxmacro/letltxmacro.sty" 1575499565 5766 13a9e8766c47f30327caf893ece86ac8 ""
  "/usr/share/texlive/texmf-dist/tex/latex/listings/listings.cfg" 1568236792 1830 bbaba8afaf42cc048ec4d4ff73467521 ""
  "/usr/share/texlive/texmf-dist/tex/latex/listings/listings.sty" 1568236792 80511 830f3f1d3ab7448dd84233e9c2f6462c ""
  "/usr/share/texlive/texmf-dist/tex/latex/listings/lstmisc.sty" 1568236792 77022 32914f01b528131c47be2a1040d3856d ""
  "/usr/share/texlive/texmf-dist/tex/latex/mathtools/mathtools.sty" 1579298046 55081 be7d8405cd93834f75bdf98c6521d2a0 ""
  "/usr/share/texlive/texmf-dist/tex/latex/mathtools/mhsetup.sty" 1496786006 5317 cf75154a8a7e6436f05a5be497f0b05e ""
  "/usr/share/texlive/texmf-dist/tex/latex/mhchem/mhchem.sty" 1529960175 133481 dc82a4183457b704dd7d0522a9b06baf ""
  "/usr/share/texlive/texmf-dist/tex/latex/multirow/multirow.sty" 1559339157 5486 a1d954b09782ba0acd8a8abfd98e1028 ""
  "/usr/share/texlive/texmf-dist/tex/latex/pdflscape/pdflscape.sty" 1575674318 6575 25396d208d8f2b9395d06ef315d5886c ""
  "/usr/share/texlive/texmf-dist/tex/latex/pdfpages/pdfpages.sty" 1580249532 54071 88f1e37dc9e1f95352061a066ed07263 ""
  "/usr/share/texlive/texmf-dist/tex/latex/pdfpages/ppxetex.def" 1580249532 6351 2eebff10d10cb907cf61cc48072ee72d ""
  "/usr/share/texlive/texmf-dist/tex/latex/pdftexcmds/pdftexcmds.sty" 1574631863 19963 36fd8e818f9f0f32e2db8413d4970122 ""
  "/usr/share/texlive/texmf-dist/tex/latex/refcount/refcount.sty" 1576624809 9878 9e94e8fa600d95f9c7731bb21dfb67a4 ""
  "/usr/share/texlive/texmf-dist/tex/latex/rerunfilecheck/rerunfilecheck.sty" 1575674187 9715 b051d5b493d9fe5f4bc251462d039e5f ""
  "/usr/share/texlive/texmf-dist/tex/latex/siunitx/siunitx-abbreviations.cfg" 1579124948 4745 793d4d5a808c37a7085f620706b56fe1 ""
  "/usr/share/texlive/texmf-dist/tex/latex/siunitx/siunitx.sty" 1579124948 277221 4016d94a4b6827ec1ad2f76abfb692bc ""
  "/usr/share/texlive/texmf-dist/tex/latex/titlesec/titlesec.sty" 1571259403 48596 2b6a95da931c07a430b1a61904aaa42d ""
  "/usr/share/texlive/texmf-dist/tex/latex/tools/array.sty" 1580683321 12560 ce3f59ceae9d9a27bfe037d6bf1d903c ""
  "/usr/share/texlive/texmf-dist/tex/latex/tools/calc.sty" 1580683321 10216 5efd55f2010055e7b7875afd6a75be82 ""
  "/usr/share/texlive/texmf-dist/tex/latex/tools/indentfirst.sty" 1580683321 1619 d4cd7231755dd1dfa89af8ceddfb0e4d ""
  "/usr/share/texlive/texmf-dist/tex/latex/translator/translator-basic-dictionary-English.dict" 1512078926 3435 0a4d096dde3f8fe682c2aedd33b8137d ""
  "/usr/share/texlive/texmf-dist/tex/latex/translator/translator.sty" 1559339174 8691 e154b4b39c7cd1cfa9301a391c44afdd ""
  "/usr/share/texlive/texmf-dist/tex/latex/url/url.sty" 1388531844 12796 8edb7d69a20b857904dd0ea757c14ec9 ""
  "/usr/share/texlive/texmf-dist/tex/latex/xcolor/xcolor.sty" 1463002160 55589 34128738f682d033422ca125f82e5d62 ""
  "/usr/share/texlive/texmf-dist/web2c/texmf.cnf" 1581979058 38841 ce3692aa899bb693b90b87eaa5d4d84e ""
  "/usr/share/texmf/web2c/texmf.cnf" 1581979058 38841 ce3692aa899bb693b90b87eaa5d4d84e ""
  "/var/lib/texmf/web2c/xetex/xelatex.fmt" 1600691230 4645449 c6a6697c572f9127ac6f930bcab6c7c1 ""
  "build/main.aux" 1610915081 4654 ca492d256d9b80b6ef4744e137c50e7d "xelatex"
  "build/main.out" 1610915081 674 8daf476d503eee76477df0b28c3d41af "xelatex"
  "main.tex" 1610915080 16337 5ae282f9fdeaf1107bba7def673556fe ""
  (generated)
  "/home/leonardo/Documentos/Disciplinas/MC920/T5/relatorio/build/main.log"
  "build/main.out"
  "/home/leonardo/Documentos/Disciplinas/MC920/T5/relatorio/build/main.xdv"
  "build/main.xdv"
  "build/main.aux"
  "build/main.log"
