\relax 
\providecommand\hyper@newdestlabel[2]{}
\@nameuse{bbl@beforestart}
\catcode `"\active 
\providecommand\HyperFirstAtBeginDocument{\AtBeginDocument}
\HyperFirstAtBeginDocument{\ifx\hyper@anchor\@undefined
\global\let\oldcontentsline\contentsline
\gdef\contentsline#1#2#3#4{\oldcontentsline{#1}{#2}{#3}}
\global\let\oldnewlabel\newlabel
\gdef\newlabel#1#2{\newlabelxx{#1}#2}
\gdef\newlabelxx#1#2#3#4#5#6{\oldnewlabel{#1}{{#2}{#3}}}
\AtEndDocument{\ifx\hyper@anchor\@undefined
\let\contentsline\oldcontentsline
\let\newlabel\oldnewlabel
\fi}
\fi}
\global\let\hyper@last\relax 
\gdef\HyperFirstAtBeginDocument#1{#1}
\providecommand*\HyPL@Entry[1]{}
\HyPL@Entry{0<</S/D>>}
\babel@aux{portuguese}{}
\@writefile{toc}{\contentsline {section}{\numberline {1}Introdução}{1}{section.1}\protected@file@percent }
\@writefile{toc}{\contentsline {section}{\numberline {2}Execução}{1}{section.2}\protected@file@percent }
\@writefile{lot}{\contentsline {table}{\numberline {1}{\ignorespaces Argumentos do programa \texttt  {transforma.py} e suas descrições.\relax }}{1}{table.caption.1}\protected@file@percent }
\providecommand*\caption@xref[2]{\@setref\relax\@undefined{#1}}
\newlabel{tab:args}{{1}{1}{Argumentos do programa \texttt {transforma.py} e suas descrições.\relax }{table.caption.1}{}}
\newlabel{tab:args@cref}{{[table][1][]1}{[1][1][]1}}
\@writefile{lot}{\contentsline {table}{\numberline {2}{\ignorespaces Métodos de interpolação disponíveis e suas chaves para utilização com \texttt  {--metodo}.\relax }}{1}{table.caption.2}\protected@file@percent }
\newlabel{tab:metodos}{{2}{1}{Métodos de interpolação disponíveis e suas chaves para utilização com \texttt {--metodo}.\relax }{table.caption.2}{}}
\newlabel{tab:metodos@cref}{{[table][2][]2}{[1][1][]1}}
\@writefile{toc}{\contentsline {section}{\numberline {3}Implementação}{2}{section.3}\protected@file@percent }
\@writefile{toc}{\contentsline {subsection}{\numberline {3.1}Transformações Geométricas}{2}{subsection.3.1}\protected@file@percent }
\newlabel{transf}{{(1)}{2}{Transformações Geométricas}{equation.3.1}{}}
\newlabel{transf@cref}{{[equation][1][](1)}{[1][2][]2}}
\@writefile{toc}{\contentsline {subsection}{\numberline {3.2}Métodos de Interpolação}{2}{subsection.3.2}\protected@file@percent }
\@writefile{toc}{\contentsline {section}{\numberline {4}Resultados}{3}{section.4}\protected@file@percent }
\@writefile{toc}{\contentsline {subsection}{\numberline {4.1}Vizinho Mais Próximo}{3}{subsection.4.1}\protected@file@percent }
\@writefile{lof}{\contentsline {figure}{\numberline {1}{\ignorespaces Figura original e rotacionada utilizando o método do vizinho mais próximo.\relax }}{3}{figure.caption.3}\protected@file@percent }
\@writefile{lof}{\contentsline {figure}{\numberline {2}{\ignorespaces Figura original e reduzida utilizando o método do vizinho mais próximo.\relax }}{3}{figure.caption.4}\protected@file@percent }
\@writefile{toc}{\contentsline {subsection}{\numberline {4.2}Interpolação Bilinear}{4}{subsection.4.2}\protected@file@percent }
\@writefile{lof}{\contentsline {figure}{\numberline {3}{\ignorespaces Figura original e transformada utilizando o método da interpolação bilinear.\relax }}{4}{figure.caption.5}\protected@file@percent }
\@writefile{lof}{\contentsline {figure}{\numberline {4}{\ignorespaces Figura original e reduzida utilizando o método da interpolação bilinear.\relax }}{4}{figure.caption.6}\protected@file@percent }
\@writefile{toc}{\contentsline {subsection}{\numberline {4.3}Interpolação Bicúbica}{5}{subsection.4.3}\protected@file@percent }
\@writefile{lof}{\contentsline {figure}{\numberline {5}{\ignorespaces Figura original e rotacionada utilizando o método da interpolação bicúbica.\relax }}{5}{figure.caption.7}\protected@file@percent }
\@writefile{lof}{\contentsline {figure}{\numberline {6}{\ignorespaces Figura original e transformada utilizando o método da interpolação bicúbica.\relax }}{5}{figure.caption.8}\protected@file@percent }
\@writefile{toc}{\contentsline {subsection}{\numberline {4.4}Polinômios de Lagrange}{6}{subsection.4.4}\protected@file@percent }
\@writefile{lof}{\contentsline {figure}{\numberline {7}{\ignorespaces Figura original e transformada utilizando o método dos polinômios de Lagrange.\relax }}{6}{figure.caption.9}\protected@file@percent }
\@writefile{lof}{\contentsline {figure}{\numberline {8}{\ignorespaces Figura original e transformada utilizando o método dos polinômios de Lagrange.\relax }}{6}{figure.caption.10}\protected@file@percent }
\@writefile{toc}{\contentsline {section}{\numberline {5}Conclusão}{7}{section.5}\protected@file@percent }
