\relax 
\providecommand\hyper@newdestlabel[2]{}
\@nameuse{bbl@beforestart}
\catcode `"\active 
\providecommand\HyperFirstAtBeginDocument{\AtBeginDocument}
\HyperFirstAtBeginDocument{\ifx\hyper@anchor\@undefined
\global\let\oldcontentsline\contentsline
\gdef\contentsline#1#2#3#4{\oldcontentsline{#1}{#2}{#3}}
\global\let\oldnewlabel\newlabel
\gdef\newlabel#1#2{\newlabelxx{#1}#2}
\gdef\newlabelxx#1#2#3#4#5#6{\oldnewlabel{#1}{{#2}{#3}}}
\AtEndDocument{\ifx\hyper@anchor\@undefined
\let\contentsline\oldcontentsline
\let\newlabel\oldnewlabel
\fi}
\fi}
\global\let\hyper@last\relax 
\gdef\HyperFirstAtBeginDocument#1{#1}
\providecommand*\HyPL@Entry[1]{}
\HyPL@Entry{0<</S/D>>}
\babel@aux{portuguese}{}
\@writefile{toc}{\contentsline {section}{\numberline {1}Introdução}{1}{section.1}\protected@file@percent }
\@writefile{toc}{\contentsline {section}{\numberline {2}Execução}{1}{section.2}\protected@file@percent }
\@writefile{lot}{\contentsline {table}{\numberline {1}{\ignorespaces Argumentos do programa \texttt  {codificar.py} e suas descrições.\relax }}{1}{table.caption.1}\protected@file@percent }
\providecommand*\caption@xref[2]{\@setref\relax\@undefined{#1}}
\newlabel{tab:cod}{{1}{1}{Argumentos do programa \texttt {codificar.py} e suas descrições.\relax }{table.caption.1}{}}
\newlabel{tab:cod@cref}{{[table][1][]1}{[1][1][]1}}
\@writefile{lot}{\contentsline {table}{\numberline {2}{\ignorespaces Argumentos do programa \texttt  {decodificar.py} e suas descrições.\relax }}{1}{table.caption.2}\protected@file@percent }
\newlabel{tab:decod}{{2}{1}{Argumentos do programa \texttt {decodificar.py} e suas descrições.\relax }{table.caption.2}{}}
\newlabel{tab:decod@cref}{{[table][2][]2}{[1][1][]1}}
\@writefile{toc}{\contentsline {section}{\numberline {3}Implementação}{2}{section.3}\protected@file@percent }
\@writefile{toc}{\contentsline {subsection}{\numberline {3.1}Codificação}{2}{subsection.3.1}\protected@file@percent }
\@writefile{toc}{\contentsline {subsection}{\numberline {3.2}Decodificação}{2}{subsection.3.2}\protected@file@percent }
\@writefile{toc}{\contentsline {section}{\numberline {4}Imagens de Entrada}{3}{section.4}\protected@file@percent }
\@writefile{toc}{\contentsline {section}{\numberline {5}Resultados}{4}{section.5}\protected@file@percent }
\@writefile{toc}{\contentsline {section}{\numberline {6}Conclusão}{4}{section.6}\protected@file@percent }
