\relax 
\providecommand\hyper@newdestlabel[2]{}
\@nameuse{bbl@beforestart}
\catcode `"\active 
\providecommand\HyperFirstAtBeginDocument{\AtBeginDocument}
\HyperFirstAtBeginDocument{\ifx\hyper@anchor\@undefined
\global\let\oldcontentsline\contentsline
\gdef\contentsline#1#2#3#4{\oldcontentsline{#1}{#2}{#3}}
\global\let\oldnewlabel\newlabel
\gdef\newlabel#1#2{\newlabelxx{#1}#2}
\gdef\newlabelxx#1#2#3#4#5#6{\oldnewlabel{#1}{{#2}{#3}}}
\AtEndDocument{\ifx\hyper@anchor\@undefined
\let\contentsline\oldcontentsline
\let\newlabel\oldnewlabel
\fi}
\fi}
\global\let\hyper@last\relax 
\gdef\HyperFirstAtBeginDocument#1{#1}
\providecommand*\HyPL@Entry[1]{}
\HyPL@Entry{0<</S/D>>}
\babel@aux{portuguese}{}
\@writefile{toc}{\contentsline {section}{\numberline {1}Introdução}{1}{section.1}\protected@file@percent }
\newlabel{sec:exec}{{2}{1}{Execução \label {sec:exec}}{section.2}{}}
\newlabel{sec:exec@cref}{{[section][2][]2}{[1][1][]1}}
\@writefile{toc}{\contentsline {section}{\numberline {2}Execução }{1}{section.2}\protected@file@percent }
\@writefile{lot}{\contentsline {table}{\numberline {1}{\ignorespaces Tabela com os argumentos do programa \texttt  {quantiza.py} e suas descrições.\relax }}{1}{table.caption.1}\protected@file@percent }
\providecommand*\caption@xref[2]{\@setref\relax\@undefined{#1}}
\newlabel{tab:args}{{1}{1}{Tabela com os argumentos do programa \texttt {quantiza.py} e suas descrições.\relax }{table.caption.1}{}}
\newlabel{tab:args@cref}{{[table][1][]1}{[1][1][]1}}
\@writefile{toc}{\contentsline {section}{\numberline {3}Implementação}{1}{section.3}\protected@file@percent }
\@writefile{toc}{\contentsline {subsection}{\numberline {3.1}Entrada e Saída}{1}{subsection.3.1}\protected@file@percent }
\@writefile{toc}{\contentsline {subsection}{\numberline {3.2}Distribuições de Erro}{1}{subsection.3.2}\protected@file@percent }
\@writefile{toc}{\contentsline {subsection}{\numberline {3.3}Quantização e Difusão de Erro}{2}{subsection.3.3}\protected@file@percent }
\@writefile{toc}{\contentsline {subsection}{\numberline {3.4}Formas de Varredura}{2}{subsection.3.4}\protected@file@percent }
\@writefile{toc}{\contentsline {section}{\numberline {4}Imagens de Entrada}{2}{section.4}\protected@file@percent }
\@writefile{lof}{\contentsline {figure}{\numberline {1}{\ignorespaces Imagens utilizadas com entrada no trabalho.\relax }}{2}{figure.caption.2}\protected@file@percent }
\newlabel{fig:entrada}{{1}{2}{Imagens utilizadas com entrada no trabalho.\relax }{figure.caption.2}{}}
\newlabel{fig:entrada@cref}{{[figure][1][]1}{[1][2][]2}}
\@writefile{toc}{\contentsline {section}{\numberline {5}Resultados}{3}{section.5}\protected@file@percent }
\@writefile{lof}{\contentsline {figure}{\numberline {2}{\ignorespaces Esquema de cores RGB binário e suas 8 combinações possíveis.\relax }}{3}{figure.caption.3}\protected@file@percent }
\newlabel{fig:pixels}{{2}{3}{Esquema de cores RGB binário e suas 8 combinações possíveis.\relax }{figure.caption.3}{}}
\newlabel{fig:pixels@cref}{{[figure][2][]2}{[1][2][]3}}
\@writefile{toc}{\contentsline {subsection}{\numberline {5.1}Quantização sem Difusão de Erros}{3}{subsection.5.1}\protected@file@percent }
\@writefile{lof}{\contentsline {figure}{\numberline {3}{\ignorespaces Imagens quantizadas sem difusão de erro.\relax }}{3}{figure.caption.4}\protected@file@percent }
\newlabel{fig:vazio}{{3}{3}{Imagens quantizadas sem difusão de erro.\relax }{figure.caption.4}{}}
\newlabel{fig:vazio@cref}{{[figure][3][]3}{[1][3][]3}}
\@writefile{toc}{\contentsline {subsection}{\numberline {5.2}Formas de Varredura}{4}{subsection.5.2}\protected@file@percent }
\@writefile{lof}{\contentsline {figure}{\numberline {4}{\ignorespaces Comparação entre as formas de varredura para as imagens com a distribuição de erros de Floyd e Steinberg.\relax }}{4}{figure.caption.5}\protected@file@percent }
\newlabel{fig:varredura}{{4}{4}{Comparação entre as formas de varredura para as imagens com a distribuição de erros de Floyd e Steinberg.\relax }{figure.caption.5}{}}
\newlabel{fig:varredura@cref}{{[figure][4][]4}{[1][4][]4}}
\@writefile{toc}{\contentsline {subsection}{\numberline {5.3}Diferentes Distribuições de Erro}{5}{subsection.5.3}\protected@file@percent }
\@writefile{lof}{\contentsline {figure}{\numberline {5}{\ignorespaces Imagem \texttt  {peppers.png} quantizada com as diferentes distribuições de erro.\relax }}{5}{figure.caption.6}\protected@file@percent }
\newlabel{fig:distrib}{{5}{5}{Imagem \texttt {peppers.png} quantizada com as diferentes distribuições de erro.\relax }{figure.caption.6}{}}
\newlabel{fig:distrib@cref}{{[figure][5][]5}{[1][5][]5}}
\@writefile{toc}{\contentsline {section}{\numberline {6}Conclusão}{6}{section.6}\protected@file@percent }
