\relax 
\@nameuse{bbl@beforestart}
\catcode `"\active 
\babel@aux{portuguese}{}
\@writefile{toc}{\contentsline {section}{\numberline {1}Introdução}{1}\protected@file@percent }
\@writefile{toc}{\contentsline {section}{\numberline {2}Implementação}{1}\protected@file@percent }
\@writefile{toc}{\contentsline {section}{\numberline {3}Resultados}{1}\protected@file@percent }
