<svg width="24" height="24" viewBox="0 0 24 24" fill="none" xmlns="http://www.w3.org/2000/svg">
<path fill-rule="evenodd" clip-rule="evenodd" d="M4 5C4 3.89543 4.89543 3 6 3H17C18.6569 3 20 4.34315 20 6V18C20 19.6569 18.6569 21 17 21H10V22C10 22.5523 9.55228 23 9 23C8.44772 23 8 22.5523 8 22V21H6C4.89543 21 4 20.1046 4 19V5ZM10 19H17C17.5523 19 18 18.5523 18 18V6C18 5.44772 17.5523 5 17 5H10V19ZM8 5V19H6V5H8ZM12 8C12 7.44772 12.4477 7 13 7H15C15.5523 7 16 7.44772 16 8C16 8.55228 15.5523 9 15 9H13C12.4477 9 12 8.55228 12 8ZM12 12C12 11.4477 12.4477 11 13 11H15C15.5523 11 16 11.4477 16 12C16 12.5523 15.5523 13 15 13H13C12.4477 13 12 12.5523 12 12Z" fill="#223C61"/>
</svg>
