<svg width="48" height="48" viewBox="0 0 48 48" fill="none" xmlns="http://www.w3.org/2000/svg">
<path d="M7 29H12.77C13.31 29 13.74 28.57 13.76 28.04L13.88 27.52C13.96 27.18 14.13 26.87 14.37 26.62L14.98 26.01C14.98 26.01 15.99 25.45 15.99 24.06V20C15.99 19.45 15.54 19 14.99 19H7C6.87 19 6.74 19.03 6.62 19.08C6.38 19.18 6.18 19.38 6.08 19.62C6.03 19.74 6 19.87 6 20V28C6 28.55 6.45 29 7 29ZM14 21V25.59L9.41 21H14ZM12.42 26.83C12.49 26.9 12.58 26.95 12.66 26.99H7.99V22.4L12.42 26.83Z" fill="#223C61"/>
<path d="M35.2 10.44C34.91 10.15 34.52 10 34.13 10C33.74 10 33.36 10.15 33.06 10.44L15.87 27.68C15.66 27.89 15.52 28.15 15.46 28.43L14.71 32H7C6.45 32 6 32.45 6 33V41C6 41.55 6.45 42 7 42H15C15.55 42 16 41.55 16 41V40H8V34H14.29L13.54 37.56C13.45 38.04 13.82 38.46 14.28 38.46C14.33 38.46 14.38 38.46 14.43 38.45L23.57 36.56C23.87 36.5 24.15 36.35 24.37 36.13L41.57 18.93C42.16 18.34 42.16 17.39 41.57 16.81L35.2 10.44ZM34.29 12.12L36.38 14.21L20.85 29.74L18.76 27.65L34.29 12.12ZM18.88 35.54L16.45 33.11L17.39 28.98L17.37 28.96L23.03 34.61L18.87 35.54H18.88ZM24.46 33.35L22.26 31.15L37.79 15.62L39.99 17.82L24.46 33.35Z" fill="#223C61"/>
<path d="M7 16H15C15.55 16 16 15.55 16 15V7C16 6.45 15.55 6 15 6H7C6.45 6 6 6.45 6 7V15C6 15.55 6.45 16 7 16ZM14 8V12.59L9.41 8H14ZM8 9.41L12.59 14H8V9.41Z" fill="#223C61"/>
</svg>
