<svg width="24" height="24" viewBox="0 0 24 24" fill="none" xmlns="http://www.w3.org/2000/svg">
<path fill-rule="evenodd" clip-rule="evenodd" d="M9 4C7.34315 4 6 5.34315 6 7C6 8.65685 7.34315 10 9 10C10.6569 10 12 8.65685 12 7C12 5.34315 10.6569 4 9 4ZM4 7C4 4.23858 6.23858 2 9 2C11.7614 2 14 4.23858 14 7C14 9.76142 11.7614 12 9 12C6.23858 12 4 9.76142 4 7ZM15.0312 2.88196C15.1682 2.34694 15.713 2.02426 16.248 2.16125C18.4604 2.72771 20.0078 4.72124 20.0078 7.005C20.0078 9.28876 18.4604 11.2823 16.248 11.8488C15.713 11.9857 15.1682 11.6631 15.0312 11.128C14.8943 10.593 15.2169 10.0482 15.752 9.91125C17.0794 9.57137 18.0078 8.37526 18.0078 7.005C18.0078 5.63474 17.0794 4.43863 15.752 4.09875C15.2169 3.96176 14.8943 3.41699 15.0312 2.88196ZM7 16C5.34315 16 4 17.3431 4 19V21C4 21.5523 3.55228 22 3 22C2.44772 22 2 21.5523 2 21V19C2 16.2386 4.23858 14 7 14H11C13.7614 14 16 16.2386 16 19V21C16 21.5523 15.5523 22 15 22C14.4477 22 14 21.5523 14 21V19C14 17.3431 12.6569 16 11 16H7ZM17.0317 14.9C17.1698 14.3653 17.7152 14.0437 18.25 14.1817C20.4473 14.749 21.9869 16.725 22 18.9943L22 19L22 21C22 21.5523 21.5523 22 21 22C20.4477 22 20 21.5523 20 21V19.003C19.9909 17.6426 19.0675 16.4584 17.75 16.1182C17.2153 15.9802 16.8937 15.4348 17.0317 14.9Z" fill="#223C61"/>
</svg>
