<svg width="48" height="48" viewBox="0 0 48 48" fill="none" xmlns="http://www.w3.org/2000/svg">
<path d="M40 35.93H37.52L36.43 32.93H38C38.55 32.93 39 32.48 39 31.93C39 31.38 38.55 30.93 38 30.93H27C26.45 30.93 26 31.38 26 31.93C26 32.48 26.45 32.93 27 32.93H28.57L27.48 35.93H25C24.45 35.93 24 36.38 24 36.93C24 37.48 24.45 37.93 25 37.93H26.75L25.78 40.59C25.54 41.24 26.03 41.93 26.72 41.93C27.14 41.93 27.51 41.67 27.66 41.27L28.88 37.93H36.12L37.34 41.27C37.48 41.66 37.86 41.93 38.28 41.93C38.97 41.93 39.45 41.24 39.22 40.59L38.25 37.93H40C40.55 37.93 41 37.48 41 36.93C41 36.38 40.55 35.93 40 35.93ZM29.61 35.93L30.7 32.93H34.3L35.39 35.93H29.61ZM25.46 28.15C26.18 26.98 26.46 25.63 26.28 24.29C26.57 24 26.82 23.68 27.05 23.34C27.91 22.01 28.2 20.43 27.86 18.88C27.58 17.62 26.91 16.5 25.94 15.67C26.73 13.62 26.31 11.28 24.8 9.62C23.78 8.5 22.35 7.81 20.81 7.68C19.83 6.6 18.46 6 16.99 6C15.52 6 14.16 6.6 13.18 7.67C12.31 7.74 11.46 7.98 10.71 8.4C9.29999 9.18 8.28999 10.45 7.86999 11.99C7.52999 13.22 7.58999 14.5 8.03999 15.67C7.79999 15.87 7.57999 16.1 7.37999 16.34C6.34999 17.56 5.86999 19.09 6.00999 20.67C6.13999 22.05 6.72999 23.32 7.69999 24.29C7.67999 24.43 7.66999 24.58 7.65999 24.72C7.56999 26.29 8.08999 27.8 9.13999 28.98C10.21 30.18 11.68 30.89 13.33 30.99H15.99V41C15.99 41.55 16.44 42 16.99 42C17.54 42 17.99 41.55 17.99 41V31H20.32C20.79 31 21.25 30.95 21.71 30.84C23.28 30.47 24.61 29.52 25.45 28.15H25.46ZM24.22 24.17C24.46 25.18 24.3 26.22 23.75 27.11C23.19 28.02 22.31 28.65 21.25 28.9C20.95 28.97 20.63 29.01 20.32 29.01H17.99V23.42L20.7 20.71C21.09 20.32 21.09 19.69 20.7 19.3C20.31 18.91 19.68 18.91 19.29 19.3L18 20.59V16C18 15.45 17.55 15 17 15C16.45 15 16 15.45 16 16V23.58L14.71 22.29C14.32 21.9 13.69 21.9 13.3 22.29C12.91 22.68 12.91 23.31 13.3 23.7L16.01 26.41V29.01H13.71H13.45C12.37 28.95 11.38 28.47 10.67 27.67C9.97999 26.89 9.62999 25.89 9.68999 24.86C9.69999 24.63 9.73999 24.41 9.78999 24.18L9.93999 23.57L9.45999 23.17C8.63999 22.5 8.13999 21.55 8.03999 20.51C7.94999 19.47 8.26999 18.45 8.94999 17.65C9.20999 17.34 9.51999 17.07 9.86999 16.85L10.68 16.34L10.21 15.51C9.68999 14.6 9.55999 13.55 9.83999 12.55C10.12 11.53 10.8 10.69 11.73 10.17C12.31 9.85 12.99 9.67 13.69 9.67H14.2L14.5 9.27C15.11 8.47 16.03 8.01 17.03 8.01C18.03 8.01 18.96 8.47 19.57 9.28L19.87 9.68H20.37C21.54 9.68 22.6 10.14 23.36 10.98C24.49 12.23 24.7 14.05 23.86 15.51L23.39 16.34L24.2 16.85C25.1 17.42 25.72 18.3 25.95 19.33C26.17 20.35 25.98 21.39 25.41 22.27C25.19 22.61 24.92 22.92 24.6 23.17L24.11 23.57L24.26 24.18L24.22 24.17Z" fill="#223C61"/>
</svg>
