<svg width="24" height="24" viewBox="0 0 24 24" fill="none" xmlns="http://www.w3.org/2000/svg">
<path fill-rule="evenodd" clip-rule="evenodd" d="M5 6.27174C6.95414 3.93883 10.0027 2.68488 13.1416 3.0899C17.211 3.61498 20.4257 6.79841 20.9905 10.8625C21.0665 11.4095 20.6847 11.9146 20.1376 11.9906C19.5906 12.0666 19.0855 11.6848 19.0095 11.1378C18.5689 7.96691 16.0607 5.48314 12.8857 5.07346C10.2443 4.73263 7.68498 5.89744 6.19044 8.00013H8C8.55229 8.00013 9 8.44784 9 9.00013C9 9.55241 8.55229 10.0001 8 10.0001H4.52237C4.50722 10.0005 4.49203 10.0005 4.47682 10.0001H4C3.44772 10.0001 3 9.55241 3 9.00013V5.00013C3 4.44784 3.44772 4.00013 4 4.00013C4.55229 4.00013 5 4.44784 5 5.00013V6.27174ZM3.86235 12.0096C4.40938 11.9336 4.91446 12.3155 4.99048 12.8625C5.43114 16.0333 7.93929 18.5171 11.1143 18.9268C13.7557 19.2676 16.315 18.1028 17.8096 16.0001H16C15.4477 16.0001 15 15.5524 15 15.0001C15 14.4478 15.4477 14.0001 16 14.0001H19.4776C19.4928 13.9998 19.508 13.9998 19.5232 14.0001H20C20.5523 14.0001 21 14.4478 21 15.0001V19.0001C21 19.5524 20.5523 20.0001 20 20.0001C19.4477 20.0001 19 19.5524 19 19.0001V17.7285C17.0459 20.0614 13.9973 21.3154 10.8584 20.9104C6.78898 20.3853 3.57431 17.2018 3.00952 13.1378C2.9335 12.5907 3.31532 12.0857 3.86235 12.0096Z" fill="#223C61"/>
</svg>
