<svg width="48" height="48" viewBox="0 0 48 48" fill="none" xmlns="http://www.w3.org/2000/svg">
<path d="M28 29.05H33C33.55 29.05 34 29.5 34 30.05C34 30.6 33.55 31.05 33 31.05H28C27.45 31.05 27 30.6 27 30.05C27 29.5 27.45 29.05 28 29.05ZM42 16V32.01C42 34.22 40.21 36.01 38 36.01H10C7.79 36.01 6 34.22 6 32.01V15.93C6 13.76 7.76 12 9.93 12H38C40.21 12 42 13.79 42 16ZM40 16C40 14.9 39.1 14 38 14H25V16C25 16.55 24.55 17 24 17C23.45 17 23 16.56 23 16V13.99H9.93C8.86 13.99 8 14.85 8 15.92V32C8 33.1 8.9 34 10 34H38C39.1 34 40 33.1 40 32V16ZM28 26.05H35C35.55 26.05 36 25.6 36 25.05C36 24.5 35.55 24.05 35 24.05H28C27.45 24.05 27 24.5 27 25.05C27 25.6 27.45 26.05 28 26.05ZM28 21.05H35C35.55 21.05 36 20.6 36 20.05C36 19.5 35.55 19.05 35 19.05H28C27.45 19.05 27 19.5 27 20.05C27 20.6 27.45 21.05 28 21.05ZM12.04 21C12.04 18.79 13.83 17 16.04 17C18.25 17 20.04 18.79 20.04 21C20.04 23.21 18.25 25 16.04 25C13.83 25 12.04 23.21 12.04 21ZM14.04 21C14.04 22.1 14.94 23 16.04 23C17.14 23 18.04 22.1 18.04 21C18.04 19.9 17.14 19 16.04 19C14.94 19 14.04 19.9 14.04 21ZM19.04 26H12.98C11.31 26 10 27.27 10 28.83V30.01C10 30.55 10.43 30.99 10.97 31C10.98 31 10.99 31 11 31C11.55 31 12 30.56 12 30.01V28.99C12 28.44 12.44 28 12.99 28H19.04C19.59 28 20.03 28.44 20.03 28.99V30.02C20.03 30.56 20.47 31.01 21.02 31.01H21.05C21.59 31.01 22.04 30.57 22.04 30.02V28.55C21.89 27.12 20.62 26 19.05 26H19.04Z" fill="#223C61"/>
</svg>
