<svg width="24" height="24" viewBox="0 0 24 24" fill="none" xmlns="http://www.w3.org/2000/svg">
<path fill-rule="evenodd" clip-rule="evenodd" d="M12 4C7.58172 4 4 7.58172 4 12C4 16.4183 7.58172 20 12 20C16.4183 20 20 16.4183 20 12C20 7.58172 16.4183 4 12 4ZM2 12C2 6.47715 6.47715 2 12 2C17.5228 2 22 6.47715 22 12C22 17.5228 17.5228 22 12 22C6.47715 22 2 17.5228 2 12ZM8 10C8 9.44772 8.44772 9 9 9H9.01C9.56228 9 10.01 9.44772 10.01 10C10.01 10.5523 9.56228 11 9.01 11H9C8.44772 11 8 10.5523 8 10ZM14 10C14 9.44772 14.4477 9 15 9H15.01C15.5623 9 16.01 9.44772 16.01 10C16.01 10.5523 15.5623 11 15.01 11H15C14.4477 11 14 10.5523 14 10ZM8.80015 14.2857C9.19463 13.8992 9.82777 13.9057 10.2143 14.3001C10.6845 14.7801 11.3281 15.0505 12 15.0505C12.6719 15.0505 13.3155 14.7801 13.7857 14.3001C14.1722 13.9057 14.8054 13.8992 15.1999 14.2857C15.5943 14.6722 15.6008 15.3054 15.2143 15.6999C14.3679 16.5637 13.2094 17.0505 12 17.0505C10.7906 17.0505 9.63211 16.5637 8.78571 15.6999C8.3992 15.3054 8.40566 14.6722 8.80015 14.2857Z" fill="#223C61"/>
</svg>
