<svg width="48" height="48" viewBox="0 0 48 48" fill="none" xmlns="http://www.w3.org/2000/svg">
<path d="M25 14.0098H30V17.0098H25V14.0098ZM18 14.0098H23V17.0098H18V14.0098ZM23 25.0098V22.9898L22.33 20.7998C22.18 20.3298 21.78 20.0198 21.33 20.0198H17.68C17.23 20.0198 16.82 20.3398 16.68 20.8098L16 22.9998V25.0198C16 25.5698 16.45 26.0198 17 26.0198C17.55 26.0198 18 25.5698 18 25.0198H21C21 25.5698 21.45 26.0198 22 26.0198C22.55 26.0198 23 25.5698 23 25.0198V25.0098ZM17.46 23.0098L17.99 21.4398H20.99L21.52 23.0098H17.46ZM32 25.0098V22.9898L31.33 20.7998C31.18 20.3298 30.78 20.0198 30.33 20.0198H26.68C26.23 20.0198 25.82 20.3398 25.68 20.8098L25 22.9998V25.0198C25 25.5698 25.45 26.0198 26 26.0198C26.55 26.0198 27 25.5698 27 25.0198H30C30 25.5698 30.45 26.0198 31 26.0198C31.55 26.0198 32 25.5698 32 25.0198V25.0098ZM26.46 23.0098L26.99 21.4398H29.99L30.52 23.0098H26.46ZM41.45 36.7798C41.79 36.9398 41.99 37.2998 41.99 37.6698V37.7798C41.99 38.4998 41.25 38.9998 40.6 38.6998C40.38 38.5998 40.16 38.4998 39.93 38.4098C39.29 38.1598 38.66 38.0398 38.02 38.0398C37.1 38.0398 36.2 38.2898 35.33 38.7598C33.89 39.5298 32.38 39.9598 30.86 39.9598C29.59 39.9598 28.31 39.6598 27.07 38.9998C26.08 38.4698 25.08 38.0198 23.96 38.0198C23.8 38.0198 23.63 38.0198 23.46 38.0498C22.21 38.1998 21.29 38.8898 20.17 39.3498C19.14 39.7798 18.06 40.0098 16.97 40.0098C16.37 40.0098 15.76 39.9398 15.16 39.7998C14 39.5198 13.07 38.8998 11.99 38.4498C11.34 38.1798 10.75 38.0798 10.19 38.0798C9.19001 38.0798 8.30001 38.4198 7.38001 38.8198C6.72001 39.1098 5.98001 38.6198 5.98001 37.8998V37.7198C5.98001 37.3398 6.19001 36.9798 6.54001 36.8198C6.95001 36.6298 7.36001 36.4598 7.80001 36.3398C8.52001 36.1398 9.25001 36.0398 9.98001 36.0398C11.06 36.0398 12.14 36.2598 13.16 36.6898C14.36 37.1898 15.35 37.9298 16.71 38.0198C16.79 38.0198 16.88 38.0198 16.96 38.0198C18.25 38.0198 19.25 37.4098 20.39 36.8698C21.53 36.3298 22.76 36.0298 24.01 36.0298C24.56 36.0298 25.11 36.0898 25.66 36.2098C26.98 36.4998 28 37.2398 29.23 37.6898C29.81 37.8998 30.38 37.9998 30.95 37.9998C31.89 37.9998 32.81 37.7298 33.69 37.2598C35.09 36.5098 36.63 36.0798 38.16 36.0798C39.28 36.0798 40.4 36.3098 41.46 36.8098L41.45 36.7798ZM37.75 27.0098H36.3L35.01 19.0098H36C36.56 19.0098 37.01 18.5598 37 17.9998C37 17.4498 36.55 17.0098 36 17.0098H31.99V13.0098C31.99 12.4598 31.54 12.0098 30.99 12.0098H28.99V10.0098H29.99C30.54 10.0098 30.99 9.55977 30.99 9.00977C30.99 8.45977 30.54 8.00977 29.99 8.00977H25.99C25.44 8.00977 24.99 8.45977 24.99 9.00977C24.99 9.55977 25.44 10.0098 25.99 10.0098H26.99V12.0098H16.99C16.44 12.0098 15.99 12.4598 15.99 13.0098V17.0098H11.99C11.44 17.0098 10.99 17.4598 10.99 18.0098C10.99 18.5598 11.44 19.0098 11.99 19.0098H12.96L11.72 27.0098H10.31C9.66001 27.0098 9.18001 27.6198 9.34001 28.2498L10.5 33.9098C10.6 34.2898 10.92 34.5498 11.31 34.5998C11.33 34.5998 11.34 34.5998 11.36 34.5998C12.01 34.6798 12.56 34.1098 12.4 33.4698L11.56 28.9998H36.43L35.54 33.4498C35.37 34.0998 35.93 34.6798 36.59 34.5898C36.65 34.5898 36.71 34.5698 36.76 34.5698C37.14 34.5198 37.46 34.2598 37.56 33.8798L38.72 28.2498C38.88 27.6198 38.4 27.0098 37.75 27.0098ZM15 19.0098H33L34.29 27.0098H13.76L15 19.0098Z" fill="#223C61"/>
</svg>
