<svg width="24" height="24" viewBox="0 0 24 24" fill="none" xmlns="http://www.w3.org/2000/svg">
<path fill-rule="evenodd" clip-rule="evenodd" d="M5 6C5 4.89543 5.89543 4 7 4H9C10.1046 4 11 4.89543 11 6V18C11 19.1046 10.1046 20 9 20H7C5.89543 20 5 19.1046 5 18V6ZM9 6L7 6V18H9V6Z" fill="#223C61"/>
<path fill-rule="evenodd" clip-rule="evenodd" d="M13 6C13 4.89543 13.8954 4 15 4H17C18.1046 4 19 4.89543 19 6V18C19 19.1046 18.1046 20 17 20H15C13.8954 20 13 19.1046 13 18V6ZM17 6L15 6V18H17V6Z" fill="#223C61"/>
</svg>
