<svg width="24" height="24" viewBox="0 0 24 24" fill="none" xmlns="http://www.w3.org/2000/svg">
<path fill-rule="evenodd" clip-rule="evenodd" d="M20.7071 3.29289C21.0976 3.68342 21.0976 4.31658 20.7071 4.70711L16.4142 9H18C18.5523 9 19 9.44772 19 10C19 10.5523 18.5523 11 18 11H14C13.4477 11 13 10.5523 13 10V6C13 5.44772 13.4477 5 14 5C14.5523 5 15 5.44772 15 6V7.58579L19.2929 3.29289C19.6834 2.90237 20.3166 2.90237 20.7071 3.29289ZM5 14C5 13.4477 5.44772 13 6 13H10C10.5523 13 11 13.4477 11 14V18C11 18.5523 10.5523 19 10 19C9.44772 19 9 18.5523 9 18V16.4142L4.70711 20.7071C4.31658 21.0976 3.68342 21.0976 3.29289 20.7071C2.90237 20.3166 2.90237 19.6834 3.29289 19.2929L7.58579 15H6C5.44772 15 5 14.5523 5 14Z" fill="#223C61"/>
</svg>
