<svg width="24" height="24" viewBox="0 0 24 24" fill="none" xmlns="http://www.w3.org/2000/svg">
<path fill-rule="evenodd" clip-rule="evenodd" d="M2 6C2 5.44772 2.44772 5 3 5H11C14.4608 5 17.1952 5.81597 19.0902 7.25169C21.0072 8.70418 22 10.7473 22 13C22 14.6569 20.6569 16 19 16H3C2.44772 16 2 15.5523 2 15C2 14.8179 2.0487 14.6471 2.13378 14.5C2.0487 14.3529 2 14.1821 2 14V6ZM4 12V14H19C19.5523 14 20 13.5523 20 13C20 12.6588 19.9692 12.3248 19.9072 12H4ZM7 10H4V7H7V10ZM9 10H12V7.02595C11.6772 7.00882 11.3439 7 11 7H9V10ZM14 7.25821V10H19.0333C18.7249 9.58097 18.3417 9.19382 17.8823 8.84581C16.9416 8.13301 15.6553 7.5671 14 7.25821ZM2 19C2 18.4477 2.44772 18 3 18H21C21.5523 18 22 18.4477 22 19C22 19.5523 21.5523 20 21 20H3C2.44772 20 2 19.5523 2 19Z" fill="#223C61"/>
</svg>
