<svg width="48" height="48" viewBox="0 0 48 48" fill="none" xmlns="http://www.w3.org/2000/svg">
<path d="M15 21.02C15 20.48 15.44 20.04 15.98 20.04L28.02 20C28.56 20 29 20.44 29 20.98C29 21.52 28.56 21.96 28.02 21.96L15.98 22C15.44 22 15 21.56 15 21.02ZM15.98 18H28.02C28.56 18 29 17.56 29 17.02V16.98C29 16.44 28.56 16 28.02 16H15.98C15.44 16 15 16.44 15 16.98V17.02C15 17.56 15.44 18 15.98 18ZM39 7.97V36C39 37.1 38.1 38 37 38H35V40.02C35 41.11 34.11 42 33.02 42H19.41C19.14 42 18.89 41.89 18.7 41.71L9.29 32.3C9.1 32.11 9 31.86 9 31.59V11.97C9 10.88 9.88 10 10.97 10H13V8C13 6.9 13.89 6 15 6H37.03C38.12 6 39 6.88 39 7.97ZM19 32H11.87L19 39.13V32ZM33 12H11V30H19.02C20.11 30 21 30.89 21 31.98V40H33V12ZM35 11.97V36H37V8H15V10H33.03C34.12 10 35 10.88 35 11.97ZM15.98 26H22C22.55 26 23 25.55 23 25C23 24.45 22.55 24 22 24H15.98C15.44 24 15 24.44 15 24.98V25.02C15 25.56 15.44 26 15.98 26Z" fill="#223C61"/>
</svg>
