<svg width="48" height="48" viewBox="0 0 48 48" fill="none" xmlns="http://www.w3.org/2000/svg">
<path d="M42.01 20.47C42.01 17.98 39.99 15.97 37.51 15.97L30.01 16V12.5C30.01 10.01 28 8 25.51 8H10.5C8.01 8 6 10.01 6 12.5V21.43C6 23.76 7.74 25.69 10 25.98L10.03 29.87C10.03 30.72 11.04 31.18 11.68 30.62L17.02 26.01H25.5C27.99 26.01 30 24 30 21.51V18.01L37.5 17.98C38.88 17.98 40 19.1 40 20.48V29.41C40 30.71 39.04 31.81 37.75 31.97L36.01 32L35.99 35.66L31.72 31.98H22.5C21.12 31.98 20 30.86 20 29.48V29.01C20 28.46 19.55 28.01 19 28.01C18.45 28.01 18 28.46 18 29.01V29.48C18 31.97 20.01 33.98 22.5 33.98H30.98L36.32 38.59C36.97 39.15 37.97 38.69 37.97 37.84L38 33.95C40.26 33.66 42 31.74 42 29.4V20.47H42.01ZM28 21.5C28 22.88 26.88 24 25.5 24H16.28L15.72 24.49L12.02 27.69V25.97L12 24.22L10.26 24C8.97 23.84 8 22.73 8 21.44V12.5C8 11.12 9.13 10 10.5 10H25.5C26.88 10 28 11.12 28 12.5V21.5Z" fill="#223C61"/>
</svg>
