<svg width="24" height="24" viewBox="0 0 24 24" fill="none" xmlns="http://www.w3.org/2000/svg">
<path fill-rule="evenodd" clip-rule="evenodd" d="M1 17C1 10.9247 5.92472 6 12 6C18.0753 6 23 10.9247 23 17C23 17.5523 22.5523 18 22 18C21.4477 18 21 17.5523 21 17C21 12.0293 16.9707 8 12 8C7.02928 8 3 12.0293 3 17C3 17.5523 2.55228 18 2 18C1.44772 18 1 17.5523 1 17ZM5 17C5 13.134 8.13401 10 12 10C15.866 10 19 13.134 19 17C19 17.5523 18.5523 18 18 18C17.4477 18 17 17.5523 17 17C17 14.2386 14.7614 12 12 12C9.23858 12 7 14.2386 7 17C7 17.5523 6.55228 18 6 18C5.44772 18 5 17.5523 5 17ZM9 17C9 15.3431 10.3431 14 12 14C13.6569 14 15 15.3431 15 17C15 17.5523 14.5523 18 14 18C13.4477 18 13 17.5523 13 17C13 16.4477 12.5523 16 12 16C11.4477 16 11 16.4477 11 17C11 17.5523 10.5523 18 10 18C9.44772 18 9 17.5523 9 17Z" fill="#223C61"/>
</svg>
