{
  "utrecht": {
    "button-group": {
      "background-color": {
        "value": "transparent",
        "type": "color"
      },
      "column-gap": {
        "value": "{voorbeeld.space.column.snail}",
        "type": "spacing"
      },
      "margin-block-end": {
        "value": "0px",
        "type": "spacing"
      },
      "margin-block-start": {
        "value": "0px",
        "type": "spacing"
      },
      "padding-block-end": {
        "value": "0px",
        "type": "spacing"
      },
      "padding-block-start": {
        "value": "0px",
        "type": "spacing"
      },
      "row-gap": {
        "value": "{voorbeeld.space.row.snail}",
        "type": "spacing"
      }
    }
  }
}
