<svg width="48" height="48" viewBox="0 0 48 48" fill="none" xmlns="http://www.w3.org/2000/svg">
<path d="M33.03 7.99999L36 8.01999L36.02 9.96999L33.02 9.99999V7.99999H33.03ZM41.36 28.96C41.79 28.38 42.03 27.69 42.03 26.95C42.03 26.21 41.8 25.53 41.37 24.95C41.8 24.37 42.03 23.68 42.03 22.95C42.03 22.22 41.8 21.53 41.37 20.95C41.71 20.49 41.93 19.95 42 19.37C42.06 19.05 42.04 18.71 41.94 18.39C41.84 17.76 41.56 17.18 41.15 16.72C39.86 15.04 38.37 12.9 38.07 12.21L38.04 12C38.04 12 38.04 11.99 38.04 11.98C38.04 11.95 38.04 11.93 38.04 11.9V8.00999C38.04 6.91999 37.16 6.03999 36.07 6.02999L33.07 6.00999C33.07 6.00999 33.06 6.00999 33.05 6.00999C33.05 6.00999 33.04 6.00999 33.03 6.00999C32.5 6.00999 32 6.21999 31.62 6.58999C31.24 6.96999 31.03 7.47999 31.03 8.00999V12.53C30.75 13.1 29.63 14.62 28.52 16.01H28.45C28.27 16.25 28.09 16.49 27.91 16.72C27.5 17.19 27.22 17.77 27.12 18.39C27.02 18.71 27 19.05 27.06 19.37C27.06 19.38 27.06 19.39 27.06 19.41C27.1 19.87 27.19 20.13 27.33 20.35C27.43 20.56 27.53 20.77 27.67 20.95C27.24 21.53 27.01 22.22 27.01 22.95C27.01 22.97 27.01 23 27.01 23.02C25.99 23.02 24.92 23.01 24.14 23L24.49 13.99H27C27.55 13.99 28 13.54 28 12.99V8.98999C28 8.43999 27.55 7.98999 27 7.98999H23.67C23.67 6.88999 22.77 5.98999 21.67 5.98999H9.85C8.76 5.98999 8 6.87999 8 7.96999H6.99C6.44 7.98999 6 8.42999 6 8.97999V12.99C6 13.54 6.45 13.99 7 13.99H7.99V34.05C7.87 34.18 7.76 34.31 7.65 34.46C7.61 34.51 7.58 34.56 7.54 34.62C7.44 34.77 7.35 34.93 7.28 35.1C7.26 35.14 7.25 35.18 7.23 35.22C7.17 35.38 7.11 35.55 7.07 35.72C7.07 35.75 7.05 35.79 7.05 35.82C7.01 36.02 6.99 36.22 6.99 36.43C6.99 36.45 6.99 36.47 6.99 36.5C6.99 36.52 6.99 36.55 6.99 36.57C6.99 36.77 7.01 36.98 7.05 37.19C7.09 37.41 7.16 37.61 7.24 37.82C7.26 37.86 7.27 37.89 7.29 37.93C7.36 38.09 7.44 38.24 7.54 38.38C7.56 38.42 7.59 38.46 7.61 38.5C7.85 38.84 8.14 39.13 8.48 39.37C8.52 39.4 8.56 39.42 8.6 39.45C8.74 39.54 8.9 39.62 9.05 39.7C9.09 39.72 9.12 39.73 9.16 39.75C9.36 39.83 9.57 39.9 9.78 39.94C9.99 39.98 10.2 40 10.4 40C10.42 40 10.45 40 10.47 40C10.49 40 10.51 40 10.53 40C10.74 40 10.94 39.98 11.14 39.94C11.18 39.94 11.21 39.92 11.24 39.91C11.41 39.87 11.58 39.82 11.74 39.75C11.78 39.73 11.82 39.72 11.86 39.7C12.03 39.63 12.19 39.54 12.34 39.44C12.39 39.41 12.44 39.37 12.49 39.33C12.63 39.23 12.77 39.12 12.9 38.99H17.46C18.01 38.99 18.46 38.54 18.46 37.99C18.46 37.44 18.01 36.99 17.46 36.99H13.91C13.93 36.83 13.96 36.66 13.96 36.49C13.96 34.56 12.39 32.99 10.46 32.99C10.29 32.99 10.12 33.02 9.96 33.04V14H22.44L22.08 23.27C21.79 23.43 21.54 23.67 21.36 23.96L20.26 25.78C20.07 26.09 19.97 26.45 19.97 26.81V39.08C19.97 39.36 20.04 39.62 20.15 39.88L21.61 41.48C21.78 41.8 22.12 42.01 22.49 42.01H31.57C31.93 42.01 32.26 41.81 32.43 41.48L33.73 40.02H37.96C40.18 40.02 41.97 38.22 41.97 36.01V30.96C41.98 30.26 41.75 29.56 41.32 28.96H41.36ZM12 36.5C12 37.33 11.33 38 10.5 38C9.67 38 9 37.33 9 36.5C9 35.67 9.67 35 10.5 35C11.33 35 12 35.67 12 36.5ZM8 12V9.99999H9C9.55 9.99999 10 9.54999 10 8.99999V7.99999H21.66V9.00999C21.68 9.55999 22.12 9.99999 22.67 9.99999H26V12H8ZM31 40L23.07 39.97L22 39.07V26.82L23.07 25L31 25.03L32.07 26.96V38.66C32.03 38.77 32 38.89 32 39.01C32 39.01 32 39.03 32 39.04L30.99 39.99L31 40ZM39.62 21.99C40.15 22.52 40.15 23.39 39.62 23.92C39.34 24.2 39.19 24.56 39.19 24.96C39.19 25.36 39.34 25.72 39.62 26C40.15 26.53 40.15 27.4 39.62 27.93C39.06 28.49 39.04 29.39 39.58 29.96C39.84 30.24 40.02 30.58 40.02 30.97V36.02C40 37.13 39.11 38.04 37.99 38.04H34.06V26.97C34.06 26.63 33.97 26.3 33.81 26L32.73 24.06C32.4 23.48 31.81 23.11 31.16 23.07C31.16 23.07 29.7 23.07 29.01 23.05C28.99 22.67 29.1 22.29 29.39 22C29.67 21.72 29.82 21.36 29.82 20.96C29.82 20.56 29.67 20.2 29.39 19.92C29.17 19.7 29.07 19.43 29.03 19.15C29.02 19.08 29.02 19.01 29.02 18.94C29.02 18.92 29.04 18.9 29.04 18.88C29.05 18.7 29.1 18.53 29.18 18.36C29.25 18.23 29.33 18.11 29.44 18C29.44 18 32.65 14.12 32.94 13.03L33 12.63C33 12.63 33.02 12.54 33.02 12.49V12H36.02V12.08C36.02 12.13 36.03 12.18 36.04 12.23L36.1 12.66C36.39 13.83 39.6 17.99 39.6 17.99C39.84 18.23 39.95 18.55 39.97 18.87C39.99 18.91 40.01 18.95 40.02 18.99C40.01 19.32 39.88 19.65 39.63 19.91C39.35 20.19 39.2 20.55 39.2 20.95C39.2 21.35 39.35 21.71 39.63 21.99H39.62Z" fill="#223C61"/>
</svg>
