<svg width="48" height="48" viewBox="0 0 48 48" fill="none" xmlns="http://www.w3.org/2000/svg">
<path d="M31.07 15.01C31 14.35 31 13.67 31.07 13.01H29.99C29.44 13.01 28.99 12.56 28.99 12.01C28.99 11.46 29.44 11.01 29.99 11.01H31.51C31.83 10.09 32.31 9.21997 32.94 8.46997C35.2 5.77997 38.74 5.22997 41.55 7.11997C42.01 7.42997 42.13 8.04997 41.82 8.50997C41.51 8.96997 40.89 9.08997 40.43 8.77997C38.5 7.47997 36.05 7.87997 34.47 9.75997C34.15 10.14 33.9 10.57 33.68 11.02H37.99C38.54 11.02 38.99 11.47 38.99 12.02C38.99 12.57 38.54 13.02 37.99 13.02H33.06C32.97 13.68 32.97 14.36 33.06 15.02H37.98C38.53 15.02 38.98 15.47 38.98 16.02C38.98 16.57 38.53 17.02 37.98 17.02H33.68C33.91 17.5 34.18 17.96 34.54 18.36C36.14 20.19 38.5 20.55 40.43 19.25C40.89 18.94 41.51 19.06 41.82 19.52C42.13 19.98 42.01 20.6 41.55 20.91C40.44 21.66 39.21 22.02 37.99 22.02C36.18 22.02 34.39 21.22 33.03 19.67C32.35 18.89 31.84 17.98 31.5 17.01H29.98C29.43 17.01 28.98 16.56 28.98 16.01C28.98 15.46 29.43 15.01 29.98 15.01H31.07Z" fill="#223C61"/>
<path d="M37 40H35V24.52C35 23.97 34.55 23.52 34 23.52C33.45 23.52 33 23.97 33 24.52V31H11V21H30C30.55 21 31 20.55 31 20C31 19.45 30.55 19 30 19H27V9.99997H28C28.55 9.99997 29 9.54997 29 8.99997C29 8.44997 28.55 7.99997 28 7.99997H10.64C10.26 7.99997 9.92 8.20997 9.75 8.54997L6.11 15.77C6.04 15.91 6 16.06 6 16.22V18C6 19.65 7.36 21 9.04 21H9V40H7C6.45 40 6 40.45 6 41C6 41.55 6.45 42 7 42H37C37.55 42 38 41.55 38 41C38 40.45 37.55 40 37 40ZM25 9.99997V19H21V9.99997H25ZM14.02 16.24C14.02 16.14 14.04 16.03 14.07 15.94L16 10.01H19V19.01H14L14.02 16.25V16.24ZM9.02 19C8.45 19 7.99 18.53 8 17.96L8.03 16.19C8.03 16.04 8.07 15.89 8.14 15.76L11.05 9.99997H13.9L12.05 16.15C12.02 16.24 12.01 16.34 12.01 16.44V19H9.02ZM33 40H11V33H33V40Z" fill="#223C61"/>
</svg>
