<svg width="48" height="48" viewBox="0 0 48 48" fill="none" xmlns="http://www.w3.org/2000/svg">
<path d="M30 22C30 21.45 29.55 21 29 21H26.97C26.43 21 26 21.44 26 21.97V22.02C26 22.56 26.44 22.99 26.97 22.99H29C29.55 22.99 30 22.54 30 21.99V22Z" fill="#223C61"/>
<path d="M29 27H26.97C26.43 27 26 27.44 26 27.97V28.02C26 28.56 26.44 28.99 26.97 28.99H29C29.55 28.99 30 28.54 30 27.99C30 27.44 29.55 26.99 29 26.99V27Z" fill="#223C61"/>
<path d="M19 28.04C19 28.57 19.43 29 19.96 29H22.02C22.56 29 22.99 28.56 22.99 28.03V27.98C22.99 27.44 22.55 27.01 22.02 27.01H19.96C19.43 27.01 19 27.44 19 27.97V28.04Z" fill="#223C61"/>
<path d="M18.26 33.86C17.86 34.26 17.88 34.91 18.31 35.27L19.69 36.45C20.06 36.77 20.62 36.76 20.98 36.43L24.2 33.49C24.61 33.12 24.62 32.48 24.23 32.08C23.85 31.7 23.23 31.7 22.85 32.08L20.35 34.58L19.61 33.84C19.23 33.47 18.63 33.47 18.25 33.84L18.26 33.86Z" fill="#223C61"/>
<path d="M16 21.97C16 21.43 15.56 21 15.03 21H12.97C12.44 21 12.01 21.43 12.01 21.96V22.03C12.01 22.56 12.44 22.99 12.97 22.99H15.03C15.57 22.99 16 22.55 16 22.02V21.97Z" fill="#223C61"/>
<path d="M19.96 23H22.02C22.56 23 22.99 22.56 22.99 22.03V21.98C22.99 21.44 22.55 21.01 22.02 21.01H19.96C19.43 21.01 19 21.44 19 21.97V22.04C19 22.57 19.43 23 19.96 23Z" fill="#223C61"/>
<path d="M15.03 33H12.97C12.44 33 12.01 33.43 12.01 33.96V34.03C12.01 34.56 12.44 34.99 12.97 34.99H15.03C15.57 34.99 16 34.55 16 34.02V33.97C16 33.43 15.56 33 15.03 33Z" fill="#223C61"/>
<path d="M40.44 39.24C38.52 40.53 36.15 40.18 34.55 38.35C34.2 37.95 33.93 37.49 33.69 37.01H37.99C38.54 37.01 38.99 36.56 38.99 36.01C38.99 35.46 38.54 35.01 37.99 35.01H33.07C32.98 34.35 32.97 33.67 33.07 33.01H38C38.55 33.01 39 32.56 39 32.01C39 31.46 38.55 31.01 38 31.01H33.69C33.91 30.57 34.16 30.14 34.48 29.75C36.06 27.87 38.51 27.47 40.44 28.77C40.9 29.08 41.52 28.96 41.83 28.5C42.14 28.04 42.02 27.42 41.56 27.11C38.75 25.22 35.21 25.77 32.95 28.46C32.32 29.21 31.84 30.08 31.52 31H30C29.45 31 29 31.45 29 32C29 32.55 29.45 33 30 33H31.08C31.01 33.66 31.01 34.34 31.08 35H30.01C29.46 35 29.01 35.45 29.01 36C29.01 36.55 29.46 37 30.01 37H31.53C31.87 37.97 32.38 38.88 33.06 39.66C34.41 41.2 36.2 42.01 38.02 42.01C39.24 42.01 40.47 41.65 41.58 40.9C42.04 40.59 42.16 39.97 41.85 39.51C41.54 39.05 40.92 38.93 40.46 39.24H40.44Z" fill="#223C61"/>
<path d="M16 27.97C16 27.43 15.56 27 15.03 27H12.97C12.44 27 12.01 27.43 12.01 27.96V28.03C12.01 28.56 12.44 28.99 12.97 28.99H15.03C15.57 28.99 16 28.55 16 28.02V27.97Z" fill="#223C61"/>
<path d="M31 40H9.99001C8.89001 40 8.00001 39.11 8.00001 38.01V17H34V24C34 24.55 34.45 25 35 25C35.55 25 36 24.55 36 24V9C36 8.45 35.55 8 35 8H29V6.99C29 6.44 28.56 6 28.01 6H27.98C27.43 6 26.99 6.44 26.99 6.99V8H15V6.99C15 6.44 14.56 6 14.01 6C13.46 6 13.02 6.44 13.02 6.99V8L7.00001 7.99C6.45001 7.99 6.00001 8.44 6.00001 8.99L5.98001 38.02C5.98001 40.22 7.76001 42.01 9.96001 42.01H31C31.55 42.01 32 41.56 32 41.01C32 40.46 31.55 40.01 31 40.01V40ZM8.01001 10H13.01V11C13.01 11.55 13.45 12 14 12C14.55 12 15 11.55 15 11V10H27V11C27 11.55 27.45 12 28 12C28.55 12 29 11.55 29 11V10H34V15H8.01001V10Z" fill="#223C61"/>
</svg>
