{
  "utrecht": {
    "form-fieldset": {
      "margin-block-start": {
        "value": "12px"
      },
      "margin-block-end": {
        "value": "12px"
      },
      "section": {
        "background-color": {
          "value": "{voorbeeld.color.white}"
        },
        "color": {
          "value": "{voorbeeld.color.black}"
        }
      },
      "legend": {
        "color": {},
        "font-family": {},
        "font-size": {
          "value": "1rem"
        },
        "font-weight": {
          "value": "{pra.typography.font-weight.normal}"
        },
        "line-height": {
          "value": "1.4"
        },
        "margin-block-end": {
          "value": "10px"
        },
        "margin-block-start": {
          "value": "20px"
        },
        "text-transform": {
          "value": "uppercase"
        },
        "disabled": {
          "color": {
            "value": "{pra.color.primary.100}"
          }
        }
      }
    }
  }
}
