<svg width="24" height="24" viewBox="0 0 24 24" fill="none" xmlns="http://www.w3.org/2000/svg">
<path fill-rule="evenodd" clip-rule="evenodd" d="M14 5C14 3.89543 14.8954 3 16 3H20C21.1046 3 22 3.89543 22 5V19C22 20.1046 21.1046 21 20 21H4C2.89543 21 2 20.1046 2 19V13C2 11.8954 2.89543 11 4 11H8V9C8 7.89543 8.89543 7 10 7H14V5ZM16 19H20V5H16V19ZM14 9H10V19H14V9ZM8 13H4V19H8V13Z" fill="#223C61"/>
</svg>
