<svg width="24" height="24" viewBox="0 0 24 24" fill="none" xmlns="http://www.w3.org/2000/svg">
<path fill-rule="evenodd" clip-rule="evenodd" d="M9 2C9.55228 2 10 2.44772 10 3V6H14V3C14 2.44772 14.4477 2 15 2C15.5523 2 16 2.44772 16 3V6H17C17.5523 6 18 6.44772 18 7V13C18 15.2091 16.2091 17 14 17H13V18C13 18.5523 13.4477 19 14 19H17C17.5523 19 18 19.4477 18 20C18 20.5523 17.5523 21 17 21H14C12.3431 21 11 19.6569 11 18V17H10C7.79086 17 6 15.2091 6 13V7C6 6.44772 6.44772 6 7 6H8V3C8 2.44772 8.44772 2 9 2ZM8 8V13C8 14.1046 8.89543 15 10 15H14C15.1046 15 16 14.1046 16 13V8H8Z" fill="#223C61"/>
</svg>
