<svg width="24" height="24" viewBox="0 0 24 24" fill="none" xmlns="http://www.w3.org/2000/svg">
<path fill-rule="evenodd" clip-rule="evenodd" d="M2.29289 2.29289C2.68342 1.90237 3.31658 1.90237 3.70711 2.29289L21.7071 20.2929C22.0976 20.6834 22.0976 21.3166 21.7071 21.7071C21.3166 22.0976 20.6834 22.0976 20.2929 21.7071L16.5858 18H4C2.89543 18 2 17.1046 2 16V14C2 12.8954 2.89543 12 4 12H10.5858L2.29289 3.70711C1.90237 3.31658 1.90237 2.68342 2.29289 2.29289ZM12.5858 14H9V16H14.5858L12.5858 14ZM7 16V14H4V16H7ZM16 4C16.5523 4 17 4.44772 17 5V5.5C17 6.05228 17.4477 6.5 18 6.5C19.6569 6.5 21 7.84315 21 9.5V10C21 10.5523 20.5523 11 20 11C19.4477 11 19 10.5523 19 10V9.5C19 8.94772 18.5523 8.5 18 8.5C16.3431 8.5 15 7.15685 15 5.5V5C15 4.44772 15.4477 4 16 4ZM16 13C16 12.4477 16.4477 12 17 12H20C21.1046 12 22 12.8954 22 14V16C22 16.5594 21.7691 17.067 21.3993 17.4288C21.0046 17.815 20.3714 17.8081 19.9852 17.4133C19.5992 17.0188 19.6059 16.3862 20 15.9999V14H17C16.4477 14 16 13.5523 16 13Z" fill="#223C61"/>
</svg>
