<svg width="24" height="24" viewBox="0 0 24 24" fill="none" xmlns="http://www.w3.org/2000/svg">
<path fill-rule="evenodd" clip-rule="evenodd" d="M2 6C2 4.34315 3.34315 3 5 3H12C13.6569 3 15 4.34315 15 6V8C15 8.55228 14.5523 9 14 9C13.4477 9 13 8.55228 13 8V6C13 5.44772 12.5523 5 12 5H5C4.44772 5 4 5.44772 4 6V18C4 18.5523 4.44772 19 5 19H12C12.5523 19 13 18.5523 13 18V16C13 15.4477 13.4477 15 14 15C14.5523 15 15 15.4477 15 16V18C15 19.6569 13.6569 21 12 21H5C3.34315 21 2 19.6569 2 18V6ZM17.2929 8.29289C17.6834 7.90237 18.3166 7.90237 18.7071 8.29289L21.7071 11.2929C22.0976 11.6834 22.0976 12.3166 21.7071 12.7071L18.7071 15.7071C18.3166 16.0976 17.6834 16.0976 17.2929 15.7071C16.9024 15.3166 16.9024 14.6834 17.2929 14.2929L18.5858 13H7C6.44772 13 6 12.5523 6 12C6 11.4477 6.44772 11 7 11H18.5858L17.2929 9.70711C16.9024 9.31658 16.9024 8.68342 17.2929 8.29289Z" fill="#223C61"/>
</svg>
