<svg width="24" height="24" viewBox="0 0 24 24" fill="none" xmlns="http://www.w3.org/2000/svg">
<path fill-rule="evenodd" clip-rule="evenodd" d="M11.3331 4.50972C10.604 3.85714 9.5097 3.82795 8.74681 4.44074C7.98392 5.05353 7.77644 6.12834 8.25643 6.98106C8.51683 7.44366 8.37038 8.02913 7.92283 8.31464C7.38504 8.65772 7.04339 9.23698 7.00335 9.87364C6.9633 10.5103 7.22967 11.1278 7.72023 11.5356C8.01262 11.7786 8.14189 12.1664 8.05379 12.5363C7.91674 13.1117 8.0414 13.7182 8.39426 14.1929C8.74443 14.6639 9.2837 14.9572 9.86895 14.9955L10.0142 14.9996H11V13.4138L9.2929 11.7067C8.90237 11.3162 8.90237 10.683 9.2929 10.2925C9.68342 9.90195 10.3166 9.90195 10.7071 10.2925L11 10.5854V7.99958C11 7.4473 11.4477 6.99958 12 6.99958C12.5523 6.99958 13 7.4473 13 7.99958V9.58537L13.2929 9.29247C13.6834 8.90195 14.3166 8.90195 14.7071 9.29247C15.0976 9.683 15.0976 10.3162 14.7071 10.7067L13 12.4138V14.9996H14C14.612 14.9997 15.1906 14.7196 15.57 14.2394C15.9494 13.7591 16.088 13.1316 15.9462 12.5362C15.8581 12.1663 15.9875 11.7784 16.28 11.5354C16.7707 11.1277 17.0371 10.5102 16.9969 9.87354C16.9567 9.23688 16.6148 8.65773 16.0768 8.315C15.629 8.0298 15.4822 7.44444 15.7422 6.98166C16.2214 6.12913 16.0137 5.05517 15.2514 4.44267C14.489 3.83018 13.3955 3.85879 12.6662 4.51032C12.2865 4.84956 11.7125 4.8493 11.3331 4.50972ZM11 16.9996V20.9996C11 21.5519 11.4477 21.9996 12 21.9996C12.5523 21.9996 13 21.5519 13 20.9996V16.9996H13.9998C13.9997 16.9996 13.9999 16.9996 13.9998 16.9996C15.2238 16.9998 16.3806 16.4396 17.1394 15.4791C17.7741 14.6757 18.0719 13.6661 17.9863 12.6605C18.6923 11.8693 19.0607 10.8221 18.9929 9.74758C18.9309 8.76444 18.5093 7.84982 17.8254 7.16817C18.2943 5.63227 17.7998 3.92461 16.504 2.88355C15.1975 1.83384 13.4046 1.72566 12.0006 2.5361C10.5962 1.72383 8.80191 1.83116 7.49433 2.88148C6.19751 3.92315 5.70314 5.63234 6.1734 7.16897C5.49011 7.85082 5.06911 8.76528 5.00729 9.74808C4.93972 10.8223 5.30809 11.8692 6.01375 12.6603C5.93147 13.6263 6.20275 14.5972 6.78916 15.386C7.49488 16.3354 8.58463 16.9237 9.76555 16.9929C9.77556 16.9935 9.78558 16.9939 9.79561 16.9942L9.97161 16.9992C9.98107 16.9994 9.99054 16.9996 10 16.9996H11Z" fill="#223C61"/>
</svg>
