<svg width="48" height="48" viewBox="0 0 48 48" fill="none" xmlns="http://www.w3.org/2000/svg">
<path d="M15.5 22C15.5 22.55 15.95 23 16.5 23H17.39C18.32 25.36 20.32 27 22.62 27C23.93 27 25.16 26.49 26.18 25.53C26.58 25.15 26.6 24.52 26.22 24.12C25.84 23.72 25.21 23.7 24.81 24.08C24.16 24.69 23.4 25.01 22.61 25.01C21.37 25.01 20.28 24.22 19.59 23.01H22.49C23.04 23.01 23.49 22.56 23.49 22.01C23.49 21.46 23.04 21.01 22.49 21.01H18.89C18.84 20.69 18.81 20.35 18.81 20.01C18.81 19.67 18.84 19.33 18.89 19.01H22.49C23.04 19.01 23.49 18.56 23.49 18.01C23.49 17.46 23.04 17.01 22.49 17.01H19.59C20.28 15.8 21.37 15.01 22.61 15.01C23.4 15.01 24.16 15.33 24.81 15.94C25.21 16.32 25.85 16.3 26.22 15.9C26.6 15.5 26.58 14.86 26.18 14.49C25.16 13.53 23.92 13.02 22.61 13.02C20.3 13.02 18.31 14.66 17.38 17.02H16.49C15.94 17.02 15.49 17.47 15.49 18.02C15.49 18.57 15.94 19.02 16.49 19.02H16.87C16.83 19.35 16.8 19.68 16.8 20.02C16.8 20.36 16.83 20.69 16.87 21.02H16.49C15.94 21.02 15.49 21.47 15.49 22.02L15.5 22Z" fill="#223C61"/>
<path d="M41.59 34.35L38.98 32.34V30C38.99 29.45 38.54 29 37.99 29C37.44 29 37 29.44 36.99 29.99V30.88L35.01 29.45V7.97C35 6.88 34.12 6 33.03 6H8.95999C7.86999 6 6.98999 6.88 6.98999 7.97V31.59C6.98999 31.86 7.09999 32.11 7.27999 32.3L16.69 41.71C16.88 41.9 17.13 42 17.4 42H23.99C24.54 42 24.99 41.55 24.99 41C24.99 40.45 24.54 40 23.99 40H18.99V31C18.99 30.45 18.54 30 17.99 30H8.98999V8H32.99V28.23C32.79 28.23 32.58 28.29 32.41 28.42L24.4 34.38C23.95 34.71 23.86 35.33 24.18 35.78L24.3 35.94C24.63 36.39 25.26 36.48 25.7 36.15L26.98 35.09V40.97C26.98 41.52 27.43 41.97 27.98 41.97H37.98C38.53 41.97 38.98 41.52 38.98 40.97V35.09L40.21 36.15C40.64 36.49 41.28 36.42 41.62 35.98L41.79 35.76C42.14 35.31 42.05 34.67 41.59 34.33V34.35ZM16.99 32V39.13L9.85999 32H16.99ZM36.98 39.97H28.98V33.4L33 30.46L36.98 33.35V39.97Z" fill="#223C61"/>
</svg>
