<svg width="24" height="24" viewBox="0 0 24 24" fill="none" xmlns="http://www.w3.org/2000/svg">
<path fill-rule="evenodd" clip-rule="evenodd" d="M11 4C10.4477 4 10 4.44772 10 5V15C10 15.5523 10.4477 16 11 16H18C18.5523 16 19 15.5523 19 15V9H16C14.8954 9 14 8.10457 14 7V4H11ZM16 5.41421L17.5858 7H16V5.41421ZM17 18H18C19.6569 18 21 16.6569 21 15V8C21 7.73478 20.8946 7.48043 20.7071 7.29289L15.7071 2.29289C15.5196 2.10536 15.2652 2 15 2H11C9.34315 2 8 3.34315 8 5V6H7C5.34315 6 4 7.34315 4 9V19C4 20.6569 5.34315 22 7 22H14C15.6569 22 17 20.6569 17 19V18ZM15 18H11C9.34315 18 8 16.6569 8 15V8H7C6.44772 8 6 8.44772 6 9V19C6 19.5523 6.44772 20 7 20H14C14.5523 20 15 19.5523 15 19V18Z" fill="#223C61"/>
</svg>
