<svg width="48" height="48" viewBox="0 0 48 48" fill="none" xmlns="http://www.w3.org/2000/svg">
<path d="M41 40H23V10C23 8.17 24.54 8.01 25.01 8H27.01V9C27.01 10.66 28.35 12 30.01 12H32.01C33.66 12 35.01 10.65 35.01 9V7C35.01 6.45 34.56 6 34.01 6H25.01C24.06 6 22.85 6.39 22.01 7.29C21.17 6.39 19.96 6 19.01 6H10.01C9.46 6 9.01 6.45 9.01 7V9.01C9.01 10.66 10.35 12 12 12H14.01C15.67 12 17.01 10.66 17.01 9V8H19C19.47 8 21.01 8.17 21.01 10V40H7C6.45 40 6 40.45 6 41C6 41.55 6.45 42 7 42H41C41.55 42 42 41.55 42 41C42 40.45 41.55 40 41 40ZM29.08 8H33.08V9C33.08 9.55 32.63 10 32.08 10H30.08C29.53 10 29.08 9.55 29.08 9V8ZM14.94 9C14.94 9.55 14.49 10 13.94 10H11.94C11.39 10 10.94 9.55 10.94 9V8H14.94V9Z" fill="#223C61"/>
<path d="M41.45 17.18C41.07 16.8 40.57 16.59 40.03 16.59H28C26.9 16.59 26 17.49 26 18.59V30.59C26 31.69 26.9 32.59 28 32.59H32.17L36.3 36.71C36.93 37.34 38 36.89 38 36V32.61H40C41.1 32.6 42 31.7 42 30.6L42.03 18.59C42.03 18.06 41.82 17.55 41.45 17.17V17.18ZM40 30.6H36V33.59L33 30.59H28V18.59H40.03L40 30.6Z" fill="#223C61"/>
<path d="M6.7 15.4C7.08 15.78 7.69 15.78 8.07 15.4L9.03 14.44C9.43 14.04 9.41 13.36 8.96 13.01C8.96 13.01 8.95 13.01 8.94 13C8.55 12.69 8 12.71 7.64 13.06L6.68 14.02C6.3 14.4 6.3 15.01 6.68 15.39H6.69L6.7 15.4Z" fill="#223C61"/>
<path d="M34 28.59C34.5523 28.59 35 28.1423 35 27.59C35 27.0377 34.5523 26.59 34 26.59C33.4477 26.59 33 27.0377 33 27.59C33 28.1423 33.4477 28.59 34 28.59Z" fill="#223C61"/>
<path d="M34 25.59C34.55 25.59 35 25.14 35 24.59V21.59C35 21.04 34.55 20.59 34 20.59C33.45 20.59 33 21.04 33 21.59V24.59C33 25.14 33.45 25.59 34 25.59Z" fill="#223C61"/>
<path d="M12.95 17.98C13.48 17.98 13.92 17.55 13.92 17.01C13.92 17.01 13.91 15.85 13.89 14.97C13.89 14.44 13.45 14.02 12.93 14.02C12.41 14.02 11.96 14.45 11.96 14.99V17.01C11.96 17.54 12.39 17.98 12.93 17.98H12.95Z" fill="#223C61"/>
<path d="M19.18 15.4H19.19C19.57 15.01 19.57 14.4 19.19 14.02L18.18 13.01C17.82 12.65 17.27 12.65 16.88 12.96C16.88 12.96 16.87 12.96 16.86 12.97C16.42 13.32 16.4 13.99 16.8 14.39L17.81 15.4C18.19 15.78 18.8 15.78 19.18 15.4Z" fill="#223C61"/>
</svg>
