<svg width="24" height="24" viewBox="0 0 24 24" fill="none" xmlns="http://www.w3.org/2000/svg">
<path fill-rule="evenodd" clip-rule="evenodd" d="M16 4C16.5523 4 17 4.44772 17 5V5.5C17 6.05228 17.4477 6.5 18 6.5C19.6569 6.5 21 7.84315 21 9.5V10C21 10.5523 20.5523 11 20 11C19.4477 11 19 10.5523 19 10V9.5C19 8.94772 18.5523 8.5 18 8.5C16.3431 8.5 15 7.15685 15 5.5V5C15 4.44772 15.4477 4 16 4ZM2 14C2 12.8954 2.89543 12 4 12H20C21.1046 12 22 12.8954 22 14V16C22 17.1046 21.1046 18 20 18H4C2.89543 18 2 17.1046 2 16V14ZM9 16H20V14H9V16ZM7 14V16H4V14H7Z" fill="#223C61"/>
</svg>
