<svg width="48" height="48" viewBox="0 0 48 48" fill="none" xmlns="http://www.w3.org/2000/svg">
<path d="M32.49 22.1602L31.73 22.9602C31.34 23.3702 30.67 23.3702 30.28 22.9602L29.52 22.1602L29.36 21.9902C29.03 21.6402 28.9 21.1102 29.12 20.6802C29.47 19.9702 30.32 19.8702 30.81 20.3802L31.01 20.5902L31.21 20.3802C31.7 19.8702 32.55 19.9602 32.9 20.6802C33.11 21.1102 32.99 21.6402 32.66 21.9902L32.5 22.1602H32.49ZM24.97 10.5002C24.97 8.01023 26.99 5.99023 29.48 5.99023C31.97 5.99023 33.99 8.01023 33.99 10.5002C33.99 12.9902 31.97 15.0102 29.48 15.0102C26.99 15.0102 24.97 12.9902 24.97 10.5002ZM26.97 10.5002C26.97 11.8802 28.1 13.0102 29.48 13.0102C30.86 13.0102 31.99 11.8802 31.99 10.5002C31.99 9.12023 30.86 7.99023 29.48 7.99023C28.1 7.99023 26.97 9.12023 26.97 10.5002ZM14 10.5002C14 8.01023 16.02 5.99023 18.51 5.99023C21 5.99023 23.02 8.01023 23.02 10.5002C23.02 12.9902 21 15.0102 18.51 15.0102C16.02 15.0102 14 12.9902 14 10.5002ZM16 10.5002C16 11.8802 17.13 13.0102 18.51 13.0102C19.89 13.0102 21.02 11.8802 21.02 10.5002C21.02 9.12023 19.89 7.99023 18.51 7.99023C17.13 7.99023 16 9.12023 16 10.5002ZM33 16.0102H15C12.79 16.0102 11 17.8102 11 20.0202L11.04 30.0102C11.04 30.5602 11.49 31.0102 12.04 31.0102H14V41.0102C14 41.5602 14.45 42.0102 15 42.0102C15.55 42.0102 16 41.5602 16 41.0102V29.0102H13L12.97 20.0102C12.97 18.9102 13.87 18.0102 14.97 18.0102H33.01C34.11 18.0102 35.01 18.9102 35.01 20.0102V29.0102H32.01V41.0102C32.01 41.5602 32.46 42.0102 33.01 42.0102C33.56 42.0102 34.01 41.5602 34.01 41.0102V31.0102H36.01C36.56 31.0102 37.01 30.5602 37.01 30.0102V20.0102C37.01 17.8002 35.22 16.0102 33.01 16.0102H33ZM25 41.0002V22.0002C25 21.4502 24.55 21.0002 24 21.0002C23.45 21.0002 23 21.4502 23 22.0002V41.0002C23 41.5502 23.45 42.0002 24 42.0002C24.55 42.0002 25 41.5502 25 41.0002Z" fill="#223C61"/>
</svg>
