<svg width="48" height="48" viewBox="0 0 48 48" fill="none" xmlns="http://www.w3.org/2000/svg">
<path d="M35.96 19.26V14.99C35.96 14.44 35.52 14 34.97 14C34.43 14 33.99 14.44 33.99 14.99V17.53L24.64 9.21998C24.27 8.89998 23.72 8.89998 23.35 9.21998L9.34 21.57C8.92 21.93 8.87 22.56 9.24 22.98C9.6 23.39 10.23 23.44 10.64 23.07L12.02 21.86L12 38.01C12 38.56 12.44 39.01 12.99 39.01H35.01C35.55 39.01 36 38.57 36 38.02L35.97 21.91L37.37 23.1C37.78 23.45 38.4 23.41 38.76 23L38.78 22.98C39.14 22.57 39.09 21.94 38.68 21.59L35.97 19.27L35.96 19.26ZM33.99 37.01H13.96V20.17L24 11.31L33.96 20.16L33.99 37.01ZM27.97 31H19.95C19.4 31 18.95 30.55 18.95 30.01V24C18.95 23.45 19.4 23.01 19.95 23.01H27.97C28.51 23.01 28.96 23.45 28.96 24V30.03C28.96 30.57 28.52 31.02 27.97 31.02V31ZM20.96 29H26.96V25H20.96V29Z" fill="#223C61"/>
</svg>
