<svg width="24" height="24" viewBox="0 0 24 24" fill="none" xmlns="http://www.w3.org/2000/svg">
<path fill-rule="evenodd" clip-rule="evenodd" d="M2 18V7H4V13H10V7H19C20.6569 7 22 8.34315 22 10V18H20V15H4V18H2ZM20 13V10C20 9.44772 19.5523 9 19 9H12V13H20ZM5 10C5 8.89543 5.89543 8 7 8C8.10457 8 9 8.89543 9 10C9 11.1046 8.10457 12 7 12C5.89543 12 5 11.1046 5 10Z" fill="#223C61"/>
</svg>
