<svg width="48" height="48" viewBox="0 0 48 48" fill="none" xmlns="http://www.w3.org/2000/svg">
<path d="M37.84 33.0297H37V18.1697L38.71 19.6897C39.13 20.0597 39.76 20.0097 40.12 19.5897C40.47 19.1697 40.43 18.5497 40.02 18.1897L36.99 15.5297V12.0097C36.99 11.4597 36.55 11.0197 36 11.0197H35.99C35.44 11.0197 35 11.4597 35 12.0097V13.6097L28.15 7.23969C27.77 6.90969 27.2 6.90969 26.83 7.23969L15.1 17.9697C14.69 18.3297 14.65 18.9597 15.01 19.3697C15.38 19.7897 16.01 19.8197 16.43 19.4497L18.01 18.0097V26.4197L14.01 27.0197C14.01 26.4697 13.56 26.0197 13.01 26.0197H7.01C6.46 26.0197 6 26.4697 6 27.0197V39.0197C6 39.5697 6.45 40.0197 7 40.0197H13C13.55 40.0197 14 39.5697 14 39.0197V37.9897L25.21 40.8097C26.04 41.0397 26.94 41.0597 27.78 40.8597L41.21 37.7697C41.67 37.6597 42 37.2497 42 36.7697V36.2297C42 34.2397 40.13 33.0097 37.84 33.0097V33.0297ZM12 38.0297H8V28.0297H12V38.0297ZM20 16.4897L27.5 9.52969L35 16.4697V33.0097L32 32.9897C32 31.0697 30.87 29.5297 29.41 29.0497L20.99 26.2297C20.68 26.1297 20.34 26.1097 20 26.1497V16.4897ZM26.69 39.0397L14 35.9597V29.0897L20.09 28.0897C20.26 28.0597 20.43 28.0797 20.58 28.1297L28.58 30.9497C29.35 31.2097 29.99 32.3197 29.99 33.0197C29.99 33.0197 25.84 32.9397 25.32 32.7997L23 32.1297C22.48 31.9797 21.94 32.2697 21.77 32.7797V32.7997C21.59 33.3397 21.89 33.9197 22.44 34.0697L24.61 34.6997C25.37 34.9197 26.14 35.0297 26.92 35.0297L37.77 35.0497C38.54 35.0497 39.83 35.5997 39.91 36.3197L26.69 39.0397ZM24 25.0097H31C31.55 25.0097 32 24.5597 32 24.0097V19.0297C32 18.4797 31.55 18.0297 31 18.0297H24C23.45 18.0297 23 18.4797 23 19.0297V24.0097C23 24.5597 23.45 25.0097 24 25.0097ZM25 20.0497L30 20.0297V22.9897L25 23.0097V20.0497Z" fill="#223C61"/>
</svg>
