<svg width="48" height="48" viewBox="0 0 48 48" fill="none" xmlns="http://www.w3.org/2000/svg">
<path d="M16.59 16.77C16.7 16.32 17.1 16 17.56 16H24.83C25.48 16 25.95 16.6 25.8 17.23C25.69 17.68 25.29 18 24.83 18H17.56C16.91 18 16.44 17.4 16.59 16.77ZM16.61 23H21.76C22.22 23 22.63 22.68 22.73 22.23C22.88 21.6 22.4 21 21.76 21H16.61C16.15 21 15.74 21.32 15.64 21.77C15.49 22.4 15.97 23 16.61 23ZM39.02 39.03H39.01C38.52 39.05 38.09 38.73 37.98 38.26L36.5 31.99H30.66C30.01 31.99 29.52 31.39 29.67 30.76C29.78 30.31 30.19 29.99 30.66 29.99H36.02L31.96 14.21L26.27 38.23C26.16 38.68 25.75 39 25.28 39C24.63 39 24.16 38.4 24.31 37.78L25.68 31.99H9.48001L8.00001 38.23C7.89001 38.68 7.48001 39 7.01001 39C6.36001 39 5.89001 38.4 6.04001 37.78L12.65 9.77C12.76 9.32 13.17 9 13.64 9H31.94C32.46 9 32.86 9.38 32.94 9.85C32.96 9.9 32.99 9.95 33.01 10.01L39.98 37.82C40.12 38.43 39.67 39.02 39.04 39.04L39.02 39.03ZM30.63 11H14.47L9.97001 30H26.14L30.63 11Z" fill="#223C61"/>
</svg>
