<svg width="48" height="48" viewBox="0 0 48 48" fill="none" xmlns="http://www.w3.org/2000/svg">
<path d="M41 22.9997C41 21.3497 39.65 19.9997 38 19.9997H32C32 10.0497 28 9.97973 27 9.97973C27 9.97973 26.93 9.96973 26.81 9.96973C26.15 9.96973 24 10.2797 24 14.2697C24 18.9897 21.37 21.8597 18 21.9897C18 21.4397 17.55 20.9897 17 20.9897H8C7.45 20.9897 7 21.4397 7 21.9897V35.9897C7 36.5397 7.45 36.9897 8 36.9897H17C17.55 36.9897 18 36.5397 18 35.9897C18.94 35.9897 20.1 36.2697 21.12 36.6497C22.62 37.1997 24.48 37.9897 27.64 37.9897H34.95C36.6 37.9897 37.95 36.6397 37.95 34.9897C37.95 34.4597 37.8 33.9597 37.55 33.5297C38.4 32.9997 38.97 32.0597 38.97 30.9897C38.97 30.4597 38.82 29.9597 38.57 29.5297C39.42 28.9997 39.99 28.0597 39.99 26.9897C39.99 26.4597 39.84 25.9597 39.59 25.5297C40.44 24.9997 41.01 24.0597 41.01 22.9897L41 22.9997ZM16 34.9997H9V22.9997H16V34.9997ZM34.95 35.9997H27.64C25.06 35.9997 23.51 35.4197 22.14 34.9097L21.81 34.7897C21.03 34.4997 19.5 34.0097 18 34.0097V24.0097C22.67 23.8297 26 19.8097 26 14.2897C26 12.9797 26.29 12.0797 26.74 11.9897V12.0097H26.99C27.35 12.0097 27.84 12.0097 28.38 12.5997C28.98 13.2697 29.99 15.1397 29.99 20.0097H28.99C28.44 20.0097 27.99 20.4597 27.99 21.0097C27.99 21.5597 28.44 22.0097 28.99 22.0097H37.99C38.54 22.0097 38.99 22.4597 38.99 23.0097C38.99 23.5597 38.54 24.0097 37.99 24.0097H36.97C36.42 24.0097 35.97 24.4597 35.97 25.0097C35.97 25.5597 36.42 26.0097 36.97 26.0097C37.52 26.0097 37.97 26.4597 37.97 27.0097C37.97 27.5597 37.52 28.0097 36.97 28.0097H35.95C35.4 28.0097 34.95 28.4597 34.95 29.0097C34.95 29.5597 35.4 30.0097 35.95 30.0097C36.5 30.0097 36.95 30.4597 36.95 31.0097C36.95 31.5597 36.5 32.0097 35.95 32.0097H34.93C34.38 32.0097 33.93 32.4597 33.93 33.0097C33.93 33.5597 34.38 34.0097 34.93 34.0097C35.48 34.0097 35.93 34.4597 35.93 35.0097C35.93 35.5597 35.48 36.0097 34.93 36.0097L34.95 35.9997Z" fill="#223C61"/>
</svg>
