<svg width="24" height="24" viewBox="0 0 24 24" fill="none" xmlns="http://www.w3.org/2000/svg">
<path fill-rule="evenodd" clip-rule="evenodd" d="M6.01005 2.85858C6.08043 2.36593 6.50235 2 7 2H17C17.4977 2 17.9196 2.36593 17.9899 2.85858L18.9899 9.85858C18.9966 9.90542 19 9.95268 19 10C19 13.4101 16.2411 15.5734 13 15.9434V20H16C16.5523 20 17 20.4477 17 21C17 21.5523 16.5523 22 16 22H8C7.44772 22 7 21.5523 7 21C7 20.4477 7.44772 20 8 20H11V15.9434C7.75893 15.5734 5 13.4101 5 10C5 9.95268 5.00336 9.90542 5.01005 9.85858L6.01005 2.85858ZM7.8673 4L7.00059 10.0669C7.04002 12.3016 9.05358 14 12 14C14.9464 14 16.96 12.3016 16.9994 10.0669L16.1327 4H7.8673Z" fill="#223C61"/>
</svg>
