{
  "todo": {
    "backdrop": {
      "background-color": {
        "value": "{voorbeeld.color.black}",
        "type": "color"
      },
      "color": {
        "value": "{voorbeeld.color.white}",
        "type": "color"
      },
      "opacity": {
        "value": "0.2",
        "type": "opacity"
      },
      "reduced-transparency": {
        "opacity": {
          "value": "0.98",
          "type": "opacity"
        }
      },
      "z-index": {
        "value": "auto",
        "type": "other"
      },
      "fade-in": {
        "animation-duration": {
          "value": "0.4s",
          "type": "other"
        }
      }
    }
  }
}
