{
  "utrecht": {
    "textarea": {
      "max-inline-size": {
        "value": "400px",
        "type": "sizing"
      },
      "padding-block-end": {
        "value": "{voorbeeld.space.block.snail}",
        "type": "spacing"
      },
      "padding-block-start": {
        "value": "{voorbeeld.space.block.snail}",
        "type": "spacing"
      },
      "padding-inline-end": {
        "value": "{voorbeeld.space.inline.snail}",
        "type": "spacing"
      },
      "padding-inline-start": {
        "value": "{voorbeeld.space.inline.snail}",
        "type": "spacing"
      },
      "background-color": {
        "value": "{utrecht.form-control.background-color}",
        "type": "color"
      },
      "border-color": {
        "value": "{utrecht.form-control.border-color}",
        "type": "color"
      },
      "color": {
        "value": "{utrecht.form-control.color}",
        "type": "color"
      },
      "invalid": {
        "background-color": {
          "value": "{utrecht.form-control.invalid.background-color}",
          "type": "color"
        },
        "border-color": {
          "value": "{utrecht.form-control.invalid.border-color}",
          "type": "color"
        },
        "color": {
          "value": "{utrecht.form-control.color}",
          "type": "color"
        },
        "border-width": {
          "value": "{utrecht.form-control.invalid.border-width}",
          "type": "borderWidth"
        }
      },
      "placeholder": {
        "color": {
          "value": "{utrecht.form-control.placeholder.color}",
          "type": "color"
        }
      },
      "focus": {
        "background-color": {
          "value": "{utrecht.form-control.focus.background-color}",
          "type": "color"
        },
        "border-color": {
          "value": "{utrecht.form-control.focus.border-color}",
          "type": "color"
        },
        "color": {
          "value": "{utrecht.form-control.focus.color}",
          "type": "color"
        },
        "border-width": {
          "value": "{utrecht.form-control.focus.border-width}",
          "type": "borderWidth"
        }
      },
      "disabled": {
        "background-color": {
          "value": "{utrecht.form-control.disabled.background-color}",
          "type": "color"
        },
        "border-color": {
          "value": "{utrecht.form-control.disabled.border-color}",
          "type": "color"
        },
        "color": {
          "value": "{utrecht.form-control.disabled.color}",
          "type": "color"
        }
      },
      "read-only": {
        "background-color": {
          "value": "{utrecht.form-control.read-only.background-color}",
          "type": "color"
        },
        "border-color": {
          "value": "{utrecht.form-control.read-only.border-color}",
          "type": "color"
        },
        "color": {
          "value": "{utrecht.form-control.read-only.color}",
          "type": "color"
        }
      },
      "hover": {
        "background-color": {
          "value": "{utrecht.form-control.hover.background-color}",
          "type": "color"
        },
        "border-color": {
          "value": "{utrecht.form-control.hover.border-color}",
          "type": "color"
        },
        "color": {
          "value": "{utrecht.form-control.hover.color}",
          "type": "color"
        },
        "border-width": {
          "value": "{utrecht.form-control.hover.border-width}",
          "type": "borderWidth"
        }
      },
      "border-radius": {
        "type": "borderRadius",
        "value": "0px"
      },
      "border-bottom-width": {
        "value": "auto",
        "type": "borderWidth"
      },
      "border-width": {
        "value": "{utrecht.form-control.border-width}",
        "type": "borderWidth"
      },
      "font-family": {
        "value": "{utrecht.document.font-family}",
        "type": "fontFamilies"
      },
      "font-weight": {
        "value": "{utrecht.document.font-weight}",
        "type": "fontWeights"
      },
      "line-height": {
        "value": "{utrecht.document.line-height}",
        "type": "lineHeights"
      },
      "font-size": {
        "value": "{utrecht.document.font-size}",
        "type": "fontSizes"
      }
    }
  }
}
