<svg width="24" height="24" viewBox="0 0 24 24" fill="none" xmlns="http://www.w3.org/2000/svg">
<path fill-rule="evenodd" clip-rule="evenodd" d="M21.7071 2.29292C21.9813 2.56708 22.0723 2.975 21.9406 3.33967L15.4406 21.3397C15.4311 21.3657 15.4207 21.3914 15.4091 21.4166C15.1566 21.9676 14.6061 22.3209 14 22.3209C13.401 22.3209 12.8563 21.9758 12.5999 21.4359L9.25465 14.7454L2.56417 11.4001C2.0242 11.1437 1.67914 10.599 1.67914 10C1.67914 9.39393 2.03241 8.84344 2.58341 8.59094C2.60862 8.57939 2.63429 8.56889 2.66036 8.55947L20.6604 2.05947C21.025 1.92779 21.433 2.01876 21.7071 2.29292ZM4.37177 10.0679L10.4472 13.1056C10.6408 13.2024 10.7977 13.3593 10.8944 13.5528L13.9322 19.6283L19.3359 4.66417L4.37177 10.0679Z" fill="#223C61"/>
</svg>
