<svg width="48" height="48" viewBox="0 0 48 48" fill="none" xmlns="http://www.w3.org/2000/svg">
<path d="M19.01 35.0002H18.99C18.4432 35.0002 18 35.4435 18 35.9902V37.0102C18 37.557 18.4432 38.0002 18.99 38.0002H19.01C19.5568 38.0002 20 37.557 20 37.0102V35.9902C20 35.4435 19.5568 35.0002 19.01 35.0002Z" fill="#223C61"/>
<path d="M11.01 34.0002H10.99C10.4432 34.0002 10 34.4435 10 34.9902V37.0102C10 37.557 10.4432 38.0002 10.99 38.0002H11.01C11.5568 38.0002 12 37.557 12 37.0102V34.9902C12 34.4435 11.5568 34.0002 11.01 34.0002Z" fill="#223C61"/>
<path d="M14.99 31.0002C14.44 31.0002 14 31.4502 14 31.9902V37.0002C14.01 37.5502 14.46 37.9902 15 37.9902C15.55 37.9902 15.99 37.5402 15.99 37.0002V31.9902C15.98 31.4402 15.53 31.0002 14.98 31.0002H14.99Z" fill="#223C61"/>
<path d="M16 27.0002L15.97 20.0102C15.97 18.9102 16.87 18.0102 17.97 18.0102H20.59C21.14 18.0102 21.59 17.5602 21.59 17.0102C21.59 16.4602 21.14 16.0102 20.59 16.0102H18.01C15.8 16.0102 14.01 17.8102 14.01 20.0202V27.0002H9.52001C7.58001 27.0002 6.01001 28.5702 6.01001 30.5102V38.4902C6.02001 40.4202 7.60001 42.0002 9.54001 42.0002H20.5C22.44 42.0002 24.01 40.4302 24.01 38.4902V30.5102C24 28.5802 22.42 27.0002 20.48 27.0002H16ZM20.5 40.0002H9.51001C8.67001 40.0002 8.00001 39.3302 8.00001 38.4902V30.5002C7.99001 29.6702 8.66001 28.9902 9.50001 28.9902H20.49C21.33 28.9902 22 29.6602 22 30.5002V38.4902C22.01 39.3202 21.34 40.0002 20.5 40.0002Z" fill="#223C61"/>
<path d="M22.49 19.5102C22.49 21.9402 24.42 23.9002 26.82 24.0002H27V24.0202C29.49 24.0202 31.51 22.0002 31.51 19.5102C31.51 17.0202 29.49 15.0002 27 15.0002C24.51 15.0002 22.49 17.0202 22.49 19.5102ZM27 17.0002C28.38 17.0002 29.51 18.1302 29.51 19.5102C29.51 20.8902 28.38 22.0202 27 22.0202C25.62 22.0202 24.49 20.8902 24.49 19.5102C24.49 18.1302 25.62 17.0002 27 17.0002Z" fill="#223C61"/>
<path d="M32.47 15.0102C34.96 15.0102 36.98 12.9902 36.98 10.5002C36.98 8.01023 34.96 5.99023 32.47 5.99023C29.98 5.99023 27.96 8.01023 27.96 10.5002C27.96 12.9902 29.98 15.0102 32.47 15.0102ZM32.47 7.99023C33.85 7.99023 34.98 9.12023 34.98 10.5002C34.98 11.8802 33.85 13.0102 32.47 13.0102C31.09 13.0102 29.96 11.8802 29.96 10.5002C29.96 9.12023 31.09 7.99023 32.47 7.99023Z" fill="#223C61"/>
<path d="M21.51 15.0102C24 15.0102 26.02 12.9902 26.02 10.5002C26.02 8.01023 24 5.99023 21.51 5.99023C19.02 5.99023 17 8.01023 17 10.5002C17 12.9902 19.02 15.0102 21.51 15.0102ZM21.51 7.99023C22.89 7.99023 24.02 9.12023 24.02 10.5002C24.02 11.8802 22.89 13.0102 21.51 13.0102C20.13 13.0102 19 11.8802 19 10.5002C19 9.12023 20.13 7.99023 21.51 7.99023Z" fill="#223C61"/>
<path d="M36 16.0102H33.52C32.97 16.0102 32.52 16.4502 32.52 17.0002C32.52 17.5502 32.97 18.0002 33.52 18.0002H36C37.1 18.0002 38 18.9002 38 20.0102V29.0102H35V41.0102C35 41.5602 35.45 42.0102 36 42.0102C36.55 42.0102 37 41.5602 37 41.0102V31.0102H39C39.55 31.0102 40 30.5602 40 30.0102V20.0102C40 17.8002 38.21 16.0102 36 16.0102Z" fill="#223C61"/>
<path d="M29.94 25.0102H24.51C23.96 25.0102 23.51 25.4502 23.51 26.0002C23.51 26.5502 23.96 27.0002 24.51 27.0002H29.95C30.54 27.0002 31.01 27.4802 31.01 28.0702V33.0102H29.01V41.0002C29.01 41.5502 29.46 42.0002 30.01 42.0002H29.97C29.97 42.0002 29.99 42.0002 30.01 42.0002C30.56 42.0002 31.01 41.5502 31.01 41.0002V35.0002H32.01C32.56 35.0002 33.01 34.5502 33.01 34.0002V28.0602C33.01 26.3702 31.64 25.0002 29.95 25.0002L29.94 25.0102Z" fill="#223C61"/>
</svg>
