<svg width="24" height="24" viewBox="0 0 24 24" fill="none" xmlns="http://www.w3.org/2000/svg">
<path fill-rule="evenodd" clip-rule="evenodd" d="M12.22 1.02816C12.6725 1.13364 12.9928 1.53694 12.993 2.00161L13 17.7496C13.0002 18.1212 12.7943 18.4622 12.4654 18.6352L6.29336 21.8802C5.95644 22.0573 5.54817 22.0278 5.24022 21.8041C4.93226 21.5803 4.77804 21.2012 4.8424 20.826L5.93243 14.4716L1.30949 9.97162C1.03659 9.70599 0.93827 9.3084 1.0559 8.94619C1.17352 8.58397 1.48668 8.32001 1.86357 8.26539L8.24304 7.34083L11.0963 1.55949C11.3019 1.14281 11.7675 0.922676 12.22 1.02816ZM10.9949 6.28402L9.80374 8.69761C9.65802 8.99288 9.37629 9.19748 9.05043 9.24471L4.15841 9.9537L7.70451 13.4055C7.94054 13.6352 8.0483 13.9665 7.99261 14.2911L7.1562 19.1669L10.9997 17.1462L10.9949 6.28402Z" fill="#223C61"/>
</svg>
