<svg width="48" height="48" viewBox="0 0 48 48" fill="none" xmlns="http://www.w3.org/2000/svg">
<path d="M9.99 11C7.79 11 6 12.79 6 14.99V33.02C6 35.22 7.79 37.01 9.99 37.01H38.02C40.22 37.01 42.01 35.22 42.01 33.02V14.99C42.01 12.79 40.22 11 38.02 11H9.99ZM40 33.01C40 34.11 39.11 35 38.01 35H9.99C8.89 35 8 34.11 8 33.01V14.99C8 13.89 8.89 13 9.99 13H23V16C23 16.55 23.45 17 24 17C24.55 17 25 16.55 25 16V13H38.01C39.11 13 40 13.89 40 14.99V33.02V33.01Z" fill="#223C61"/>
<path d="M33 29H28C27.45 29 27 29.45 27 30C27 30.55 27.45 31 28 31H33C33.55 31 34 30.55 34 30C34 29.45 33.55 29 33 29Z" fill="#223C61"/>
<path d="M22.93 23.58L21.63 20.19C21.4 19.48 20.74 19 19.99 19H14.04C13.3 19 12.65 19.47 12.4 20.18L11.08 23.56C11.03 23.71 11 23.88 11 24.04V29.99C11 30.53 11.44 30.97 11.98 30.97C11.99 30.97 12 30.97 12.01 30.97C12.56 30.97 13 30.53 13 29.99V29.01L21 28.97V30.02C21 30.56 21.44 31 21.98 31H22.01C22.55 31 23 30.56 23 30.02V24.06C23 23.9 22.97 23.74 22.92 23.58H22.93ZM14.27 21H19.71L20.48 23H13.57L14.27 21ZM21 27H13V25H21V27Z" fill="#223C61"/>
<path d="M35 19H28C27.45 19 27 19.45 27 20C27 20.55 27.45 21 28 21H35C35.55 21 36 20.55 36 20C36 19.45 35.55 19 35 19Z" fill="#223C61"/>
<path d="M35 24H28C27.45 24 27 24.45 27 25C27 25.55 27.45 26 28 26H35C35.55 26 36 25.55 36 25C36 24.45 35.55 24 35 24Z" fill="#223C61"/>
</svg>
