<svg width="48" height="48" viewBox="0 0 48 48" fill="none" xmlns="http://www.w3.org/2000/svg">
<path d="M25.57 38.74L10.68 39.84C8.48 40.01 6.56 38.35 6.39 36.15L6.01 31.16C5.87 29.31 7.03 27.66 8.71 27.09L8.55 24.95C8.38 22.75 10.04 20.83 12.24 20.66L25.42 19.7C25.97 19.66 26.45 20.07 26.49 20.62C26.53 21.17 26.12 21.65 25.57 21.69L20.84 22.02L19.18 25.15L19.83 25.1C20.61 25.04 21.15 25.85 20.8 26.55L19.23 29.68C19.07 29.99 18.76 30.2 18.41 30.23H18.32C17.53 30.3 16.99 29.47 17.36 28.77L18.17 27.24L17.52 27.29C16.74 27.35 16.2 26.54 16.55 25.84L18.37 22.21L12.39 22.66C11.29 22.74 10.46 23.7 10.55 24.8L10.71 26.94C12.46 27.26 13.85 28.71 13.99 30.56L14.14 32.55L25.42 31.75C25.97 31.71 26.45 32.12 26.49 32.67C26.53 33.22 26.12 33.7 25.57 33.74L12.3 34.69L12.15 32.7L12 30.71C11.91 29.5 10.75 28.62 9.52 28.92C8.55 29.16 7.94 30.13 8.02 31.12L8.39 35.99C8.47 37.09 9.43 37.92 10.53 37.83L25.42 36.73C25.97 36.69 26.45 37.1 26.49 37.65C26.53 38.2 26.12 38.68 25.57 38.72V38.74ZM38.25 37.73L38.32 38.73C38.36 39.28 37.95 39.76 37.4 39.8C36.85 39.84 36.37 39.43 36.33 38.88L36.26 37.88L30.01 38.3V40H33.01C33.56 40 34.01 40.45 34.01 41C34.01 41.55 33.56 42 33.01 42H25.01C24.46 42 24.01 41.55 24.01 41C24.01 40.45 24.46 40 25.01 40H28.02V15.03H24.27C23.63 15.03 23.16 14.44 23.29 13.81L24.85 6.78C24.95 6.32 25.36 6 25.83 6H32.22C32.69 6 33.09 6.32 33.2 6.78L34.78 13.81C34.92 14.44 34.45 15.03 33.8 15.03H30.02V19.25L33.89 19C36.07 18.87 37.97 20.51 38.14 22.7L38.3 24.84C40.05 25.16 41.44 26.61 41.58 28.46L41.96 33.45C42.13 35.65 40.47 37.57 38.27 37.74L38.25 37.73ZM30 21.25V31.28L33.73 31.04L33.58 29.06C33.44 27.21 34.6 25.56 36.28 24.99L36.12 22.85C36.04 21.75 35.08 20.92 33.98 21.01L32.62 21.1C32.62 21.1 32.59 21.1 32.58 21.1L30 21.27V21.25ZM30 13.02H32.53L31.4 7.99H26.61L25.5 13.02H30ZM39.94 33.58L39.56 28.59C39.47 27.38 38.31 26.5 37.08 26.8C36.11 27.04 35.51 28.01 35.58 29L35.8 31.88C35.84 32.43 35.43 32.91 34.88 32.95L30 33.26V36.27L38.09 35.71C39.19 35.63 40.02 34.67 39.93 33.57L39.94 33.58Z" fill="#223C61"/>
</svg>
