<svg width="24" height="24" viewBox="0 0 24 24" fill="none" xmlns="http://www.w3.org/2000/svg">
<path fill-rule="evenodd" clip-rule="evenodd" d="M10.6755 2.05419C11.0795 1.91554 11.5271 2.0489 11.7894 2.38612L18.7894 11.3861C19.0238 11.6876 19.0661 12.0963 18.8983 12.4394C18.7305 12.7825 18.3819 13.0001 18 13.0001H11C10.4477 13.0001 10 12.5523 10 12.0001V3.00006C10 2.57286 10.2714 2.19283 10.6755 2.05419ZM12 5.9146V11.0001H15.9554L12 5.9146ZM8.37139 6.07158C8.88417 6.2767 9.13359 6.85867 8.92848 7.37145L6.92848 12.3715C6.72336 12.8842 6.14139 13.1336 5.62861 12.9285C5.11583 12.7234 4.86641 12.1415 5.07152 11.6287L7.07152 6.62867C7.27664 6.11589 7.85861 5.86647 8.37139 6.07158ZM2.18876 14.4153C2.37671 14.1546 2.67856 14.0001 3 14.0001H21C21.3214 14.0001 21.6233 14.1546 21.8112 14.4153C21.9992 14.6761 22.0503 15.0113 21.9487 15.3163L20.9487 18.3163C20.774 18.8402 20.2077 19.1234 19.6838 18.9487C19.1598 18.7741 18.8767 18.2078 19.0513 17.6838L19.6126 16.0001H4.38743L4.94868 17.6838C5.12333 18.2078 4.84017 18.7741 4.31623 18.9487C3.79228 19.1234 3.22596 18.8402 3.05132 18.3163L2.05132 15.3163C1.94967 15.0113 2.00081 14.6761 2.18876 14.4153ZM7.97906 19.9998C7.51781 19.9902 7.08141 20.2084 6.81239 20.5832C6.16313 21.4877 5.11243 22.0167 4 22.0002C2.88757 22.0167 1.83687 21.4877 1.18761 20.5832C0.865564 20.1345 0.968215 19.5097 1.41689 19.1877C1.86556 18.8656 2.49034 18.9683 2.81239 19.4169C3.08141 19.7917 3.51781 20.0099 3.97906 20.0003C3.99302 20 4.00698 20 4.02094 20.0003C4.48219 20.0099 4.91859 19.7917 5.18761 19.4169C5.83687 18.5124 6.88757 17.9834 8 17.9999C9.11243 17.9834 10.1631 18.5124 10.8124 19.4169C11.0814 19.7917 11.5178 20.0099 11.9791 20.0003C11.993 20 12.007 20 12.0209 20.0003C12.4822 20.0099 12.9186 19.7917 13.1876 19.4169C13.8369 18.5124 14.8876 17.9834 16 17.9999C17.1124 17.9834 18.1631 18.5124 18.8124 19.4169C19.0814 19.7917 19.5178 20.0099 19.9791 20.0003C19.993 20 20.007 20 20.0209 20.0003C20.4822 20.0099 20.9186 19.7917 21.1876 19.4169C21.5097 18.9683 22.1344 18.8656 22.5831 19.1877C23.0318 19.5097 23.1344 20.1345 22.8124 20.5832C22.1631 21.4877 21.1124 22.0167 20 22.0002C18.8876 22.0167 17.8369 21.4877 17.1876 20.5832C16.9186 20.2084 16.4822 19.9902 16.0209 19.9998C16.007 20.0001 15.993 20.0001 15.9791 19.9998C15.5178 19.9902 15.0814 20.2084 14.8124 20.5832C14.1631 21.4877 13.1124 22.0167 12 22.0002C10.8876 22.0167 9.83687 21.4877 9.18761 20.5832C8.91859 20.2084 8.48219 19.9902 8.02094 19.9998C8.00698 20.0001 7.99302 20.0001 7.97906 19.9998Z" fill="#223C61"/>
</svg>
