<svg width="48" height="48" viewBox="0 0 48 48" fill="none" xmlns="http://www.w3.org/2000/svg">
<path d="M38 20C36.14 20 34.59 21.28 34.14 23H31.93C31.75 21.54 31.17 20.2 30.32 19.1L32.85 16.57C33.34 16.84 33.9 17 34.5 17C36.43 17 38 15.43 38 13.5C38 11.57 36.43 10 34.5 10C32.57 10 31 11.57 31 13.5C31 14.1 31.17 14.66 31.43 15.15L28.9 17.68C27.79 16.82 26.46 16.24 25 16.06V13.86C26.72 13.41 28 11.86 28 10C28 7.79 26.21 6 24 6C21.79 6 20 7.79 20 10C20 11.86 21.28 13.41 23 13.86V16.06C21.54 16.24 20.2 16.82 19.09 17.68L15.57 14.16C15.84 13.67 16 13.11 16 12.51C16 10.58 14.43 9.01 12.5 9.01C10.57 9.01 8.99999 10.58 8.99999 12.51C8.99999 14.44 10.57 16.01 12.5 16.01C13.1 16.01 13.66 15.84 14.15 15.58L17.67 19.1C16.81 20.21 16.23 21.55 16.05 23.01H13.85C13.4 21.29 11.85 20.01 9.98999 20.01C7.77999 20.01 5.98999 21.8 5.98999 24.01C5.98999 26.22 7.77999 28.01 9.98999 28.01C11.85 28.01 13.4 26.73 13.85 25.01H16.05C16.23 26.47 16.81 27.81 17.67 28.91L14.27 32.31C13.88 32.12 13.45 32.01 12.98 32.01C11.32 32.01 9.97999 33.35 9.97999 35.01C9.97999 36.67 11.32 38.01 12.98 38.01C14.64 38.01 15.98 36.67 15.98 35.01C15.98 34.55 15.87 34.12 15.68 33.72L19.08 30.32C20.19 31.18 21.52 31.75 22.98 31.93V34.57C21.27 34.92 19.98 36.43 19.98 38.24C19.98 40.31 21.66 41.99 23.73 41.99C25.8 41.99 27.48 40.31 27.48 38.24C27.48 36.61 26.43 35.24 24.98 34.72V31.92C26.44 31.74 27.77 31.16 28.88 30.3L30.55 31.97C30.2 32.56 29.98 33.25 29.98 33.99C29.98 36.2 31.77 37.99 33.98 37.99C36.19 37.99 37.98 36.2 37.98 33.99C37.98 31.78 36.19 29.99 33.98 29.99C33.24 29.99 32.55 30.21 31.96 30.56L30.29 28.89C31.15 27.78 31.72 26.45 31.91 24.99H34.12C34.57 26.71 36.12 27.99 37.98 27.99C40.19 27.99 41.98 26.2 41.98 23.99C41.98 21.78 40.19 19.99 37.98 19.99L38 20ZM34.5 12C35.33 12 36 12.67 36 13.5C36 14.33 35.33 15 34.5 15C33.67 15 33 14.33 33 13.5C33 12.67 33.67 12 34.5 12ZM12.5 14C11.67 14 11 13.33 11 12.5C11 11.67 11.67 11 12.5 11C13.33 11 14 11.67 14 12.5C14 13.33 13.33 14 12.5 14ZM9.99999 26C8.89999 26 7.99999 25.1 7.99999 24C7.99999 22.9 8.89999 22 9.99999 22C11.1 22 12 22.9 12 24C12 25.1 11.1 26 9.99999 26ZM13 36C12.45 36 12 35.55 12 35C12 34.45 12.45 34 13 34C13.55 34 14 34.45 14 35C14 35.55 13.55 36 13 36ZM34 32C35.1 32 36 32.9 36 34C36 35.1 35.1 36 34 36C32.9 36 32 35.1 32 34C32 32.9 32.9 32 34 32ZM22 10C22 8.9 22.9 8 24 8C25.1 8 26 8.9 26 10C26 11.1 25.1 12 24 12C22.9 12 22 11.1 22 10ZM25.5 38.25C25.5 39.21 24.71 40 23.75 40C22.79 40 22 39.21 22 38.25C22 37.29 22.79 36.5 23.75 36.5C24.71 36.5 25.5 37.29 25.5 38.25ZM24 30C20.69 30 18 27.31 18 24C18 20.69 20.69 18 24 18C27.31 18 30 20.69 30 24C30 27.31 27.31 30 24 30ZM38 26C36.9 26 36 25.1 36 24C36 22.9 36.9 22 38 22C39.1 22 40 22.9 40 24C40 25.1 39.1 26 38 26Z" fill="#223C61"/>
<path d="M24 25C24.55 25 25 24.55 25 24V21C25 20.45 24.55 20 24 20C23.45 20 23 20.45 23 21V24C23 24.55 23.45 25 24 25Z" fill="#223C61"/>
<path d="M24.07 26C23.77 26 23.53 26.09 23.35 26.28C23.16 26.47 23.07 26.71 23.07 27C23.07 27.29 23.16 27.53 23.35 27.72C23.54 27.91 23.78 28 24.07 28C24.36 28 24.61 27.91 24.79 27.72C24.98 27.53 25.07 27.29 25.07 27C25.07 26.71 24.98 26.47 24.79 26.28C24.6 26.09 24.36 26 24.07 26Z" fill="#223C61"/>
</svg>
