<svg width="48" height="48" viewBox="0 0 48 48" fill="none" xmlns="http://www.w3.org/2000/svg">
<path d="M41.97 24C41.84 20.44 39.16 17.35 35.59 17.05C31.81 16.73 28.58 19.44 28.06 23.01H24.97V21C24.97 20.58 24.71 20.21 24.32 20.06L16.32 17.06C16.21 17.02 16.09 17 15.97 17H12.97C12.42 17 11.97 17.45 11.97 18V20H6.96999C6.41999 20 5.96999 20.45 5.96999 21C5.96999 21.55 6.41999 22 6.96999 22H11.97V26H6.92999C6.37999 26 5.92999 26.45 5.92999 27C5.92999 27.55 6.37999 28 6.92999 28H11.98V30C11.98 30.55 12.43 31 12.98 31H15.98C16.1 31 16.22 30.98 16.33 30.94L24.33 27.94C24.72 27.79 24.98 27.42 24.98 27V25.01H28.07C28.56 28.39 31.47 31 34.99 31C36.85 31 38.63 30.25 39.93 28.95C40.36 28.52 40.28 27.79 39.79 27.44C39.39 27.15 38.85 27.21 38.5 27.55C37.57 28.47 36.31 28.99 34.99 28.99C32.58 28.99 30.57 27.27 30.1 25H40.98C41.53 25 41.98 24.54 41.98 23.99L41.97 24ZM22.97 26.31L15.79 29H13.97V19H15.79L22.97 21.69V26.3V26.31ZM30.09 23.01C30.55 20.74 32.57 19.02 34.98 19.02C37.39 19.02 39.4 20.74 39.87 23.01H30.09Z" fill="#223C61"/>
</svg>
