<svg width="48" height="48" viewBox="0 0 48 48" fill="none" xmlns="http://www.w3.org/2000/svg">
<path d="M14 8C17.31 8 20 10.69 20 14C20 17.31 17.31 20 14 20C10.69 20 8 17.31 8 14C8 10.69 10.69 8 14 8ZM14 6C9.58 6 6 9.58 6 14C6 18.42 9.58 22 14 22C18.42 22 22 18.42 22 14C22 9.58 18.42 6 14 6Z" fill="#223C61"/>
<path d="M15 11C15 10.4477 14.5523 10 14 10C13.4477 10 13 10.4477 13 11V14C13 14.5523 13.4477 15 14 15C14.5523 15 15 14.5523 15 14V11Z" fill="#223C61"/>
<path d="M14.79 17.72C14.6 17.91 14.36 18 14.07 18C13.78 18 13.53 17.91 13.35 17.72C13.16 17.53 13.07 17.29 13.07 17C13.07 16.71 13.16 16.47 13.35 16.28C13.54 16.09 13.78 16 14.07 16C14.36 16 14.61 16.09 14.79 16.28C14.98 16.47 15.07 16.71 15.07 17C15.07 17.29 14.98 17.53 14.79 17.72Z" fill="#223C61"/>
<path d="M37.67 35.04L31.82 11.76C31.71 11.32 31.31 11 30.85 11H26.06C25.6 11 25.2 11.31 25.09 11.76L19.24 35.03C16.83 35.11 15 37.09 15 39.52V41C15 41.55 15.45 42 16 42H40.97C41.52 42 41.97 41.55 41.97 41V39.52C41.97 37.11 40.06 35.15 37.68 35.04H37.67ZM33.59 27H23.31L24.81 21H32.08L33.58 27H33.59ZM34.09 29L35.6 35.01H21.31L22.82 29H34.1H34.09ZM30.08 13.01L31.58 19H25.31L26.81 13.01H30.08ZM39.96 40H17V39.52C17 38.15 17.99 37.08 19.31 37.03L20 37.01H37L37.58 37.03C38.92 37.09 39.97 38.18 39.97 39.51V39.99L39.96 40Z" fill="#223C61"/>
</svg>
