<svg width="48" height="48" viewBox="0 0 48 48" fill="none" xmlns="http://www.w3.org/2000/svg">
<path d="M16 20C16 20.55 15.55 21 15 21C14.45 21 14 20.55 14 20C14 19.45 14.45 19 15 19C15.55 19 16 19.45 16 20ZM15 23C14.45 23 14 23.45 14 24C14 24.55 14.45 25 15 25C15.55 25 16 24.55 16 24C16 23.45 15.55 23 15 23ZM15 15C14.45 15 14 15.45 14 16C14 16.55 14.45 17 15 17C15.55 17 16 16.55 16 16C16 15.45 15.55 15 15 15ZM33 19H19C18.45 19 18 19.45 18 20C18 20.55 18.45 21 19 21H33C33.55 21 34 20.55 34 20C34 19.45 33.55 19 33 19ZM27 23H19C18.45 23 18 23.45 18 24C18 24.55 18.45 25 19 25H27C27.55 25 28 24.55 28 24C28 23.45 27.55 23 27 23ZM33 15H19C18.45 15 18 15.45 18 16C18 16.55 18.45 17 19 17H33C33.55 17 34 16.55 34 16C34 15.45 33.55 15 33 15ZM42 10.98V30C42 31.66 40.66 33 39 33L27.71 32.98V34.69C27.71 36.5 29.19 37.98 31 37.98L32 38C32.55 38 33 38.45 33 39C33 39.55 32.55 40 32 40H16C15.45 40 15 39.55 15 39C15 38.45 15.45 38 16 38L16.71 37.98C18.52 37.98 20 36.5 20 34.69V32.98L9 33C7.34 33 6 31.66 6 30V10.98C6 9.31998 7.34 7.97998 9 7.97998H39C40.66 7.97998 42 9.31998 42 10.98ZM26.89 37.98C26.16 37.07 25.71 35.94 25.71 34.69V32.98H22V34.69C22 35.94 21.55 37.07 20.82 37.98H26.89ZM40 10.99C40 10.44 39.55 9.98998 39 9.98998H9C8.45 9.98998 8 10.44 8 10.99V30.01C8 30.56 8.45 31.01 9 31.01H39C39.55 31.01 40 30.56 40 30.01V11V10.99Z" fill="#223C61"/>
</svg>
