<svg width="48" height="48" viewBox="0 0 48 48" fill="none" xmlns="http://www.w3.org/2000/svg">
<path d="M34 23.0205H29C27.34 23.0205 26 24.3605 26 26.0205V27.0205C26 27.5705 26.45 28.0205 27 28.0205C27.55 28.0205 28 27.5705 28 27.0205V26.0205C28 25.6605 28.18 25.4205 28.29 25.3105C28.4 25.2005 28.64 25.0205 29 25.0205H34C34.34 25.0205 34.94 25.6505 34.94 26.0205V27.0205C34.94 27.5705 35.39 28.0205 35.94 28.0205C36.49 28.0205 36.94 27.5705 36.94 27.0205V26.0205C36.94 24.5705 35.46 23.0205 34 23.0205Z" fill="#223C61"/>
<path d="M31.51 22.0205C34 22.0205 36.02 20.0005 36.02 17.5105C36.02 15.0205 34 13.0005 31.51 13.0005C29.02 13.0005 27 15.0205 27 17.5105C27 20.0005 29.02 22.0205 31.51 22.0205ZM31.51 15.0005C32.89 15.0005 34.02 16.1305 34.02 17.5105C34.02 18.8905 32.89 20.0205 31.51 20.0205C30.13 20.0205 29 18.8905 29 17.5105C29 16.1305 30.13 15.0005 31.51 15.0005Z" fill="#223C61"/>
<path d="M39 7.98047H9C7.34 7.98047 6 9.32047 6 10.9805V30.0005C6 31.6605 7.34 33.0005 9 33.0005L20 32.9805V34.6905C20 36.5005 18.52 37.9805 16.71 37.9805L16 38.0005C15.45 38.0005 15 38.4505 15 39.0005C15 39.5505 15.45 40.0005 16 40.0005H32C32.55 40.0005 33 39.5505 33 39.0005C33 38.4505 32.55 38.0005 32 38.0005L31 37.9805C29.19 37.9805 27.71 36.5005 27.71 34.6905V32.9805L39 33.0005C40.66 33.0005 42 31.6605 42 30.0005V10.9805C42 9.32047 40.66 7.98047 39 7.98047ZM26.89 37.9805H20.82C21.55 37.0705 22 35.9405 22 34.6905V32.9805H25.71V34.6905C25.71 35.9405 26.16 37.0705 26.89 37.9805ZM40 30.0105C40 30.5605 39.55 31.0105 39 31.0105H9C8.45 31.0105 8 30.5605 8 30.0105V11.0005C8 10.4505 8.45 10.0005 9 10.0005H39.01C39.56 10.0005 40.01 10.4505 40.01 11.0005V30.0105H40Z" fill="#223C61"/>
<path d="M19.06 23.0205H14.06C12.4 23.0205 11.06 24.3605 11.06 26.0205V27.0205C11.06 27.5705 11.51 28.0205 12.06 28.0205C12.61 28.0205 13.06 27.5705 13.06 27.0205V26.0205C13.06 25.6605 13.24 25.4205 13.35 25.3105C13.46 25.2005 13.7 25.0205 14.06 25.0205H19.06C19.4 25.0205 20 25.6505 20 26.0205V27.0205C20 27.5705 20.45 28.0205 21 28.0205C21.55 28.0205 22 27.5705 22 27.0205V26.0205C22 24.5705 20.52 23.0205 19.06 23.0205Z" fill="#223C61"/>
<path d="M16.57 22.0205C19.06 22.0205 21.08 20.0005 21.08 17.5105C21.08 15.0205 19.06 13.0005 16.57 13.0005C14.08 13.0005 12.06 15.0205 12.06 17.5105C12.06 20.0005 14.08 22.0205 16.57 22.0205ZM16.57 15.0005C17.95 15.0005 19.08 16.1305 19.08 17.5105C19.08 18.8905 17.95 20.0205 16.57 20.0205C15.19 20.0205 14.06 18.8905 14.06 17.5105C14.06 16.1305 15.19 15.0005 16.57 15.0005Z" fill="#223C61"/>
</svg>
