<svg width="48" height="48" viewBox="0 0 48 48" fill="none" xmlns="http://www.w3.org/2000/svg">
<path d="M34 32C35.1 32 36 31.1 36 30C36 28.9 35.1 28 34 28C32.9 28 32 28.9 32 30C32 31.1 32.9 32 34 32Z" fill="#223C61"/>
<path d="M18 16C20.76 16 23 13.76 23 11C23 8.24 20.76 6 18 6C15.24 6 13 8.24 13 11C13 13.76 15.24 16 18 16ZM18 8C19.66 8 21 9.34 21 11C21 12.66 19.66 14 18 14C16.34 14 15 12.66 15 11C15 9.34 16.34 8 18 8Z" fill="#223C61"/>
<path d="M40 24H39V21C39 19 38 18 36 18H32C31.98 15.25 29.75 13.03 27 13.03C24.25 13.03 22.02 15.26 22 18H8C7 18 6 19.01 6 20V40.01C6 41.01 7.01 42.01 8 42.01H36C37.66 42.01 39 40.66 39 39.01V36.01H40C41.09 36.01 42 35.09 42 34V26C42 24.91 41.09 24 40 24ZM27 15C28.65 15 29.99 16.34 30 17.98H24C24 16.33 25.35 15 27 15ZM37 39C37 39.55 36.55 40 36 40H8V19.99H36C36.55 20 37 20.45 37 21V24H30.04C28.91 24 28 24.91 28 26.04V33.93C28 35.07 28.92 36 30.06 36H37V39ZM40 34H30V26H40V34Z" fill="#223C61"/>
<path d="M20.12 25C20.91 25 21.67 25.32 22.32 25.93C22.72 26.31 23.36 26.29 23.73 25.89C24.11 25.49 24.09 24.85 23.69 24.48C22.67 23.52 21.43 23.01 20.12 23.01C17.81 23.01 15.82 24.65 14.89 27.01H14C13.45 27.01 13 27.46 13 28.01C13 28.56 13.45 29.01 14 29.01H14.38C14.34 29.34 14.31 29.67 14.31 30.01C14.31 30.35 14.34 30.68 14.38 31.01H14C13.45 31.01 13 31.46 13 32.01C13 32.56 13.45 33.01 14 33.01H14.89C15.82 35.37 17.82 37.01 20.12 37.01C21.43 37.01 22.66 36.5 23.68 35.54C24.08 35.16 24.1 34.53 23.72 34.13C23.34 33.73 22.71 33.71 22.31 34.09C21.66 34.7 20.9 35.02 20.11 35.02C18.87 35.02 17.78 34.23 17.09 33.02H19.99C20.54 33.02 20.99 32.57 20.99 32.02C20.99 31.47 20.54 31.02 19.99 31.02H16.39C16.34 30.7 16.31 30.36 16.31 30.02C16.31 29.68 16.34 29.34 16.39 29.02H19.99C20.54 29.02 20.99 28.57 20.99 28.02C20.99 27.47 20.54 27.02 19.99 27.02H17.09C17.78 25.81 18.87 25.02 20.11 25.02L20.12 25Z" fill="#223C61"/>
<path d="M41.03 9H39.03V7C39.03 6.45 38.58 6 38.03 6C37.48 6 37.03 6.45 37.03 7V9H35.03C34.48 9 34.03 9.45 34.03 10C34.03 10.55 34.48 11 35.03 11H37.03V13C37.03 13.55 37.48 14 38.03 14C38.58 14 39.03 13.55 39.03 13V11H41.03C41.58 11 42.03 10.55 42.03 10C42.03 9.45 41.58 9 41.03 9Z" fill="#223C61"/>
</svg>
