<svg width="24" height="24" viewBox="0 0 24 24" fill="none" xmlns="http://www.w3.org/2000/svg">
<path fill-rule="evenodd" clip-rule="evenodd" d="M7.98239 6.41889C10.7005 3.22612 15.1935 3.18759 17.9526 6.34158C18.3163 6.75725 18.2741 7.38901 17.8584 7.75265C17.4428 8.11629 16.811 8.07411 16.4474 7.65843C14.4954 5.42717 11.435 5.44859 9.50527 7.71536C9.17207 8.10675 8.89422 8.53955 8.67171 9H13C13.5523 9 14 9.44772 14 10C14 10.5523 13.5523 11 13 11H8.07068C7.97761 11.6617 7.97761 12.3383 8.07068 13H13C13.5523 13 14 13.4477 14 14C14 14.5523 13.5523 15 13 15H8.67171C8.89421 15.4605 9.17207 15.8933 9.50527 16.2847C11.435 18.5514 14.4954 18.5728 16.4474 16.3416C16.811 15.9259 17.4428 15.8837 17.8584 16.2474C18.2741 16.611 18.3163 17.2428 17.9526 17.6584C15.1935 20.8124 10.7005 20.7739 7.98239 17.5811C7.33019 16.815 6.839 15.9361 6.5088 15H5C4.44772 15 4 14.5523 4 14C4 13.4477 4.44772 13 5 13H6.05534C5.98272 12.3362 5.98272 11.6639 6.05534 11H5C4.44772 11 4 10.5523 4 10C4 9.44772 4.44772 9 5 9H6.5088C6.839 8.06392 7.33019 7.18497 7.98239 6.41889Z" fill="#223C61"/>
</svg>
