<svg width="24" height="24" viewBox="0 0 24 24" fill="none" xmlns="http://www.w3.org/2000/svg">
<path fill-rule="evenodd" clip-rule="evenodd" d="M13.3092 2.04909C13.7211 2.18303 14 2.56693 14 3.00007V9.00007H19C19.3761 9.00007 19.7204 9.21112 19.8911 9.54629C20.0618 9.88146 20.03 10.2841 19.8087 10.5882L11.8087 21.5882C11.554 21.9385 11.1027 22.085 10.6908 21.9511C10.2788 21.8171 10 21.4332 10 21.0001V15.0001H5C4.62387 15.0001 4.27956 14.789 4.10888 14.4538C3.9382 14.1187 3.97003 13.7161 4.19126 13.4119L12.1913 2.4119C12.446 2.0616 12.8973 1.91514 13.3092 2.04909ZM6.96377 13.0001H11C11.5523 13.0001 12 13.4478 12 14.0001V17.9249L17.0362 11.0001H13C12.4477 11.0001 12 10.5524 12 10.0001V6.07525L6.96377 13.0001Z" fill="#223C61"/>
</svg>
