<svg width="48" height="48" viewBox="0 0 48 48" fill="none" xmlns="http://www.w3.org/2000/svg">
<path d="M35 21.9998C34.75 21.9998 34.51 22.0298 34.27 22.0598L32.4 14.6798C32.14 13.8798 31.57 12.0098 29.48 12.0098H28.99C28.44 12.0098 27.99 12.4598 27.99 13.0098C27.99 13.5598 28.44 14.0098 28.99 14.0098H29.47C29.71 13.9998 30.06 14.0098 30.46 15.2298L30.7 16.1698L19.11 17.6898L18.21 16.0098H18.99C19.54 16.0098 19.99 15.5598 19.99 15.0098C19.99 14.4598 19.54 14.0098 18.99 14.0098H14.95C14.4 14.0098 13.95 14.4598 13.95 15.0098C13.95 15.5598 14.4 16.0098 14.95 16.0098H15.93L17.32 18.6098L12.11 28.5498C11.95 28.8598 11.96 29.2298 12.14 29.5298C12.32 29.8298 12.65 30.0098 13 30.0098H17.9C17.22 33.3198 13.27 35.4398 9.59999 32.8398C9.39999 32.6998 9.21999 32.5198 9.08999 32.3198C6.51999 28.5198 8.87999 24.3998 12.5 24.0298C13.05 23.9698 13.45 23.4798 13.39 22.9298C13.33 22.3798 12.85 21.9898 12.29 22.0398C7.21999 22.5498 3.90999 28.3398 7.53999 33.6698C7.71999 33.9398 7.95999 34.1798 8.22998 34.3698C13.54 38.1298 19.23 34.8598 19.93 30.0098H23.99C24.33 30.0098 24.65 29.8398 24.83 29.5498L31.47 19.1498L34.03 29.2598C34.14 29.7098 34.55 30.0098 35 30.0098C35.08 30.0098 35.16 30.0098 35.25 29.9798C35.78 29.8398 36.11 29.2998 35.97 28.7698L34.77 24.0198C38.72 23.8398 41.73 28.2698 38.87 32.3698C38.74 32.5598 38.56 32.7398 38.37 32.8698C33.38 36.3498 27.92 31.1598 30.81 26.1498C30.9 25.9898 31.05 25.8798 31.19 25.7598C31.66 25.3598 31.66 24.6498 31.21 24.2498C30.8 23.8798 30.17 23.9198 29.8 24.3298C27.44 26.9498 27.24 31.1398 30.21 34.2798C30.38 34.4598 30.58 34.6198 30.79 34.7498C36.28 38.1298 42.01 34.2298 42.01 29.0198C42.01 25.1598 38.87 22.0198 35.01 22.0198L35 21.9998ZM19.03 27.9998C19.03 27.9998 19.01 27.9998 19 27.9998C18.99 27.9998 18.98 27.9998 18.97 27.9998H14.65L18.46 20.7298L22.33 27.9998H19.03ZM24.07 27.0098L20.11 19.5698L29.62 18.3198L24.08 26.9998L24.07 27.0098Z" fill="#223C61"/>
</svg>
