<svg width="48" height="48" viewBox="0 0 48 48" fill="none" xmlns="http://www.w3.org/2000/svg">
<path d="M41.83 19.5004C42.14 19.9604 42.02 20.5804 41.56 20.8904C40.45 21.6404 39.22 22.0004 38 22.0004C36.19 22.0004 34.4 21.2004 33.04 19.6504C32.36 18.8704 31.85 17.9604 31.51 16.9904H29.99C29.44 16.9904 28.99 16.5404 28.99 15.9904C28.99 15.4404 29.44 14.9904 29.99 14.9904H31.06C30.99 14.3304 30.99 13.6504 31.06 12.9904H29.98C29.43 12.9904 28.98 12.5404 28.98 11.9904C28.98 11.4404 29.43 10.9904 29.98 10.9904H31.5C31.82 10.0704 32.3 9.20044 32.93 8.45044C35.19 5.76044 38.73 5.21044 41.54 7.10044C42 7.41044 42.12 8.03044 41.81 8.49044C41.5 8.95044 40.88 9.07044 40.42 8.76044C38.49 7.46044 36.04 7.86044 34.46 9.74044C34.14 10.1204 33.89 10.5504 33.67 11.0004H37.98C38.53 11.0004 38.98 11.4504 38.98 12.0004C38.98 12.5504 38.53 13.0004 37.98 13.0004H33.05C32.96 13.6604 32.96 14.3404 33.05 15.0004H37.97C38.52 15.0004 38.97 15.4504 38.97 16.0004C38.97 16.5504 38.52 17.0004 37.97 17.0004H33.67C33.9 17.4804 34.17 17.9404 34.53 18.3404C36.13 20.1704 38.49 20.5304 40.42 19.2304C40.88 18.9204 41.5 19.0404 41.81 19.5004H41.83ZM24 23.8904C24 22.8504 23.15 22.0004 22.11 22.0004H7.89C6.85 22.0004 6 22.8504 6 23.8904C6 23.8904 6 27.9004 6.02 28.0804C6.2 30.3004 7.45 32.3204 9.39 33.6104L8.08 40.8204C7.98 41.3604 8.34 41.8804 8.88 41.9804C8.94 41.9904 9 42.0004 9.06 42.0004C9.53 42.0004 9.96 41.6604 10.04 41.1804L11.47 33.2904C11.55 32.8604 11.34 32.4404 10.96 32.2304C9.28 31.3204 8.18 29.7504 8.01 28.0004H21.95C21.77 29.7504 20.68 31.3204 19 32.2304C18.62 32.4404 18.41 32.8604 18.49 33.2904L19.92 41.1804C20.01 41.6604 20.43 42.0004 20.9 42.0004C20.96 42.0004 21.02 42.0004 21.08 41.9804C21.62 41.8804 21.98 41.3604 21.88 40.8204L20.57 33.6104C22.51 32.3304 23.76 30.3104 23.95 28.0804C23.96 27.9004 23.97 23.8904 23.97 23.8904H24ZM8 24.0004H22V26.0004H8V24.0004ZM21 8.00044V7.00044C21 6.45044 20.55 6.00044 20 6.00044C19.45 6.00044 19 6.45044 19 7.00044V8.00044H9C7.9 8.00044 7 8.90044 7 10.0004V17.0004C7 18.1004 7.9 19.0004 9 19.0004H21C22.1 19.0004 23 18.1004 23 17.0004V10.0004C23 8.90044 22.1 8.00044 21 8.00044ZM9 17.0004V10.0004H21V17.0004H9Z" fill="#223C61"/>
</svg>
