<svg width="48" height="48" viewBox="0 0 48 48" fill="none" xmlns="http://www.w3.org/2000/svg">
<path d="M30 22C34.42 22 38 18.42 38 14C38 9.58 34.42 6 30 6C25.58 6 22 9.58 22 14C22 18.42 25.58 22 30 22ZM30 8C31.43 8 32.74 8.5 33.77 9.34C33.71 9.95 33.53 10.42 33.22 10.74C32.35 11.65 30.38 11.61 28.48 11.57C27.02 11.54 25.53 11.53 24.36 11.95C25.2 9.65 27.4 8 29.99 8H30ZM24.48 14.19C25.01 13.5 26.84 13.54 28.45 13.57C30.68 13.61 33.19 13.66 34.67 12.12C34.93 11.85 35.14 11.55 35.31 11.2C35.75 12.03 36 12.98 36 13.99C36 17.3 33.31 19.99 30 19.99C27.44 19.99 25.26 18.38 24.4 16.12C24.2 15.2 24.21 14.53 24.48 14.18V14.19Z" fill="#223C61"/>
<path d="M5.99999 15C5.99999 15.55 6.44999 16 6.99999 16H7.88999C8.81999 18.36 10.82 20 13.12 20C14.43 20 15.66 19.49 16.68 18.53C17.08 18.15 17.1 17.52 16.72 17.12C16.34 16.72 15.71 16.7 15.31 17.08C14.66 17.69 13.9 18.01 13.11 18.01C11.87 18.01 10.78 17.22 10.09 16.01H12.99C13.54 16.01 13.99 15.56 13.99 15.01C13.99 14.46 13.54 14.01 12.99 14.01H9.38999C9.33999 13.69 9.30999 13.35 9.30999 13.01C9.30999 12.67 9.33999 12.33 9.38999 12.01H12.99C13.54 12.01 13.99 11.56 13.99 11.01C13.99 10.46 13.54 10.01 12.99 10.01H10.09C10.78 8.8 11.87 8.01 13.11 8.01C13.9 8.01 14.66 8.33 15.31 8.94C15.71 9.32 16.35 9.3 16.72 8.9C17.1 8.5 17.08 7.86 16.68 7.49C15.66 6.53 14.42 6.02 13.11 6.02C10.8 6.02 8.80999 7.66 7.87999 10.02H6.98999C6.43999 10.02 5.98999 10.47 5.98999 11.02C5.98999 11.57 6.43999 12.02 6.98999 12.02H7.36999C7.32999 12.35 7.29999 12.68 7.29999 13.02C7.29999 13.36 7.32999 13.69 7.36999 14.02H6.98999C6.43999 14.02 5.98999 14.47 5.98999 15.02L5.99999 15Z" fill="#223C61"/>
<path d="M24.02 23.03C21.29 23.3 19.45 25.33 19.08 28H19V26.08C19 25.51 18.8 25.02 18.4 24.62C18 24.21 17.51 24.01 16.95 24.01H13.06C12.49 24.01 12.01 24.21 11.61 24.62C11.21 25.03 11.01 25.52 11.01 26.08V28H7.99999C7.44999 28 6.97999 28.2 6.58999 28.59C6.19999 28.98 6.00999 29.46 6.00999 30.02V39.96C6.00999 40.52 6.19999 41 6.58999 41.4C6.97999 41.8 7.44999 42 7.99999 42H22C22.55 42 23.02 41.8 23.42 41.4C23.82 41 24.01 40.52 24.01 39.96V30.02C24.01 29.46 23.81 28.98 23.42 28.59C23.03 28.2 22.55 28 22 28H21.17C21.61 26.26 23.14 25 25.03 25H35.99C38.24 25 39.99 26.76 39.99 29.02V37L37.99 37.02V30C37.99 29.45 37.54 29 36.98 29C36.43 29 35.99 29.45 35.99 30V40H27.01C26.46 40 26.01 40.45 26.01 41C26.01 41.55 26.46 42 27.01 42H37.01C37.56 42 38.01 41.55 38.01 41C38.01 40.97 38 40.94 37.99 40.91V39L41 38.97C41.55 38.97 41.99 38.52 41.99 37.97L42.01 29.01C42.01 25.85 40.06 23.33 36.99 23.03H24.02ZM13 26H17V28H13V26ZM22 30V40H7.99999V30H22Z" fill="#223C61"/>
</svg>
