<svg width="48" height="48" viewBox="0 0 48 48" fill="none" xmlns="http://www.w3.org/2000/svg">
<path d="M19 31.9995H17V29.4995C17 28.6695 16.33 27.9995 15.5 27.9995H11.5C10.67 27.9995 10 28.6695 10 29.4995V31.9995H8C6.9 31.9995 6 32.8995 6 33.9995V40.0095C6 40.9995 7 41.9995 8 41.9995H19C20 41.9995 21 40.9995 21 40.0095V33.9895C21 32.9995 20 31.9995 19 31.9995ZM12 29.9995H15.01V31.9995H12V29.9995ZM19 39.9995H8V33.9995H19V39.9995ZM24.49 26.5195C24.49 29.0095 26.51 31.0295 29 31.0295C31.49 31.0295 33.51 29.0095 33.51 26.5195C33.51 24.0295 31.49 22.0095 29 22.0095C26.51 22.0095 24.49 24.0295 24.49 26.5195ZM31.51 26.5195C31.51 27.8995 30.38 29.0295 29 29.0295C27.62 29.0295 26.49 27.8995 26.49 26.5195C26.49 25.1395 27.62 24.0095 29 24.0095C30.38 24.0095 31.51 25.1395 31.51 26.5195ZM42 12.5995C42 13.2595 41.31 13.6995 40.71 13.4195L29 7.79945L17.29 13.4195C16.69 13.6995 16 13.2595 16 12.5995C16 12.2495 16.21 11.9195 16.53 11.7795L28.16 6.18945C28.69 5.93945 29.3 5.93945 29.84 6.18945L41.47 11.7795C41.79 11.9295 42 12.2495 42 12.5995ZM42 27.0095V37.0095C42 37.5595 41.55 38.0095 41 38.0095H39V40.9895C39 41.5395 38.55 41.9895 38 41.9895C37.45 41.9895 37 41.5395 37 40.9895V36.0095H40V27.0095C40 25.9095 39.1 25.0095 38 25.0095L35.47 24.9895C34.92 24.9895 34.47 24.5395 34.47 23.9895C34.47 23.4995 34.82 23.1195 35.29 23.0295L38 23.0095C40.21 23.0095 42 24.7995 42 27.0095ZM23.53 23.9895C23.53 24.5395 23.08 24.9895 22.53 24.9895L20 25.0095C19.12 25.0095 18.37 25.5795 18.1 26.3795C17.97 26.7695 17.56 27.0095 17.15 27.0095C16.49 27.0095 16 26.3695 16.2 25.7495C16.73 24.1595 18.23 23.0095 20 23.0095C20 23.0095 22.72 23.0195 22.71 23.0295C23.17 23.1195 23.53 23.5095 23.53 23.9895ZM35 35.0695V40.9895C35 41.5395 34.55 41.9895 34 41.9895C33.45 41.9895 33 41.5395 33 40.9895V35.0695C33 34.4795 32.52 34.0095 31.94 34.0095H26.03C25.46 34.0095 25.01 34.4695 25.01 35.0295V40.9895C25.01 41.5395 24.56 41.9895 24.01 41.9895C23.46 41.9895 23.01 41.5395 23.01 40.9895V35.0295C23.01 33.3595 24.36 32.0095 26.03 32.0095H31.94C33.63 32.0095 35 33.3795 35 35.0695ZM38.98 17.4995C38.98 15.0095 36.96 12.9895 34.47 12.9895C31.98 12.9895 29.96 15.0095 29.96 17.4995C29.96 19.9895 31.98 22.0095 34.47 22.0095C36.96 22.0095 38.98 19.9895 38.98 17.4995ZM31.96 17.4995C31.96 16.1195 33.09 14.9895 34.47 14.9895C35.85 14.9895 36.98 16.1195 36.98 17.4995C36.98 18.8795 35.85 20.0095 34.47 20.0095C33.09 20.0095 31.96 18.8795 31.96 17.4995ZM23.5 12.9895C21.01 12.9895 18.99 15.0095 18.99 17.4995C18.99 19.9895 21.01 22.0095 23.5 22.0095C25.99 22.0095 28.01 19.9895 28.01 17.4995C28.01 15.0095 25.99 12.9895 23.5 12.9895ZM23.5 20.0095C22.12 20.0095 20.99 18.8795 20.99 17.4995C20.99 16.1195 22.12 14.9895 23.5 14.9895C24.88 14.9895 26.01 16.1195 26.01 17.4995C26.01 18.8795 24.88 20.0095 23.5 20.0095Z" fill="#223C61"/>
</svg>
