<svg width="48" height="48" viewBox="0 0 48 48" fill="none" xmlns="http://www.w3.org/2000/svg">
<path d="M17.97 24.9505C17.97 24.1205 18.64 23.4505 19.46 23.4505C20.28 23.4505 20.95 24.1205 20.95 24.9505C20.95 25.7805 20.28 26.4505 19.46 26.4505C18.64 26.4505 17.97 25.7805 17.97 24.9505ZM19.74 34.3905C22.28 32.6705 25.77 32.6405 28.35 34.3005C28.81 34.6005 29.43 34.4705 29.73 34.0005C30.03 33.5405 29.9 32.9205 29.43 32.6205C27.85 31.6005 26.01 31.0605 24.12 31.0605C22.23 31.0605 20.25 31.6405 18.63 32.7405C18.17 33.0505 18.05 33.6705 18.36 34.1305C18.67 34.5905 19.29 34.7105 19.75 34.4005L19.74 34.3905ZM28.47 23.4005C27.65 23.4005 26.98 24.0705 26.98 24.9005C26.98 25.7305 27.65 26.4005 28.47 26.4005C29.29 26.4005 29.96 25.7305 29.96 24.9005C29.96 24.0705 29.29 23.4005 28.47 23.4005ZM42.02 24.0005C42.02 33.9305 33.94 42.0105 24.01 42.0105C14.08 42.0105 6.61 34.4905 6.05 25.0505L6 25.0005C6 24.8305 6.01 24.6705 6.03 24.5105C6.03 24.3405 6 24.1705 6 24.0005C6 14.0605 14.08 5.98047 24.01 5.98047C33.94 5.98047 42.02 14.0605 42.02 23.9905V24.0005ZM31.97 10.8105C31.98 10.8805 32.01 10.9405 32.01 11.0105C32.01 15.1505 35.17 18.5605 39.2 18.9705C37.96 15.2305 35.36 12.1005 32 10.1505C32 10.3705 31.98 10.5905 31.97 10.8105ZM8.49 20.1505C9.48 19.4305 10.69 19.0005 12 19.0005H20.3C26.6 19.0005 30 14.3605 30 10.0005V9.16047C28.15 8.41047 26.13 7.98047 24.01 7.98047C16.51 7.98047 10.22 13.1705 8.49 20.1405V20.1505ZM40.02 23.9905C40.02 22.9605 39.91 21.9605 39.73 20.9805C35.72 20.8705 32.28 18.3905 30.8 14.8905C29.03 18.3305 25.38 21.0005 20.32 21.0005H12C9.91 21.0005 8.21 22.6205 8.03 24.6705C8.39 33.1805 15.41 40.0005 24 40.0005C32.59 40.0005 40.01 32.8205 40.01 23.9905H40.02Z" fill="#223C61"/>
</svg>
