<svg width="24" height="24" viewBox="0 0 24 24" fill="none" xmlns="http://www.w3.org/2000/svg">
<path fill-rule="evenodd" clip-rule="evenodd" d="M3 4C3 3.44772 3.44772 3 4 3C13.3888 3 21 10.6112 21 20C21 20.5523 20.5523 21 20 21C19.4477 21 19 20.5523 19 20C19 11.7157 12.2843 5 4 5C3.44772 5 3 4.55228 3 4ZM3 11C3 10.4477 3.44772 10 4 10C9.52285 10 14 14.4772 14 20C14 20.5523 13.5523 21 13 21C12.4477 21 12 20.5523 12 20C12 15.5817 8.41828 12 4 12C3.44772 12 3 11.5523 3 11ZM3 19C3 17.8954 3.89543 17 5 17C6.10457 17 7 17.8954 7 19C7 20.1046 6.10457 21 5 21C3.89543 21 3 20.1046 3 19Z" fill="#223C61"/>
</svg>
