<svg width="24" height="24" viewBox="0 0 24 24" fill="none" xmlns="http://www.w3.org/2000/svg">
<path fill-rule="evenodd" clip-rule="evenodd" d="M18 4C16.8954 4 16 4.89543 16 6C16 6.28549 16.0598 6.55701 16.1676 6.80271C16.175 6.8156 16.1821 6.82871 16.189 6.84204C16.2041 6.87148 16.2177 6.90131 16.2297 6.93145C16.5647 7.56685 17.2318 8 18 8C19.1046 8 20 7.10457 20 6C20 4.89543 19.1046 4 18 4ZM14.9601 8.59997C15.6938 9.45692 16.7835 10 18 10C20.2091 10 22 8.20914 22 6C22 3.79086 20.2091 2 18 2C15.7909 2 14 3.79086 14 6C14 6.27512 14.0278 6.54375 14.0807 6.80325L9.03986 9.40003C8.30623 8.54308 7.21654 8 6 8C3.79086 8 2 9.79086 2 12C2 14.2091 3.79086 16 6 16C7.21654 16 8.30623 15.4569 9.03986 14.6L14.0807 17.1968C14.0278 17.4562 14 17.7249 14 18C14 20.2091 15.7909 22 18 22C20.2091 22 22 20.2091 22 18C22 15.7909 20.2091 14 18 14C16.7835 14 15.6938 14.5431 14.9601 15.4L9.91933 12.8032C9.97222 12.5438 10 12.2751 10 12C10 11.7249 9.97222 11.4562 9.91933 11.1968L14.9601 8.59997ZM7.77031 11.0685C7.7823 11.0987 7.79586 11.1285 7.81103 11.158C7.8179 11.1713 7.82503 11.1844 7.8324 11.1973C7.94018 11.443 8 11.7145 8 12C8 12.2855 7.94018 12.557 7.8324 12.8027C7.82502 12.8156 7.8179 12.8287 7.81103 12.842C7.79586 12.8715 7.7823 12.9013 7.77031 12.9315C7.4353 13.5669 6.76823 14 6 14C4.89543 14 4 13.1046 4 12C4 10.8954 4.89543 10 6 10C6.76823 10 7.4353 10.4331 7.77031 11.0685ZM16.1676 17.1973C16.175 17.1844 16.1821 17.1713 16.189 17.158C16.2041 17.1285 16.2177 17.0987 16.2297 17.0685C16.5647 16.4331 17.2318 16 18 16C19.1046 16 20 16.8954 20 18C20 19.1046 19.1046 20 18 20C16.8954 20 16 19.1046 16 18C16 17.7145 16.0598 17.443 16.1676 17.1973Z" fill="#223C61"/>
</svg>
