<svg width="24" height="24" viewBox="0 0 24 24" fill="none" xmlns="http://www.w3.org/2000/svg">
<path fill-rule="evenodd" clip-rule="evenodd" d="M7.89994 4.13885C9.04484 2.49821 11.0575 1.69798 13.0164 2.10455C14.9752 2.51113 16.5032 4.04622 16.9006 6.00698C17.298 7.96773 16.4884 9.97662 14.8424 11.1138C14.3881 11.4278 13.7652 11.3139 13.4513 10.8596C13.1373 10.4052 13.2512 9.78233 13.7056 9.4684C14.6931 8.78606 15.1789 7.58072 14.9405 6.40427C14.702 5.22782 13.7852 4.30676 12.6099 4.06282C11.4346 3.81887 10.227 4.29901 9.54006 5.2834C9.22401 5.7363 8.60064 5.84724 8.14773 5.53119C7.69482 5.21513 7.58388 4.59176 7.89994 4.13885ZM2.29289 2.29302C2.68342 1.90249 3.31658 1.90249 3.70711 2.29302L8.79935 7.38526C8.85521 7.43017 8.90647 7.48124 8.95196 7.53787L21.7071 20.293C22.0976 20.6835 22.0976 21.3167 21.7071 21.7072C21.3166 22.0978 20.6834 22.0978 20.2929 21.7072L19 20.4143V21.0001C19 21.5524 18.5523 22.0001 18 22.0001C17.4477 22.0001 17 21.5524 17 21.0001L17 18.9989C17.0003 18.7779 16.9761 18.5578 16.9281 18.3425L14.6581 16.0725C14.4426 16.0242 14.2221 15.9999 14.0008 16.0001H10C8.34315 16.0001 7 17.3433 7 19.0001V21.0001C7 21.5524 6.55228 22.0001 6 22.0001C5.44772 22.0001 5 21.5524 5 21.0001V19.0001C5 16.2387 7.23858 14.0001 10 14.0001H12.5858L10.2819 11.6963C8.89908 11.1892 7.80979 10.0988 7.30343 8.71776L2.29289 3.70723C1.90237 3.3167 1.90237 2.68354 2.29289 2.29302ZM19 19.0014C19 19.0011 19 19.0016 19 19.0014V19.0014Z" fill="#223C61"/>
</svg>
