<svg width="48" height="48" viewBox="0 0 48 48" fill="none" xmlns="http://www.w3.org/2000/svg">
<path d="M36.9 6H31.1C30.83 6 30.58 6.11 30.39 6.29L26.29 10.39C26.1 10.58 26 10.83 26 11.1V16.9C26 17.17 26.11 17.42 26.29 17.61L30.39 21.71C30.58 21.9 30.83 22 31.1 22H36.9C37.17 22 37.42 21.89 37.61 21.71L41.71 17.61C41.9 17.42 42 17.17 42 16.9V11.1C42 10.83 41.89 10.58 41.71 10.39L37.61 6.29C37.42 6.1 37.17 6 36.9 6ZM40 16.49L36.49 20H31.52L28.01 16.49V11.52L31.52 8.01H36.49L40 11.52V16.49ZM35 11V14C35 14.55 34.55 15 34 15C33.45 15 33 14.55 33 14V11C33 10.45 33.45 10 34 10C34.55 10 35 10.45 35 11ZM34.72 16.04C34.91 16.23 35 16.47 35 16.76C35 17.05 34.91 17.29 34.72 17.48C34.53 17.67 34.29 17.76 34 17.76C33.71 17.76 33.46 17.67 33.28 17.48C33.09 17.29 33 17.05 33 16.76C33 16.47 33.09 16.23 33.28 16.04C33.47 15.85 33.71 15.76 34 15.76C34.29 15.76 34.54 15.85 34.72 16.04ZM24.99 20.96H20.99V15.96C20.99 14.86 20.09 13.96 18.99 13.96H7C6.45 13.96 6 14.41 6 14.96C6 15.51 6.45 15.96 7 15.96H19V33.73C18.51 34.06 18.09 34.47 17.76 34.96H7C6.45 34.96 6 35.41 6 35.96C6 36.51 6.45 36.96 7 36.96H17.04C17.02 37.13 16.99 37.29 16.99 37.46C16.99 39.94 19.01 41.96 21.49 41.96C23.97 41.96 25.99 39.94 25.99 37.46C25.99 37.29 25.96 37.13 25.94 36.96H26.99C28.09 36.96 28.99 36.06 28.99 34.96V26.96L26.99 22.96C26.3233 21.6267 25.6567 20.96 24.99 20.96ZM23.9 38.08C23.69 38.95 22.97 39.67 22.1 39.88C21.89 39.93 21.68 39.96 21.48 39.96C19.9 39.96 18.66 38.49 19.05 36.84C19.26 35.97 19.98 35.25 20.85 35.04C21.06 34.99 21.27 34.97 21.47 34.97C23.05 34.97 24.29 36.44 23.9 38.09V38.08ZM26.99 34.87C26.99 34.87 26.93 34.93 26.91 34.95H25.24C24.43 33.74 23.06 32.95 21.5 32.95C21.33 32.95 21.16 32.96 21 32.98L20.97 29.95H27V34.87H26.99ZM26.99 27.95H20.99V22.95H25.03L27.03 26.95L26.99 27.95Z" fill="#223C61"/>
</svg>
