<svg width="48" height="48" viewBox="0 0 48 48" fill="none" xmlns="http://www.w3.org/2000/svg">
<path d="M30 35H32C32.55 35 33 34.55 33 34C33 33.45 32.55 33 32 33H30C29.45 33 29 33.45 29 34C29 34.55 29.45 35 30 35Z" fill="#223C61"/>
<path d="M23 29H25C25.55 29 26 28.55 26 28C26 27.45 25.55 27 25 27H23C22.45 27 22 27.45 22 28C22 28.55 22.45 29 23 29Z" fill="#223C61"/>
<path d="M23 23H25C25.55 23 26 22.55 26 22C26 21.45 25.55 21 25 21H23C22.45 21 22 21.45 22 22C22 22.55 22.45 23 23 23Z" fill="#223C61"/>
<path d="M30 23H32C32.55 23 33 22.55 33 22C33 21.45 32.55 21 32 21H30C29.45 21 29 21.45 29 22C29 22.55 29.45 23 30 23Z" fill="#223C61"/>
<path d="M30 29H32C32.55 29 33 28.55 33 28C33 27.45 32.55 27 32 27H30C29.45 27 29 27.45 29 28C29 28.55 29.45 29 30 29Z" fill="#223C61"/>
<path d="M38 8H32V6.99C32 6.44 31.56 6 31.01 6H30.98C30.43 6 29.99 6.44 29.99 6.99V8H17.99V6.99C17.99 6.44 17.55 6 17 6C16.45 6 16.01 6.44 16.01 6.99V8L9.99 7.99C9.44 7.99 8.99 8.44 8.99 8.99L8.97 38.02C8.97 40.22 10.75 42.01 12.95 42.01H34.99C37.2 42.01 38.99 40.22 38.99 38.01V9C38.99 8.45 38.54 8 37.99 8H38ZM37 38.03C37 39.12 36.12 40 35.03 40H12.99C11.89 40 11 39.11 11 38.01V17H37V38.03ZM11.01 15V10H16.01V11.01C16.01 11.56 16.45 12 17 12H17.02C17.57 12 18.01 11.56 18.01 11.01V10H30.01V11.01C30.01 11.56 30.45 12 31 12H31.03C31.58 12 32.02 11.56 32.02 11.01V10H37.02V15H11.01Z" fill="#223C61"/>
<path d="M16 35H18C18.55 35 19 34.55 19 34C19 33.45 18.55 33 18 33H16C15.45 33 15 33.45 15 34C15 34.55 15.45 35 16 35Z" fill="#223C61"/>
<path d="M16 23H18C18.55 23 19 22.55 19 22C19 21.45 18.55 21 18 21H16C15.45 21 15 21.45 15 22C15 22.55 15.45 23 16 23Z" fill="#223C61"/>
<path d="M16 29H18C18.55 29 19 28.55 19 28C19 27.45 18.55 27 18 27H16C15.45 27 15 27.45 15 28C15 28.55 15.45 29 16 29Z" fill="#223C61"/>
<path d="M22.7 36.46C23.07 36.78 23.63 36.77 23.99 36.44L27.21 33.5C27.62 33.13 27.63 32.49 27.24 32.09C26.86 31.71 26.24 31.71 25.86 32.09L23.36 34.59L22.63 33.86C22.25 33.48 21.64 33.48 21.26 33.86C20.86 34.25 20.89 34.9 21.31 35.26L22.7 36.45V36.46Z" fill="#223C61"/>
</svg>
