<svg width="48" height="48" viewBox="0 0 48 48" fill="none" xmlns="http://www.w3.org/2000/svg">
<path d="M21 16H33C33.55 16 34 15.55 34 15C34 14.45 33.55 14 33 14H21C20.45 14 20 14.45 20 15C20 15.55 20.45 16 21 16Z" fill="#223C61"/>
<path d="M35 22H34C33.45 22 33 22.45 33 23C33 23.55 33.45 24 34 24H35C35.55 24 36 23.55 36 23C36 22.45 35.55 22 35 22Z" fill="#223C61"/>
<path d="M33 19C33 19.55 33.45 20 34 20H35C35.55 20 36 19.55 36 19C36 18.45 35.55 18 35 18H34C33.45 18 33 18.45 33 19Z" fill="#223C61"/>
<path d="M21 25H30C30.55 25 31 24.55 31 24V19C31 18.45 30.55 18 30 18H21C20.45 18 20 18.45 20 19V24C20 24.55 20.45 25 21 25ZM22 20H29V23H22V20Z" fill="#223C61"/>
<path d="M21 33H35C35.55 33 36 32.55 36 32C36 31.45 35.55 31 35 31H21C20.45 31 20 31.45 20 32C20 32.55 20.45 33 21 33Z" fill="#223C61"/>
<path d="M41 8H15C14.45 8 14 8.45 14 9V12H9C8.8 12.01 8.61 12.02 8.4 12.06C6.98 12.34 6 13.67 6 15.12V34C6 36.76 8.24 39 11 39H37C39.76 39 42 36.76 42 34V9C42 8.45 41.55 8 41 8ZM14 31H12V15C12 14.65 11.92 14.32 11.81 14H14V31ZM10.4 36.94C8.98 36.66 8 35.33 8 33.88V15C8 14.45 8.45 14 9 14C9.55 14 10 14.45 10 15V32C10 32.55 10.45 33 11 33H14V34C14 35.85 12.32 37.31 10.4 36.94ZM40 34C40 35.65 38.65 37 37 37H15C15.63 36.16 16 35.12 16 34V10H40V34Z" fill="#223C61"/>
<path d="M21 29H35C35.55 29 36 28.55 36 28C36 27.45 35.55 27 35 27H21C20.45 27 20 27.45 20 28C20 28.55 20.45 29 21 29Z" fill="#223C61"/>
</svg>
