<svg width="48" height="48" viewBox="0 0 48 48" fill="none" xmlns="http://www.w3.org/2000/svg">
<path d="M18 19.06V25C18 25.55 17.55 26 17 26H16V32C16 32.55 15.55 33 15 33C14.45 33 14 32.55 14 32V24H16V19.06C16 18.47 15.52 18 14.94 18H9.03001C8.46001 18 8.01001 18.46 8.01001 19.02V24H10.01V32C10.01 32.55 9.56001 33 9.01001 33C8.46001 33 8.01001 32.55 8.01001 32V26H7.01001C6.46001 26 6.01001 25.55 6.01001 25V19.02C6.01001 17.35 7.36001 16 9.03001 16H14.94C16.63 16 18 17.37 18 19.06ZM8.50001 11.49C8.50001 9.56 10.07 7.99 12 7.99C13.93 7.99 15.5 9.56 15.5 11.49C15.5 13.42 13.93 14.99 12 14.99C10.07 14.99 8.50001 13.42 8.50001 11.49ZM10.5 11.49C10.5 12.32 11.17 12.99 12 12.99C12.83 12.99 13.5 12.32 13.5 11.49C13.5 10.66 12.83 9.99 12 9.99C11.17 9.99 10.5 10.66 10.5 11.49ZM22.63 42H22.71C23.09 42 23.44 41.78 23.61 41.44L26.08 36.44C26.41 35.78 25.93 35 25.18 35H25.1C24.72 35 24.37 35.22 24.2 35.56L21.73 40.56C21.4 41.22 21.88 42 22.63 42ZM37.93 35H37.85C37.11 35 36.62 35.78 36.95 36.44L39.42 41.44C39.59 41.78 39.94 42 40.32 42H40.4C41.14 42 41.63 41.22 41.3 40.56L38.83 35.56C38.66 35.22 38.31 35 37.93 35ZM21 27.5V13.54C21 9.93 23.93 7 27.54 7H35.48C39.08 7 42 9.92 42 13.52V27.49C42 30.53 39.53 33 36.49 33H26.5C23.46 33 21 30.54 21 27.5ZM26.5 31H36.49C38.43 31 40 29.43 40 27.49V13.52C40 11.02 37.98 9 35.48 9H27.54C25.04 9 23 11.04 23 13.54V27.5C23 29.43 24.57 31 26.5 31ZM31.48 26C30.65 26 29.98 26.67 29.98 27.5C29.98 28.33 30.65 29 31.48 29C32.31 29 32.98 28.33 32.98 27.5C32.98 26.67 32.31 26 31.48 26ZM26.58 21.25L25 15.25C24.83 14.62 25.31 14 25.97 14H37C37.66 14 38.13 14.62 37.97 15.25L36.4 21.25C36.28 21.69 35.89 22 35.43 22H27.55C27.1 22 26.7 21.69 26.58 21.25ZM27.27 16L28.32 20H34.66L35.71 16H27.27Z" fill="#223C61"/>
</svg>
