<svg width="24" height="24" viewBox="0 0 24 24" fill="none" xmlns="http://www.w3.org/2000/svg">
<path fill-rule="evenodd" clip-rule="evenodd" d="M10 5.48644L6.78935 9.61442C6.5999 9.85801 6.30859 10.0005 6 10.0005H4V14.0005H6C6.30859 14.0005 6.5999 14.143 6.78935 14.3865L10 18.5145V5.48644ZM8.66481 3.94547C9.09451 3.22312 9.97371 2.89011 10.7805 3.15904C11.5906 3.42909 12.095 4.22853 12 5.06807V18.9329C12.095 19.7724 11.5906 20.5719 10.7805 20.8419C9.97371 21.1108 9.09451 20.7778 8.66481 20.0555L5.51092 16.0005H4C2.89543 16.0005 2 15.105 2 14.0005V10.0005C2 8.89591 2.89543 8.00048 4 8.00048H5.51092L8.66481 3.94547ZM14.2 7.40048C14.5314 6.95865 15.1582 6.86911 15.6 7.20048C17.1108 8.33361 18 10.1119 18 12.0005C18 13.889 17.1108 15.6674 15.6 16.8005C15.1582 17.1319 14.5314 17.0423 14.2 16.6005C13.8686 16.1587 13.9582 15.5319 14.4 15.2005C15.4072 14.4451 16 13.2595 16 12.0005C16 10.7415 15.4072 9.5559 14.4 8.80048C13.9582 8.46911 13.8686 7.84231 14.2 7.40048Z" fill="#223C61"/>
</svg>
