<svg width="24" height="24" viewBox="0 0 24 24" fill="none" xmlns="http://www.w3.org/2000/svg">
<path fill-rule="evenodd" clip-rule="evenodd" d="M12 2C12.5523 2 13 2.44772 13 3V4C13 4.55228 12.5523 5 12 5C11.4477 5 11 4.55228 11 4V3C11 2.44772 11.4477 2 12 2ZM4.89289 4.89289C5.28342 4.50237 5.91658 4.50237 6.30711 4.89289L7.00711 5.59289C7.39763 5.98342 7.39763 6.61658 7.00711 7.00711C6.61658 7.39763 5.98342 7.39763 5.59289 7.00711L4.89289 6.30711C4.50237 5.91658 4.50237 5.28342 4.89289 4.89289ZM19.1071 4.89289C19.4976 5.28342 19.4976 5.91658 19.1071 6.30711L18.4071 7.00711C18.0166 7.39763 17.3834 7.39763 16.9929 7.00711C16.6024 6.61658 16.6024 5.98342 16.9929 5.59289L17.6929 4.89289C18.0834 4.50237 18.7166 4.50237 19.1071 4.89289ZM12 8C10.2783 8 8.74972 9.10172 8.20527 10.7351C7.66081 12.3685 8.22262 14.167 9.6 15.2C9.6365 15.2274 9.67108 15.2572 9.7035 15.2893C9.92418 15.5078 10.1195 15.7461 10.2878 16H13.7122C13.8805 15.7461 14.0758 15.5078 14.2965 15.2893C14.3289 15.2572 14.3635 15.2274 14.4 15.2C15.7774 14.167 16.3392 12.3685 15.7947 10.7351C15.2503 9.10172 13.7217 8 12 8ZM15.1636 17.5045C15.1936 17.4533 15.2191 17.3991 15.2398 17.3426C15.3498 17.129 15.4912 16.9301 15.6616 16.7532C17.6827 15.1966 18.5006 12.5282 17.6921 10.1026C16.8754 7.65258 14.5826 6 12 6C9.41742 6 7.12458 7.65258 6.3079 10.1026C5.49938 12.5282 6.31726 15.1966 8.33844 16.7532C8.50881 16.9301 8.65021 17.129 8.76024 17.3426C8.78085 17.3991 8.80642 17.4533 8.83642 17.5045C9.01573 17.9239 9.07938 18.3902 9.01078 18.8535C9.0036 18.902 9 18.951 9 19C9 20.6569 10.3431 22 12 22C13.6569 22 15 20.6569 15 19C15 18.951 14.9964 18.902 14.9892 18.8535C14.9206 18.3902 14.9843 17.9239 15.1636 17.5045ZM12.9887 18H11.0113C11.0492 18.348 11.0468 18.7026 11.0016 19.0567C11.031 19.5826 11.4668 20 12 20C12.5332 20 12.969 19.5826 12.9984 19.0567C12.9532 18.7026 12.9508 18.348 12.9887 18ZM2 12C2 11.4477 2.44772 11 3 11H4C4.55228 11 5 11.4477 5 12C5 12.5523 4.55228 13 4 13H3C2.44772 13 2 12.5523 2 12ZM19 12C19 11.4477 19.4477 11 20 11H21C21.5523 11 22 11.4477 22 12C22 12.5523 21.5523 13 21 13H20C19.4477 13 19 12.5523 19 12Z" fill="#223C61"/>
</svg>
