<svg width="48" height="48" viewBox="0 0 48 48" fill="none" xmlns="http://www.w3.org/2000/svg">
<path d="M13 27C10.51 27 8.5 29.01 8.5 31.5C8.5 33.99 10.51 36 13 36C15.49 36 17.5 33.99 17.5 31.5C17.5 29.01 15.49 27 13 27ZM13 34.2C11.51 34.2 10.3 32.99 10.3 31.5C10.3 30.01 11.51 28.8 13 28.8C14.49 28.8 15.7 30.01 15.7 31.5C15.7 32.99 14.49 34.2 13 34.2ZM20 41C20 41.55 19.55 42 19 42C18.45 42 18 41.55 18 41C18 39.9 17.1 39 16 39H10C8.9 39 8 39.9 8 41C8 41.55 7.55 42 7 42C6.45 42 6 41.55 6 41C6 38.8 7.8 37 10 37H16C18.2 37 20 38.8 20 41ZM31 18C30.17 18 29.5 17.33 29.5 16.5C29.5 15.67 30.17 15 31 15C31.83 15 32.5 15.67 32.5 16.5C32.5 17.33 31.83 18 31 18ZM41 21C41.55 21 42 21.45 42 22V38C42 38.55 41.55 39 41 39C40.45 39 40 38.55 40 38V23H36C35.45 23 35 22.55 35 22V15.19L31 8.73L27 15.2V19.01C27 19.83 26.07 20.3 25.41 19.82L21.6 17.01H9.87L13.59 19.73C13.85 19.92 14 20.22 14 20.54V24.58C14 25.13 13.55 25.58 13 25.58C12.45 25.58 12 25.13 12 24.58V20.99L6.38 16.79C5.64 16.2 6.06 15.01 7 15.01H21.91C22.12 15.01 22.33 15.08 22.5 15.2L24.99 17.03V14.85C24.99 14.66 25.04 14.47 25.15 14.31L30.18 6.42C30.58 5.86 31.41 5.86 31.81 6.42L36.84 14.31C36.94 14.47 37 14.66 37 14.85V21H41ZM37.15 32.26C36.78 32.72 36.09 32.74 35.68 32.32L34.99 31.59V41C34.99 41.55 34.54 42 33.99 42H22.53C21.98 42 21.53 41.55 21.53 41C21.53 40.45 21.98 40 22.53 40H32.99V30.2L26.98 25.46L20.99 30.25V35.67C20.99 36.22 20.54 36.67 19.99 36.67C19.44 36.67 18.99 36.22 18.99 35.67V29.87C18.99 29.62 19.09 29.39 19.25 29.22L26.35 23.26C26.71 22.98 27.21 22.97 27.57 23.24L32.98 27.53V25.99C32.98 25.45 33.42 25.01 33.96 25.01H34.01C34.55 25.01 34.99 25.45 34.99 25.99V29.1L37.04 30.93C37.43 31.28 37.48 31.87 37.15 32.27V32.26ZM25 35V34C25 33.45 25.45 33 26 33H28C28.55 33 29 33.45 29 34V35C29 35.55 28.55 36 28 36H26C25.45 36 25 35.55 25 35Z" fill="#223C61"/>
</svg>
