<svg width="48" height="48" viewBox="0 0 48 48" fill="none" xmlns="http://www.w3.org/2000/svg">
<path d="M24 11.99C24 12.54 23.55 12.99 23 12.99H20C19.45 12.99 19 12.54 19 11.99C19 11.44 19.45 10.99 20 10.99H23C23.55 10.99 24 11.44 24 11.99ZM22 14.99H20C19.45 14.99 19 15.44 19 15.99C19 16.54 19.45 16.99 20 16.99H22C22.55 16.99 23 16.54 23 15.99C23 15.44 22.55 14.99 22 14.99ZM6.00001 18.97V8.01C6.00001 6.9 6.90001 6 8.00001 6H25.97C27.09 6 28 6.91 28 8.03V18.97C28 20.09 27.09 21 25.97 21H8.03001C6.91001 21 6.00001 20.09 6.00001 18.97ZM8.00001 18.99H26V8H8.00001V18.99ZM41.46 38.83C40.4 38.33 39.28 38.1 38.16 38.1C36.63 38.1 35.1 38.53 33.69 39.28C32.81 39.75 31.89 40.02 30.95 40.02C30.38 40.02 29.81 39.92 29.23 39.71C28 39.26 26.98 38.52 25.66 38.23C25.11 38.11 24.56 38.05 24.01 38.05C22.77 38.05 21.53 38.35 20.39 38.89C19.26 39.43 18.25 40.04 16.96 40.04C16.88 40.04 16.8 40.04 16.71 40.04C15.35 39.96 14.36 39.21 13.16 38.71C12.14 38.28 11.06 38.06 9.98001 38.06C9.25001 38.06 8.52001 38.16 7.80001 38.36C7.36001 38.49 6.94001 38.65 6.54001 38.84C6.19001 39 5.98001 39.36 5.98001 39.74V39.88C5.98001 40.6 6.72001 41.08 7.38001 40.8C8.29001 40.41 9.19001 40.06 10.19 40.06C10.75 40.06 11.34 40.17 11.99 40.43C13.07 40.87 13.99 41.5 15.16 41.78C15.76 41.92 16.36 41.99 16.97 41.99C18.06 41.99 19.15 41.76 20.17 41.33C21.29 40.86 22.21 40.18 23.46 40.03C23.63 40.01 23.79 40 23.95 40C24.97 40 25.96 40.36 26.85 40.86C28.16 41.6 29.51 41.95 30.86 41.95C32.38 41.95 33.89 41.52 35.32 40.75C36.19 40.29 37.09 40.03 38.01 40.03C38.64 40.03 39.28 40.15 39.92 40.4C40.15 40.49 40.37 40.59 40.59 40.69C41.24 40.99 41.99 40.49 41.99 39.77V39.71C41.99 39.34 41.79 38.98 41.45 38.82L41.46 38.83ZM26.35 28.62C24.73 26.55 21.85 25.97 19.56 27.25L18.01 28.11L11.34 31.85C10.84 32.13 10.68 32.76 10.98 33.24C11.26 33.69 11.83 33.84 12.29 33.6L20.8 29.08C22.09 28.4 23.67 28.65 24.67 29.71C26.01 31.12 27.74 33.04 28.43 34.25L29.69 36.46L29.83 36.7C29.83 36.7 29.83 36.7 29.85 36.7L30.55 37.91C30.83 38.39 31.44 38.55 31.92 38.28C32.4 38 32.56 37.39 32.29 36.91L32.1 36.58L31.29 35.18L30.08 33.1C28.99 31.25 26.36 28.62 26.36 28.62H26.35ZM31.01 30.94C31.01 28.46 33.03 26.44 35.51 26.44C37.99 26.44 40.01 28.46 40.01 30.94C40.01 33.42 37.99 35.44 35.51 35.44C33.03 35.44 31.01 33.42 31.01 30.94ZM33.01 30.94C33.01 32.32 34.13 33.44 35.51 33.44C36.89 33.44 38.01 32.32 38.01 30.94C38.01 29.56 36.89 28.44 35.51 28.44C34.13 28.44 33.01 29.56 33.01 30.94ZM21.63 31.13L13.62 35.39C13.13 35.65 12.94 36.25 13.2 36.74C13.46 37.23 14.06 37.42 14.55 37.16L22.39 33.1C22.78 32.9 22.99 32.55 23.08 32.18C23.28 31.38 22.36 30.74 21.62 31.13H21.63ZM13.5 14.3C12.38 14.3 10.17 14.85 10 15.92C10.07 16.4 10.5 16.92 11 16.92H16C16.5 16.92 16.93 16.54 17 16.06V15.92C16.83 14.84 14.62 14.3 13.5 14.3ZM13.5 13.49C14.46 13.49 15.23 12.71 15.23 11.74C15.23 10.77 14.45 9.99 13.5 9.99C12.55 9.99 11.77 10.77 11.77 11.74C11.77 12.71 12.55 13.49 13.5 13.49Z" fill="#223C61"/>
</svg>
