<svg width="24" height="24" viewBox="0 0 24 24" fill="none" xmlns="http://www.w3.org/2000/svg">
<path fill-rule="evenodd" clip-rule="evenodd" d="M15.9807 3.99947C15.9943 3.9992 16.0078 3.9992 16.0213 3.99947H17C18.7875 3.99947 20.3114 5.0155 21.3493 6.46849C22.3885 7.9234 23 9.88208 23 11.9995V17.9995H20.8293C20.4175 19.1647 19.3062 19.9995 18 19.9995C16.6938 19.9995 15.5825 19.1647 15.1707 17.9995H8.82929C8.41746 19.1647 7.30622 19.9995 6 19.9995C4.69378 19.9995 3.58254 19.1647 3.17071 17.9995H1V5.99947C1 4.8949 1.89543 3.99947 3 3.99947H15.9807ZM18 13.9995C19.3062 13.9995 20.4175 14.8343 20.8293 15.9995H21V12.9995H17.5C17.0285 12.9995 16.621 12.6701 16.5222 12.209L16.263 10.9995H3V15.9995H3.17071C3.58254 14.8343 4.69378 13.9995 6 13.9995C7.30622 13.9995 8.41746 14.8343 8.82929 15.9995H15.1707C15.5825 14.8343 16.6938 13.9995 18 13.9995ZM19.7218 7.63097C20.3416 8.49867 20.7914 9.66583 20.9436 10.9995H18.3084L17.2394 6.01056C18.1325 6.09333 19.0133 6.639 19.7218 7.63097ZM15.1916 5.99947L15.8344 8.99947H13V5.99947H15.1916ZM5 16.9995C5 16.4472 5.44772 15.9995 6 15.9995C6.55228 15.9995 7 16.4472 7 16.9995C7 17.5518 6.55228 17.9995 6 17.9995C5.44772 17.9995 5 17.5518 5 16.9995ZM17 16.9995C17 16.4472 17.4477 15.9995 18 15.9995C18.5523 15.9995 19 16.4472 19 16.9995C19 17.5518 18.5523 17.9995 18 17.9995C17.4477 17.9995 17 17.5518 17 16.9995ZM11 5.99947V8.99947H8V5.99947H11ZM6 5.99947V8.99947H3V5.99947H6Z" fill="#223C61"/>
</svg>
