<svg width="48" height="48" viewBox="0 0 48 48" fill="none" xmlns="http://www.w3.org/2000/svg">
<path d="M22.06 20.31C21.28 19.35 20.93 18.17 21.07 16.99C21.21 15.87 21.78 14.88 22.68 14.2C23.12 13.87 23.75 13.96 24.08 14.4C24.41 14.84 24.32 15.47 23.88 15.8C23.42 16.15 23.13 16.66 23.06 17.23C22.99 17.82 23.16 18.41 23.52 18.91L24.89 16.74C25.19 16.27 25.8 16.13 26.27 16.43C26.74 16.73 26.88 17.34 26.58 17.81L25.2 19.98C25.85 20.1 26.53 19.98 27.07 19.57C27.48 19.26 27.76 18.81 27.86 18.32C27.97 17.78 28.5 17.43 29.04 17.54C29.58 17.65 29.93 18.18 29.82 18.72C29.72 19.21 29.53 19.67 29.27 20.08C29.01 20.49 28.67 20.86 28.27 21.16C27.06 22.07 25.48 22.22 24.09 21.72L23.9 22.03C23.6 22.5 22.99 22.64 22.52 22.34C22.05 22.04 21.91 21.43 22.21 20.96L22.41 20.65C22.29 20.53 22.17 20.43 22.06 20.3V20.31ZM42.04 9V18C42.04 18.55 41.59 19 41.04 19C41.04 19 36.89 19.02 36.81 19L23.81 39.6C23.62 39.9 23.3 40.07 22.96 40.07C22.78 40.07 22.59 40.02 22.43 39.92L6.42999 29.83C6.20999 29.69 6.04999 29.46 5.98999 29.21C5.92999 28.95 5.97999 28.68 6.11999 28.46L12.07 19.01H8.04999C7.49999 19.01 7.04999 18.56 7.04999 18.01V9C7.04999 8.45 7.49999 8 8.04999 8H41.04C41.59 8 42.04 8.45 42.04 9ZM40.04 10H9.03999V17H13.32L16.21 12.4C16.5 11.93 17.12 11.79 17.59 12.09C18.06 12.38 18.2 13 17.9 13.47L14.53 18.82L16.63 20.15C17.1 20.45 17.24 21.06 16.94 21.53C16.64 22 16.03 22.14 15.56 21.84L13.46 20.51L8.31999 28.67L22.63 37.68L35.8 16.77L30.44 13.39C29.97 13.1 29.83 12.48 30.13 12.01C30.42 11.54 31.04 11.4 31.51 11.7L37.71 15.61C38.18 15.9 38.32 16.52 38.02 16.99H40.02V9.99L40.04 10ZM21.38 32.85C21.86 33.14 22.48 32.99 22.78 32.51L25.89 27.41C26.18 26.93 26.03 26.3 25.55 26.01C25.07 25.72 24.45 25.87 24.15 26.35L21.04 31.45C20.75 31.93 20.9 32.56 21.38 32.85Z" fill="#223C61"/>
</svg>
