<svg width="24" height="24" viewBox="0 0 24 24" fill="none" xmlns="http://www.w3.org/2000/svg">
<path fill-rule="evenodd" clip-rule="evenodd" d="M5 6C4.44772 6 4 6.44772 4 7V9.17071C5.16519 9.58254 6 10.6938 6 12C6 13.3062 5.16519 14.4175 4 14.8293V17C4 17.5523 4.44772 18 5 18H14V17C14 16.4477 14.4477 16 15 16C15.5523 16 16 16.4477 16 17V18H19C19.5523 18 20 17.5523 20 17V14.8293C18.8348 14.4175 18 13.3062 18 12C18 10.6938 18.8348 9.58254 20 9.17071V7C20 6.44772 19.5523 6 19 6H16V7C16 7.55228 15.5523 8 15 8C14.4477 8 14 7.55228 14 7V6H5ZM5 4C3.34315 4 2 5.34315 2 7V10C2 10.5523 2.44772 11 3 11C3.55228 11 4 11.4477 4 12C4 12.5523 3.55228 13 3 13C2.44772 13 2 13.4477 2 14V17C2 18.6569 3.34315 20 5 20H19C20.6569 20 22 18.6569 22 17V14C22 13.4477 21.5523 13 21 13C20.4477 13 20 12.5523 20 12C20 11.4477 20.4477 11 21 11C21.5523 11 22 10.5523 22 10V7C22 5.34315 20.6569 4 19 4H5ZM15 10C15.5523 10 16 10.4477 16 11V13C16 13.5523 15.5523 14 15 14C14.4477 14 14 13.5523 14 13V11C14 10.4477 14.4477 10 15 10Z" fill="#223C61"/>
</svg>
