<svg width="48" height="48" viewBox="0 0 48 48" fill="none" xmlns="http://www.w3.org/2000/svg">
<path d="M41 40H37V14C37 12.34 35.66 11 34 11H29V8H30C30.55 8 31 7.55 31 7C31 6.45 30.55 6 30 6H26C25.45 6 25 6.45 25 7C25 7.55 25.45 8 26 8H27V11H13C11.34 11 10 12.34 10 14V40H7C6.45 40 6 40.45 6 41C6 41.55 6.45 42 7 42H41C41.55 42 42 41.55 42 41C42 40.45 41.55 40 41 40ZM18 13H29V16H18V13ZM18 18H29V26H18V18ZM12 40V14C12 13.45 12.45 13 13 13H16V27C16 27.55 16.45 28 17 28H30C30.55 28 31 27.55 31 27V13H34C34.55 13 35 13.45 35 14V40H12Z" fill="#223C61"/>
</svg>
