<svg width="48" height="48" viewBox="0 0 48 48" fill="none" xmlns="http://www.w3.org/2000/svg">
<path d="M15.99 40.9402V41.0102C15.99 41.0102 15.99 40.9602 15.99 40.9402ZM30.5 30.9202C28.57 30.9202 27 29.3502 27 27.4202C27 25.4902 28.57 23.9202 30.5 23.9202C32.43 23.9202 34 25.4902 34 27.4202C34 29.3502 32.43 30.9202 30.5 30.9202ZM32 27.4202C32 26.5902 31.33 25.9202 30.5 25.9202C29.67 25.9202 29 26.5902 29 27.4202C29 28.2502 29.67 28.9202 30.5 28.9202C31.33 28.9202 32 28.2502 32 27.4202ZM11 36.9202C9.07 36.9202 7.5 35.3502 7.5 33.4202C7.5 31.4902 9.07 29.9202 11 29.9202C12.93 29.9202 14.5 31.4902 14.5 33.4202C14.5 35.3502 12.93 36.9202 11 36.9202ZM11 34.9202C11.83 34.9202 12.5 34.2502 12.5 33.4202C12.5 32.5902 11.83 31.9202 11 31.9202C10.17 31.9202 9.5 32.5902 9.5 33.4202C9.5 34.2502 10.17 34.9202 11 34.9202ZM16 8.99023C17.93 8.99023 19.5 10.5602 19.5 12.4902C19.5 14.4202 17.93 15.9902 16 15.9902C14.07 15.9902 12.5 14.4202 12.5 12.4902C12.5 10.5602 14.07 8.99023 16 8.99023ZM16 10.9902C15.17 10.9902 14.5 11.6602 14.5 12.4902C14.5 13.3202 15.17 13.9902 16 13.9902C16.83 13.9902 17.5 13.3202 17.5 12.4902C17.5 11.6602 16.83 10.9902 16 10.9902ZM40 5.99023H8C6.9 5.99023 6 6.89023 6 7.99023V20.9902C6 22.0902 6.9 22.9902 8 22.9902H10V26.9902C10 27.5402 10.45 27.9902 11 27.9902C11.55 27.9902 12 27.5402 12 26.9902V20.0102C12 19.4402 12.46 18.9902 13.02 18.9902H25C25.55 18.9902 26 18.5402 26 17.9902C26 17.4402 25.55 16.9902 25 16.9902H13.02C11.35 16.9902 10 18.3402 10 20.0102V20.9902H8V8.00023H40V21.0002H19C18.45 21.0002 18 21.4502 18 22.0002C18 22.5502 18.45 23.0002 19 23.0002H40C41.1 23.0002 42 22.1102 42 21.0002V8.00023C42 6.90023 41.11 6.00023 40 6.00023V5.99023ZM15.99 40.9402C15.95 39.3102 14.6 38.0002 12.93 38.0002H9.02C7.37 38.0002 6.03 39.3102 6 40.9302C6 40.9302 6 40.9402 6 40.9502V40.9802C6 40.9802 6 40.9702 6 40.9602C6 41.5002 6.45 41.9402 7 41.9402C7.55 41.9402 8 41.5002 8 40.9602V40.9902C8 40.4302 8.46 39.9802 9.02 39.9802H12.93C13.52 39.9802 13.99 40.4502 13.99 41.0302V40.9602H14C14 40.9602 13.99 41.0102 13.99 41.0302C13.99 41.5702 14.44 42.0102 14.99 42.0102C15.54 42.0102 15.99 41.5702 15.99 41.0302C15.99 41.0002 15.98 40.9802 15.98 40.9602L15.99 40.9402ZM42 41.0102V40.9402C42 40.9402 42 40.9902 42 41.0102ZM33.5 33.4202C33.5 31.4902 35.07 29.9202 37 29.9202C38.93 29.9202 40.5 31.4902 40.5 33.4202C40.5 35.3502 38.93 36.9202 37 36.9202C35.07 36.9202 33.5 35.3502 33.5 33.4202ZM35.5 33.4202C35.5 34.2502 36.17 34.9202 37 34.9202C37.83 34.9202 38.5 34.2502 38.5 33.4202C38.5 32.5902 37.83 31.9202 37 31.9202C36.17 31.9202 35.5 32.5902 35.5 33.4202ZM28.99 40.9402C28.95 39.3102 27.6 38.0002 25.93 38.0002H22.02C20.37 38.0002 19.03 39.3102 19 40.9302C19 40.9302 19 40.9402 19 40.9502V40.9802C19 40.9802 19 40.9702 19 40.9602C19 41.5002 19.45 41.9402 20 41.9402C20.55 41.9402 21 41.5002 21 40.9602V40.9902C21 40.4302 21.46 39.9802 22.02 39.9802H25.93C26.52 39.9802 26.99 40.4502 26.99 41.0302V40.9602H27C27 40.9602 26.99 41.0102 26.99 41.0302C26.99 41.5702 27.44 42.0102 27.99 42.0102C28.54 42.0102 28.99 41.5702 28.99 41.0302C28.99 41.0002 28.98 40.9802 28.98 40.9602L28.99 40.9402ZM17.5 30.9202C15.57 30.9202 14 29.3502 14 27.4202C14 25.4902 15.57 23.9202 17.5 23.9202C19.43 23.9202 21 25.4902 21 27.4202C21 29.3502 19.43 30.9202 17.5 30.9202ZM19 27.4202C19 26.5902 18.33 25.9202 17.5 25.9202C16.67 25.9202 16 26.5902 16 27.4202C16 28.2502 16.67 28.9202 17.5 28.9202C18.33 28.9202 19 28.2502 19 27.4202ZM29 41.0102V40.9402C29 40.9402 29 40.9902 29 41.0102ZM41.99 40.9402C41.95 39.3102 40.6 38.0002 38.93 38.0002H35.02C33.37 38.0002 32.03 39.3102 32 40.9302C32 40.9302 32 40.9402 32 40.9502V40.9802C32 40.9802 32 40.9702 32 40.9602C32 41.5002 32.45 41.9402 33 41.9402C33.55 41.9402 34 41.5002 34 40.9602V40.9902C34 40.4302 34.46 39.9802 35.02 39.9802H38.93C39.52 39.9802 39.99 40.4502 39.99 41.0302V40.9602H40C40 40.9602 39.99 41.0102 39.99 41.0302C39.99 41.5702 40.44 42.0102 40.99 42.0102C41.54 42.0102 41.99 41.5702 41.99 41.0302C41.99 41.0002 41.98 40.9802 41.98 40.9602L41.99 40.9402ZM20.5 33.4202C20.5 31.4902 22.07 29.9202 24 29.9202C25.93 29.9202 27.5 31.4902 27.5 33.4202C27.5 35.3502 25.93 36.9202 24 36.9202C22.07 36.9202 20.5 35.3502 20.5 33.4202ZM22.5 33.4202C22.5 34.2502 23.17 34.9202 24 34.9202C24.83 34.9202 25.5 34.2502 25.5 33.4202C25.5 32.5902 24.83 31.9202 24 31.9202C23.17 31.9202 22.5 32.5902 22.5 33.4202Z" fill="#223C61"/>
</svg>
