<svg width="48" height="48" viewBox="0 0 48 48" fill="none" xmlns="http://www.w3.org/2000/svg">
<path d="M23.99 29C23.55 29 23.19 29.14 22.91 29.42C22.63 29.7 22.49 30.06 22.49 30.5C22.49 30.94 22.63 31.3 22.91 31.58C23.19 31.86 23.55 32 23.99 32C24.43 32 24.79 31.86 25.07 31.58C25.35 31.3 25.49 30.94 25.49 30.5C25.49 30.06 25.35 29.7 25.07 29.42C24.79 29.14 24.43 29 23.99 29Z" fill="#223C61"/>
<path d="M24 26C24.55 26 25 25.55 25 25V15C25 14.45 24.55 14 24 14C23.45 14 23 14.45 23 15V25C23 25.55 23.45 26 24 26Z" fill="#223C61"/>
<path d="M23.98 6C14.05 6 6 14.06 6 24C6 33.94 14.05 42 23.98 42C33.91 42 42 33.94 42 24C42 14.06 33.94 6 23.98 6ZM24 40C15.18 40 8 32.82 8 24C8 15.18 15.18 8 24 8C32.82 8 40 15.18 40 24C40 32.82 32.82 40 24 40Z" fill="#223C61"/>
</svg>
