<svg width="48" height="48" viewBox="0 0 48 48" fill="none" xmlns="http://www.w3.org/2000/svg">
<path d="M16 39.9399H32C32.55 39.9399 33 40.3899 33 40.9399V40.9999C33 41.5499 32.55 41.9999 32 41.9999H16C15.45 41.9999 15 41.5499 15 40.9999V40.9399C15 40.3899 15.45 39.9399 16 39.9399ZM22 9.10994V10.0199C22 11.9299 22.54 13.5199 23.62 14.7799C24.7 16.0399 26.06 16.6699 27.7 16.6699C28.32 16.6699 28.94 16.5399 29.56 16.2799C30.18 16.0199 30.77 15.6699 31.34 15.2099C32.5 16.5199 33.39 17.9499 34.01 19.5099C34.63 21.0699 34.94 22.6699 34.94 24.3099C34.94 26.2199 34.56 28.0199 33.79 29.7099C33.02 31.3899 31.95 32.7999 30.58 33.9199C30.69 33.5599 30.77 33.1799 30.82 32.7999C30.87 32.4199 30.9 32.0499 30.9 31.6799C30.9 30.7099 30.74 29.7999 30.42 28.9499C30.1 28.0999 29.63 27.3299 29.01 26.6299L25.19 22.3999C24.79 21.9599 24.1 21.9599 23.7 22.3999L19.88 26.6299C19.26 27.3299 18.79 28.0999 18.47 28.9499C18.15 29.7999 17.99 30.7099 17.99 31.6799C17.99 32.0399 18.02 32.4199 18.07 32.7999C18.12 33.1799 18.2 33.5499 18.31 33.9199C16.94 32.7999 15.87 31.3899 15.1 29.7099C14.33 28.0299 13.95 26.2299 13.95 24.3099C13.95 22.9999 14.14 21.6599 14.52 20.2799C14.9 18.8999 15.44 17.5499 16.14 16.2299C16.84 14.9099 17.69 13.6399 18.69 12.4299C19.69 11.2199 20.8 10.1099 22.04 9.10994M20.79 7.54994C19.45 8.62994 18.23 9.84994 17.15 11.1599C16.07 12.4699 15.14 13.8599 14.38 15.2999C13.61 16.7499 13.01 18.2499 12.6 19.7699C12.18 21.3199 11.96 22.8499 11.96 24.3299C11.96 26.5199 12.41 28.6199 13.29 30.5599C14.18 32.5199 15.41 34.1699 17.06 35.4899C17.75 36.0399 18.55 36.5199 19.25 36.8999C19.95 37.2799 20.84 36.6499 20.69 35.8399L20.24 33.3699C20.16 33.0999 20.1 32.8199 20.06 32.5399C20.02 32.2599 20 31.9799 20 31.7099C20 30.9799 20.12 30.3199 20.35 29.6899C20.59 29.0599 20.93 28.5099 21.39 27.9899L24.46 24.5899L27.54 27.9999C27.99 28.5099 28.33 29.0599 28.57 29.6899C28.81 30.3099 28.92 30.9699 28.92 31.7099C28.92 31.9799 28.9 32.2599 28.86 32.5399C28.82 32.8199 28.76 33.0999 28.68 33.3699L28.29 35.7899C28.16 36.5899 28.99 37.2099 29.72 36.8399C30.45 36.4699 31.32 35.9699 31.86 35.4999C33.06 34.4399 34.74 32.5299 35.63 30.5699C36.51 28.6299 36.96 26.5299 36.96 24.3399C36.96 22.4499 36.6 20.5899 35.89 18.7899C35.19 17.0199 34.17 15.3699 32.86 13.8899L32.23 13.1799C31.88 12.7799 31.27 12.7299 30.86 13.0599L30.12 13.6499C29.7 13.9799 29.27 14.2499 28.83 14.4299C27.86 14.8299 27.03 14.7099 25.99 14.1199C25.68 13.9499 25.39 13.7299 25.16 13.4499C24.41 12.5599 24.04 11.4399 24.04 10.0199V7.02994C24.04 6.16994 23.08 5.68994 22.42 6.21994L20.78 7.53994L20.79 7.54994Z" fill="#223C61"/>
</svg>
