<svg width="24" height="24" viewBox="0 0 24 24" fill="none" xmlns="http://www.w3.org/2000/svg">
<path fill-rule="evenodd" clip-rule="evenodd" d="M3 6C3 4.34315 4.34315 3 6 3H18C19.6569 3 21 4.34315 21 6V18C21 19.6569 19.6569 21 18 21H6C4.34315 21 3 19.6569 3 18V6ZM6 5C5.44772 5 5 5.44772 5 6V18C5 18.5523 5.44772 19 6 19H18C18.5523 19 19 18.5523 19 18V6C19 5.44772 18.5523 5 18 5H6Z" fill="#223C61"/>
<path fill-rule="evenodd" clip-rule="evenodd" d="M8 8C8 7.44772 8.44772 7 9 7H13C14.6569 7 16 8.34315 16 10C16 11.6569 14.6569 13 13 13H10V16C10 16.5523 9.55228 17 9 17C8.44772 17 8 16.5523 8 16V8ZM10 11H13C13.5523 11 14 10.5523 14 10C14 9.44772 13.5523 9 13 9H10V11Z" fill="#223C61"/>
</svg>
