<svg width="24" height="24" viewBox="0 0 24 24" fill="none" xmlns="http://www.w3.org/2000/svg">
<path fill-rule="evenodd" clip-rule="evenodd" d="M20.6648 2.05811L20.6522 2.06268L2.66036 8.55972C2.63429 8.56913 2.60862 8.57963 2.58341 8.59118C2.03241 8.84368 1.67914 9.39417 1.67914 10.0003C1.67914 10.5993 2.0242 11.144 2.56417 11.4004L9.25465 14.7456L12.5999 21.4361C12.8563 21.9761 13.401 22.3211 14 22.3211C14.6061 22.3211 15.1566 21.9679 15.4091 21.4169C15.4207 21.3917 15.4311 21.366 15.4406 21.3399L21.9317 3.36434C21.9542 3.30663 21.9712 3.24726 21.9826 3.18705C22.0042 3.07395 22.0056 2.96034 21.9889 2.8506C21.9843 2.82016 21.9783 2.79002 21.9709 2.76027C21.9392 2.63186 21.8818 2.50851 21.7986 2.39844C21.7704 2.36109 21.7398 2.32603 21.7071 2.29338C21.6423 2.2284 21.5679 2.17162 21.485 2.12565C21.4358 2.09839 21.3849 2.07558 21.3328 2.05723C21.2908 2.04241 21.2479 2.03036 21.2042 2.02121C21.0853 1.99627 20.9657 1.99378 20.8503 2.01134C20.7869 2.021 20.7248 2.03672 20.6648 2.05811ZM17.1227 5.46363L4.37177 10.0681L9.8027 12.7836L17.1227 5.46363ZM11.2168 14.1979L18.5364 6.87832L13.9322 19.6285L11.2168 14.1979Z" fill="#223C61"/>
</svg>
