<svg width="48" height="48" viewBox="0 0 48 48" fill="none" xmlns="http://www.w3.org/2000/svg">
<path d="M31.9 19.8698L32.25 20.2198C32.64 20.6098 33.27 20.6098 33.66 20.2198C34.05 19.8298 34.05 19.1998 33.66 18.8098L33.31 18.4598C32.92 18.0698 32.92 17.4398 33.31 17.0498C34.48 15.8798 34.48 13.9798 33.31 12.8098L32.96 12.4598C32.57 12.0698 31.94 12.0698 31.55 12.4598C31.16 12.8498 31.16 13.4798 31.55 13.8698L31.9 14.2198C32.29 14.6098 32.29 15.2398 31.9 15.6298C30.73 16.7998 30.73 18.6998 31.9 19.8698Z" fill="#223C61"/>
<path d="M34 25.9698V22.8898C34 22.3398 33.55 21.8898 33 21.8898C32.45 21.8898 32 22.3398 32 22.8898V24.3498L26.58 20.2998C26.22 20.0298 25.72 20.0298 25.36 20.3198L24.39 21.0898C24.27 19.5298 23.59 18.4998 23.05 17.9198C23.72 16.0398 23.37 13.8898 22.09 12.3598C21.22 11.3298 20.01 10.6798 18.7 10.5498C17.85 9.56977 16.67 9.00977 15.39 9.00977C14.11 9.00977 12.94 9.55977 12.09 10.5398C11.35 10.6098 10.64 10.8398 10.01 11.2198C7.77999 12.5598 6.83999 15.4098 7.70999 17.8798C7.51999 18.0598 7.33999 18.2598 7.16999 18.4698C5.48999 20.6198 5.63999 23.7598 7.42999 25.7398C7.40999 25.8598 7.39999 25.9898 7.39999 26.1198C7.22999 29.1298 9.42999 31.7298 12.32 31.9098H13.98L14 37.9198C14 38.4698 14.45 38.9198 15 38.9198C15.55 38.9198 16 38.4698 16 37.9198L15.98 31.2698C15.98 31.2698 15.96 31.1898 15.95 31.1398C15.97 31.0698 15.99 30.9998 15.99 30.9198C15.99 30.3698 15.54 29.9198 14.99 29.9198H12.41C10.64 29.8098 9.28999 28.1598 9.39999 26.2398C9.40999 26.0298 9.43999 25.8298 9.48999 25.6298L9.61999 25.0598L9.17999 24.6698C7.78999 23.4298 7.59999 21.2198 8.75999 19.7298C8.96999 19.4598 9.21999 19.2198 9.49999 19.0298L10.24 18.5298L9.81999 17.7398C8.92999 16.0498 9.47999 13.9098 11.05 12.9698C11.52 12.6898 12.05 12.5698 12.6 12.5498H13.12L13.42 12.1298C13.9 11.4398 14.62 11.0498 15.4 11.0498C16.18 11.0498 16.9 11.4498 17.38 12.1298L17.68 12.5598H18.2C19.12 12.5598 19.96 12.9598 20.57 13.6798C21.51 14.7998 21.67 16.4298 20.98 17.7498L20.56 18.5398L21.3 19.0398C21.36 19.0798 22.76 20.0698 22.34 22.5298C22.33 22.6098 22.34 22.6798 22.34 22.7498L16.35 27.4698C15.91 27.8198 15.84 28.4598 16.2 28.8898L16.22 28.9098C16.58 29.3398 17.22 29.3898 17.64 29.0298L17.99 28.6998V37.9398C17.99 38.4898 18.43 38.9298 18.98 38.9298H33C33.55 38.9298 33.99 38.4898 33.99 37.9398V28.5198L34.29 28.8598C34.7 29.2898 35.39 29.2598 35.76 28.7998C36.09 28.3998 36.04 27.7998 35.65 27.4598L33.99 26.0198L34 25.9698ZM32 36.8898H20V27.0898L25.99 22.5798L31.99 27.0798V36.8898H32Z" fill="#223C61"/>
<path d="M14.98 26.8898C15.53 26.8898 15.98 26.4398 15.98 25.8898V21.9198L18.4 19.4798C18.79 19.0898 18.79 18.4498 18.4 18.0698C18.01 17.6798 17.37 17.6798 16.99 18.0698L15.99 19.0798V16.8898C15.99 16.3398 15.54 15.8898 14.99 15.8898C14.44 15.8898 13.99 16.3398 13.99 16.8898V21.7998L12.99 20.7998C12.6 20.4098 11.97 20.3998 11.58 20.7998C11.19 21.1898 11.19 21.8198 11.58 22.2098L14 24.6498V25.8998C14 26.4498 14.45 26.8998 15 26.8998L14.98 26.8898Z" fill="#223C61"/>
<path d="M41.01 32.8998C40.46 32.8998 40.02 33.3398 40.02 33.8898V34.8898H38V33.8898C38 33.3398 37.56 32.8998 37.01 32.8998C36.46 32.8998 36.02 33.3398 36.02 33.8898V37.8898C36.02 38.4398 36.46 38.8798 37.01 38.8798C37.56 38.8798 38 38.4398 38 37.8898V36.8798H40.02V37.8898C40.02 38.4398 40.46 38.8798 41.01 38.8798C41.56 38.8798 42 38.4398 42 37.8898V33.8898C42 33.3398 41.56 32.8998 41.01 32.8998Z" fill="#223C61"/>
<path d="M27 29.8898H25C24.4477 29.8898 24 30.3375 24 30.8898V31.8898C24 32.442 24.4477 32.8898 25 32.8898H27C27.5523 32.8898 28 32.442 28 31.8898V30.8898C28 30.3375 27.5523 29.8898 27 29.8898Z" fill="#223C61"/>
</svg>
