<svg width="24" height="24" viewBox="0 0 24 24" fill="none" xmlns="http://www.w3.org/2000/svg">
<path fill-rule="evenodd" clip-rule="evenodd" d="M6 4C6 2.89543 6.89543 2 8 2C9.10457 2 10 2.89543 10 4C10 5.10457 9.10457 6 8 6C6.89543 6 6 5.10457 6 4ZM7.4 7.2C7.73919 6.94561 8.20193 6.93277 8.5547 7.16795L11.3761 9.04889L14.1644 9.51361C14.7092 9.6044 15.0772 10.1196 14.9864 10.6644C14.8956 11.2092 14.3804 11.5772 13.8356 11.4864L10.8356 10.9864C10.6961 10.9631 10.563 10.9105 10.4453 10.8321L9 9.86852V13.6972L10.8321 16.4453C10.8956 16.5407 10.9423 16.6463 10.9701 16.7575L11.9701 20.7575C12.1041 21.2933 11.7783 21.8362 11.2425 21.9701C10.7067 22.1041 10.1638 21.7783 10.0299 21.2425L9.07187 17.4106L7.16795 14.5547C7.05844 14.3904 7 14.1974 7 14V10L5.17661 11.3675L5.94869 13.6838C6.12333 14.2077 5.84017 14.774 5.31623 14.9487C4.79229 15.1233 4.22597 14.8402 4.05132 14.3162L3.05132 11.3162C2.91521 10.9079 3.05566 10.4583 3.4 10.2L7.4 7.2ZM17.5 12C17.2239 12 17 12.2239 17 12.5V21C17 21.5523 16.5523 22 16 22C15.4477 22 15 21.5523 15 21V12.5C15 11.1193 16.1193 10 17.5 10C18.8807 10 20 11.1193 20 12.5V13C20 13.5523 19.5523 14 19 14C18.4477 14 18 13.5523 18 13V12.5C18 12.2239 17.7761 12 17.5 12ZM7.44722 16.1056C7.9412 16.3526 8.14142 16.9532 7.89443 17.4472L5.89443 21.4472C5.64744 21.9412 5.04677 22.1414 4.55279 21.8944C4.05881 21.6474 3.85859 21.0468 4.10558 20.5528L6.10558 16.5528C6.35257 16.0588 6.95324 15.8586 7.44722 16.1056Z" fill="#223C61"/>
</svg>
