<svg width="48" height="48" viewBox="0 0 48 48" fill="none" xmlns="http://www.w3.org/2000/svg">
<path d="M23.94 10.0198C23.39 10.0198 22.94 9.5698 22.94 9.0198V7.0498C22.94 6.4998 23.39 6.0498 23.94 6.0498C24.49 6.0498 24.94 6.4998 24.94 7.0498V9.0198C24.94 9.5698 24.49 10.0198 23.94 10.0198ZM39.87 21.9798C39.87 22.5298 39.42 22.9798 38.87 22.9798H36.9C36.35 22.9798 35.9 22.5298 35.9 21.9798C35.9 21.4298 36.35 20.9798 36.9 20.9798H38.87C39.42 20.9798 39.87 21.4298 39.87 21.9798ZM9 20.9798H10.97C11.52 20.9798 11.97 21.4298 11.97 21.9798C11.97 22.5298 11.52 22.9798 10.97 22.9798H9C8.45 22.9798 8 22.5298 8 21.9798C8 21.4298 8.45 20.9798 9 20.9798ZM15.44 13.4998C15.05 13.8898 14.42 13.8898 14.03 13.4998L12.63 12.0998C12.24 11.7098 12.24 11.0798 12.63 10.6898C13.02 10.2998 13.65 10.2998 14.04 10.6898L15.44 12.0898C15.83 12.4798 15.83 13.1098 15.44 13.4998ZM35.17 10.6098C35.56 10.9998 35.56 11.6298 35.17 12.0198L33.77 13.4198C33.38 13.8098 32.75 13.8098 32.36 13.4198C31.97 13.0298 31.97 12.3998 32.36 12.0098L33.76 10.6098C34.15 10.2198 34.78 10.2198 35.17 10.6098ZM24.06 12.0298H24.05C18.56 12.0298 14.09 16.4898 14.09 21.9798C14.09 24.3098 14.9 26.5698 16.39 28.3598C16.61 28.6298 16.83 28.8698 17.03 29.0998C17.82 29.9698 18.04 30.2598 18.04 31.0198V35.9298C18.04 37.8698 19.43 39.5498 21.19 39.9298C21.59 41.1298 22.71 41.9998 24.04 41.9998C25.37 41.9998 26.45 41.1598 26.87 39.9998C28.65 39.6198 30.04 37.9498 30.04 36.0098V31.0898C30.04 30.3098 30.3 29.9798 31.11 29.0598C31.3 28.8498 31.5 28.6198 31.7 28.3798C33.19 26.5998 34 24.3398 34 22.0198C34 16.5298 29.54 12.0598 24.05 12.0498L24.06 12.0298ZM26.6 37.9898H21.73L21.62 37.9698C20.74 37.7798 20.05 36.8898 20.05 35.9298V33.9898H28.05V35.9898C28.05 36.8998 27.42 37.7398 26.6 37.9898ZM30.18 27.0798C29.99 27.3098 29.81 27.5198 29.63 27.7098C28.78 28.6598 28.05 29.4898 28.05 31.0698V31.9798H20.05V31.0098C20.05 29.4498 19.35 28.6598 18.5 27.7198C18.32 27.5198 18.13 27.3098 17.93 27.0698C16.74 25.6398 16.09 23.8298 16.09 21.9698C16.09 17.5898 19.67 14.0198 24.05 14.0198C28.44 14.0198 32.01 17.5998 32 21.9898C32 23.8398 31.35 25.6498 30.16 27.0698L30.18 27.0798Z" fill="#223C61"/>
</svg>
