<svg width="24" height="24" viewBox="0 0 24 24" fill="none" xmlns="http://www.w3.org/2000/svg">
<path fill-rule="evenodd" clip-rule="evenodd" d="M12 2C12.5523 2 13 2.44772 13 3V4H19C19.2652 4 19.5196 4.10536 19.7071 4.29289L21.7071 6.29289C22.0976 6.68342 22.0976 7.31658 21.7071 7.70711L19.7071 9.70711C19.5196 9.89464 19.2652 10 19 10H13V12C14.1046 12 15 12.8954 15 14V16C15 17.1046 14.1046 18 13 18V22C13 22.5523 12.5523 23 12 23C11.4477 23 11 22.5523 11 22V18H6C5.73478 18 5.48043 17.8946 5.29289 17.7071L3.29289 15.7071C2.90237 15.3166 2.90237 14.6834 3.29289 14.2929L5.29289 12.2929C5.48043 12.1054 5.73478 12 6 12H11V10H9C7.89543 10 7 9.10457 7 8V6C7 4.89543 7.89543 4 9 4H11V3C11 2.44772 11.4477 2 12 2ZM9 6V8H18.5858L19.5858 7L18.5858 6H9ZM6.41421 14L5.41421 15L6.41421 16H13V14H6.41421Z" fill="#223C61"/>
</svg>
