<svg width="48" height="48" viewBox="0 0 48 48" fill="none" xmlns="http://www.w3.org/2000/svg">
<path d="M11.45 12.91C12.37 12.91 13.24 12.55 13.89 11.9C14.54 11.25 14.9 10.38 14.9 9.46C14.9 7.55 13.35 6 11.44 6C9.52999 6 7.97999 7.55 7.97999 9.46C7.97999 11.37 9.52999 12.92 11.44 12.92L11.45 12.91ZM11.45 8C12.25 8 12.91 8.65 12.91 9.46C12.91 9.85 12.76 10.21 12.48 10.49C12.2 10.76 11.84 10.92 11.45 10.92C10.65 10.92 9.98999 10.27 9.98999 9.46C9.98999 8.65 10.64 8 11.45 8Z" fill="#223C61"/>
<path d="M13 18.01L15.09 20.8C15.41 21.22 15.99 21.32 16.43 21.04C16.92 20.72 17.04 20.06 16.68 19.59L14.2 16.31L14.91 15.44C15.1 15.17 15.41 15.01 15.73 15.01H20.26L23.14 19.55C23.33 19.85 23.65 20.01 23.99 20.01C24.17 20.01 24.36 19.96 24.52 19.85C24.99 19.55 25.13 18.94 24.83 18.47L21.66 13.47C21.48 13.18 21.16 13.01 20.82 13.01H15.74C14.76 13.01 13.84 13.49 13.28 14.29L10.66 18.01H6.98999C6.43999 18.01 5.98999 18.46 5.98999 19.01C5.98999 19.56 6.43999 20.01 6.98999 20.01H11.18C11.51 20.01 11.81 19.85 12 19.59L13.01 18.02L13 18.01Z" fill="#223C61"/>
<path d="M7.98999 31.04C9.08904 31.04 9.97999 30.149 9.97999 29.05C9.97999 27.951 9.08904 27.06 7.98999 27.06C6.89094 27.06 5.99999 27.951 5.99999 29.05C5.99999 30.149 6.89094 31.04 7.98999 31.04Z" fill="#223C61"/>
<path d="M25.49 26.84C25.66 26.94 25.84 27 26.02 27C26.35 27 26.68 26.84 26.87 26.54L29.75 22H34.28C34.61 22 34.91 22.16 35.1 22.43L35.81 23.3L33.33 26.58C32.98 27.04 33.09 27.71 33.58 28.03C34.02 28.31 34.6 28.21 34.92 27.79L37.01 25L38.02 26.57C38.21 26.84 38.51 26.99 38.84 26.99H41.03C41.58 26.99 42.03 26.54 42.03 25.99C42.03 25.44 41.58 24.99 41.03 24.99H39.36L36.74 21.27C36.18 20.47 35.26 19.99 34.28 19.99H29.2C28.86 19.99 28.54 20.17 28.36 20.45L25.19 25.45C24.89 25.92 25.03 26.53 25.5 26.83L25.49 26.84Z" fill="#223C61"/>
<path d="M38.56 19.82C40.47 19.82 42.02 18.27 42.02 16.36C42.02 14.45 40.47 12.9 38.56 12.9C36.65 12.9 35.1 14.45 35.1 16.36C35.1 17.28 35.46 18.15 36.11 18.8C36.76 19.45 37.63 19.81 38.55 19.81L38.56 19.82ZM38.56 14.91C39.36 14.91 40.02 15.56 40.02 16.37C40.02 17.18 39.37 17.83 38.56 17.83C38.17 17.83 37.81 17.68 37.53 17.4C37.26 17.13 37.1 16.76 37.1 16.37C37.1 15.57 37.75 14.91 38.56 14.91Z" fill="#223C61"/>
<path d="M39.92 42C40.4723 42 40.92 41.5523 40.92 41C40.92 40.4477 40.4723 40 39.92 40C39.3677 40 38.92 40.4477 38.92 41C38.92 41.5523 39.3677 42 39.92 42Z" fill="#223C61"/>
<path d="M29.47 42C30.0223 42 30.47 41.5523 30.47 41C30.47 40.4477 30.0223 40 29.47 40C28.9177 40 28.47 40.4477 28.47 41C28.47 41.5523 28.9177 42 29.47 42Z" fill="#223C61"/>
<path d="M40.96 37.01H37.98C37.98 37.01 38 36.95 38 36.92V32.65C38 32.31 37.83 32 37.55 31.82L30.34 27.85L32.29 25.05C32.62 24.61 32.54 23.98 32.1 23.65C31.66 23.32 31.03 23.4 30.7 23.84L28.6 26.94C27.99 27.78 28.25 28.96 29.16 29.46L36 33.2V36.93C36 36.93 36.02 36.99 36.02 37.02H27.89C27.36 37.02 26.92 37.47 26.92 38.02C26.92 38.57 27.35 39.02 27.89 39.02H40.96C41.49 39.02 41.93 38.57 41.93 38.02C41.93 37.47 41.5 37.02 40.96 37.02V37.01Z" fill="#223C61"/>
<path d="M20.99 26.29C20.99 26.29 21.46 25.11 21.46 24.98C21.46 24.45 21.03 24.02 20.5 24.02C20.13 24.02 19.81 24.24 19.65 24.55L19.63 24.59C19.63 24.6 19.63 24.61 19.62 24.62L18.95 26.32C18.9 26.59 18.95 26.86 19.11 27.08L21.55 30.61C21.74 30.89 22.06 31.04 22.37 31.04C22.57 31.04 22.77 30.98 22.94 30.86C23.39 30.55 23.51 29.92 23.19 29.47L20.99 26.28V26.29Z" fill="#223C61"/>
<path d="M21.38 20.02L19.28 16.92C18.95 16.48 18.32 16.39 17.88 16.73C17.44 17.06 17.35 17.69 17.69 18.13L19.64 20.93L12.43 24.9C12.15 25.09 11.98 25.4 11.98 25.73V30C11.98 30.55 12.43 31 12.98 31C13.53 31 13.98 30.55 13.98 30V26.27L20.82 22.53C21.73 22.03 22 20.85 21.38 20.01V20.02Z" fill="#223C61"/>
<path d="M29.63 34.71L30.64 33.22C30.64 33.22 30.65 33.2 30.66 33.19L30.69 33.15C30.86 32.84 30.86 32.46 30.65 32.16C30.36 31.73 29.77 31.62 29.34 31.91C29.23 31.98 28.53 33.02 28.53 33.02L24.71 33C24.17 33 23.72 33.43 23.71 33.98C23.71 34.19 23.77 34.38 23.88 34.54C24.06 34.8 24.35 34.97 24.69 34.97L28.92 35C29.19 35 29.44 34.9 29.63 34.71Z" fill="#223C61"/>
</svg>
