<svg width="24" height="24" viewBox="0 0 24 24" fill="none" xmlns="http://www.w3.org/2000/svg">
<path fill-rule="evenodd" clip-rule="evenodd" d="M10.4472 3.10579C10.9412 3.35278 11.1414 3.95345 10.8944 4.44743L9.61803 7.00022H11C11.3466 7.00022 11.6684 7.17967 11.8507 7.47449C12.0329 7.7693 12.0494 8.13744 11.8944 8.44743L9.89443 12.4474C9.64744 12.9414 9.04676 13.1416 8.55279 12.8946C8.05881 12.6477 7.85858 12.047 8.10557 11.553L9.38197 9.00022H8C7.65342 9.00022 7.33156 8.82077 7.14935 8.52595C6.96714 8.23113 6.95058 7.86299 7.10557 7.55301L9.10557 3.55301C9.35256 3.05903 9.95324 2.8588 10.4472 3.10579ZM14 5.00022C14 4.44793 14.4477 4.00022 15 4.00022H16C17.6569 4.00022 19 5.34336 19 7.00022V12.0002C19 12.4928 18.6413 12.912 18.1546 12.9882C16.0079 13.3242 14.324 15.0082 13.988 17.1549C13.9118 17.6415 13.4926 18.0002 13 18.0002H8.82929C8.41746 19.1654 7.30622 20.0002 6 20.0002C4.34315 20.0002 3 18.6571 3 17.0002C3 15.3434 4.34315 14.0002 6 14.0002C7.30622 14.0002 8.41746 14.835 8.82929 16.0002H12.1982C12.8617 13.6806 14.6804 11.8619 17 11.1985V7.00022C17 6.44793 16.5523 6.00022 16 6.00022H15C14.4477 6.00022 14 5.5525 14 5.00022ZM6 16.0002C5.44772 16.0002 5 16.4479 5 17.0002C5 17.5525 5.44772 18.0002 6 18.0002C6.55228 18.0002 7 17.5525 7 17.0002C7 16.4479 6.55228 16.0002 6 16.0002ZM18 16.0002C17.4477 16.0002 17 16.4479 17 17.0002C17 17.5525 17.4477 18.0002 18 18.0002C18.5523 18.0002 19 17.5525 19 17.0002C19 16.4479 18.5523 16.0002 18 16.0002ZM15 17.0002C15 15.3434 16.3431 14.0002 18 14.0002C19.6569 14.0002 21 15.3434 21 17.0002C21 18.6571 19.6569 20.0002 18 20.0002C16.3431 20.0002 15 18.6571 15 17.0002Z" fill="#223C61"/>
</svg>
