{
  "todo": {
    "data-list": {
      "font-family": {
        "value": "{utrecht.document.font-family}",
        "type": "fontFamilies"
      },
      "item-value": {
        "font-weight": {
          "value": "{utrecht.document.font-weight}",
          "type": "fontWeights"
        },
        "row": {
          "padding-block-end": {
            "value": "{voorbeeld.space.block.snail}",
            "type": "spacing"
          },
          "padding-block-start": {
            "value": "{voorbeeld.space.block.snail}",
            "type": "spacing"
          },
          "padding-inline-end": {
            "value": "0px",
            "type": "spacing"
          },
          "padding-inline-start": {
            "value": "0px",
            "type": "spacing"
          }
        },
        "padding-block-end": {
          "value": "{voorbeeld.space.block.snail}",
          "type": "spacing"
        },
        "padding-block-start": {
          "value": "{voorbeeld.space.block.ant}",
          "type": "spacing"
        },
        "padding-inline-end": {
          "value": "0px",
          "type": "spacing"
        },
        "padding-inline-start": {
          "value": "0px",
          "type": "spacing"
        }
      },
      "item-key": {
        "font-weight": {
          "value": "{utrecht.document.strong.font-weight}",
          "type": "fontWeights"
        },
        "row": {
          "padding-block-end": {
            "value": "{voorbeeld.space.block.snail}",
            "type": "spacing"
          },
          "padding-block-start": {
            "value": "{voorbeeld.space.block.snail}",
            "type": "spacing"
          },
          "padding-inline-end": {
            "value": "{voorbeeld.space.inline.mouse}",
            "type": "spacing"
          },
          "padding-inline-start": {
            "value": "0px",
            "type": "spacing"
          }
        },
        "padding-block-end": {
          "value": "{voorbeeld.space.block.ant}",
          "type": "spacing"
        },
        "padding-block-start": {
          "value": "{voorbeeld.space.block.snail}",
          "type": "spacing"
        },
        "padding-inline-end": {
          "value": "0px",
          "type": "spacing"
        },
        "padding-inline-start": {
          "value": "0px",
          "type": "spacing"
        }
      },
      "item": {
        "border-width": {
          "type": "borderWidth",
          "value": "{voorbeeld.border-width.sm}"
        },
        "border-color": {
          "value": "{utrecht.line.border-color}",
          "type": "color"
        },
        "color": {
          "value": "{utrecht.document.color}",
          "type": "color"
        }
      },
      "font-size": {
        "value": "{utrecht.document.font-size}",
        "type": "fontSizes"
      },
      "line-height": {
        "value": "{utrecht.document.line-height}",
        "type": "lineHeights"
      },
      "item-action": {
        "row": {
          "padding-block-end": {
            "value": "{voorbeeld.space.block.snail}",
            "type": "spacing"
          },
          "padding-block-start": {
            "value": "{voorbeeld.space.block.snail}",
            "type": "spacing"
          },
          "padding-inline-end": {
            "value": "0px",
            "type": "spacing"
          },
          "padding-inline-start": {
            "value": "{voorbeeld.space.inline.mouse}",
            "type": "spacing"
          }
        },
        "padding-block-end": {
          "value": "{voorbeeld.space.block.snail}",
          "type": "spacing"
        },
        "padding-block-start": {
          "value": "{voorbeeld.space.block.snail}",
          "type": "spacing"
        },
        "padding-inline-end": {
          "value": "{voorbeeld.space.inline.mouse}",
          "type": "spacing"
        },
        "padding-inline-start": {
          "value": "0px",
          "type": "spacing"
        }
      }
    }
  }
}
