<svg width="24" height="24" viewBox="0 0 24 24" fill="none" xmlns="http://www.w3.org/2000/svg">
<path fill-rule="evenodd" clip-rule="evenodd" d="M3 5C3 3.34315 4.34315 2 6 2H18C19.6569 2 21 3.34315 21 5V19C21 20.6569 19.6569 22 18 22H6C4.34315 22 3 20.6569 3 19V5ZM6 4C5.44772 4 5 4.44772 5 5V19C5 19.5523 5.44772 20 6 20H18C18.5523 20 19 19.5523 19 19V5C19 4.44772 18.5523 4 18 4H6ZM7 8C7 6.89543 7.89543 6 9 6H15C16.1046 6 17 6.89543 17 8V9C17 10.1046 16.1046 11 15 11H9C7.89543 11 7 10.1046 7 9V8ZM15 8H9V9H15V8ZM8 13C8.55228 13 9 13.4477 9 14V14.01C9 14.5623 8.55228 15.01 8 15.01C7.44772 15.01 7 14.5623 7 14.01V14C7 13.4477 7.44772 13 8 13ZM12 13C12.5523 13 13 13.4477 13 14V14.01C13 14.5623 12.5523 15.01 12 15.01C11.4477 15.01 11 14.5623 11 14.01V14C11 13.4477 11.4477 13 12 13ZM16 13C16.5523 13 17 13.4477 17 14V14.01C17 14.5623 16.5523 15.01 16 15.01C15.4477 15.01 15 14.5623 15 14.01V14C15 13.4477 15.4477 13 16 13ZM8 16C8.55228 16 9 16.4477 9 17V17.01C9 17.5623 8.55228 18.01 8 18.01C7.44772 18.01 7 17.5623 7 17.01V17C7 16.4477 7.44772 16 8 16ZM12 16C12.5523 16 13 16.4477 13 17V17.01C13 17.5623 12.5523 18.01 12 18.01C11.4477 18.01 11 17.5623 11 17.01V17C11 16.4477 11.4477 16 12 16ZM16 16C16.5523 16 17 16.4477 17 17V17.01C17 17.5623 16.5523 18.01 16 18.01C15.4477 18.01 15 17.5623 15 17.01V17C15 16.4477 15.4477 16 16 16Z" fill="#223C61"/>
</svg>
