<svg width="24" height="24" viewBox="0 0 24 24" fill="none" xmlns="http://www.w3.org/2000/svg">
<path fill-rule="evenodd" clip-rule="evenodd" d="M3 2C2.44772 2 2 2.44772 2 3V5C2 8.86599 5.13401 12 9 12H11V14H7C6.44772 14 6 14.4477 6 15V19C6 20.6569 7.34315 22 9 22H15C16.6569 22 18 20.6569 18 19V15C18 14.4477 17.5523 14 17 14H13V13H15C18.866 13 22 9.86599 22 6V5C22 4.44772 21.5523 4 21 4H18C15.8097 4 13.8544 5.00596 12.5708 6.58108C11.5861 3.9071 9.01576 2 6 2H3ZM18 6C15.2386 6 13 8.23858 13 11H15C17.7614 11 20 8.76142 20 6H18ZM15 20C15.5523 20 16 19.5523 16 19V16H8V19C8 19.5523 8.44772 20 9 20H15ZM6 4C8.76142 4 11 6.23858 11 9V10H9C6.23858 10 4 7.76142 4 5V4H6Z" fill="#223C61"/>
</svg>
