<svg width="24" height="24" viewBox="0 0 24 24" fill="none" xmlns="http://www.w3.org/2000/svg">
<path fill-rule="evenodd" clip-rule="evenodd" d="M2 8C2 6.34315 3.34315 5 5 5H13C14.6569 5 16 6.34315 16 8V8.38212L19.1059 6.82953C19.7257 6.51982 20.4618 6.5529 21.0512 6.91708C21.6407 7.28126 21.9996 7.92459 22 8.61747V15.382C21.9996 16.0749 21.6407 16.7187 21.0512 17.0829C20.4618 17.4471 19.7258 17.4802 19.106 17.1705L16 15.6179V16C16 17.6569 14.6569 19 13 19H5C3.34315 19 2 17.6569 2 16V8ZM16 13.3819L20 15.3815V8.61853L16 10.6181V13.3819ZM14 8C14 7.44772 13.5523 7 13 7H5C4.44772 7 4 7.44772 4 8V16C4 16.5523 4.44772 17 5 17H13C13.5523 17 14 16.5523 14 16V8Z" fill="#223C61"/>
</svg>
