<svg width="48" height="48" viewBox="0 0 48 48" fill="none" xmlns="http://www.w3.org/2000/svg">
<path d="M38.62 38.44C37.61 36.84 37.4 36.08 37.36 35.77C37.32 35.41 37.28 35.24 37.25 35.08C37.22 34.95 37.2 34.83 37.18 34.56L37.13 33.85C37.01 32.2 36.87 30.33 36.4 29.3C35.95 28.32 34.71 27.62 33.62 27.01C33.47 26.93 33.33 26.85 33.2 26.77L34.8 23.36C35.1 22.83 35.05 22.18 34.67 21.7C34.16 21.05 33.19 20.82 32.35 21.16L31.4 21.55C31.27 21.6 28.04 22.05 28.04 22.05C27.64 22.21 27.31 22.49 27.14 22.86C26.93 23.31 26.95 23.82 27.19 24.25L28.08 26.58C27.9 26.69 27.69 26.81 27.45 26.95C26.32 27.58 25.04 28.3 24.58 29.31C24.11 30.34 23.98 32.2 23.86 33.84L23.8 34.57C23.78 34.85 23.76 34.96 23.73 35.1C23.7 35.26 23.66 35.43 23.62 35.79C23.6 35.98 23.5 36.36 23.18 37.01H16.93C16.95 36.85 16.98 36.68 16.98 36.51C16.98 34.58 15.41 33.01 13.48 33.01C13.31 33.01 13.14 33.04 12.98 33.06V14H28.46L28.2 18.95C28.17 19.52 28.63 20 29.2 20C29.73 20 30.17 19.58 30.2 19.05L30.47 14H32.98C33.53 14 33.98 13.55 33.98 13V9C33.98 8.45 33.53 8 32.98 8H29.65C29.65 6.9 28.75 6 27.65 6H12.85C11.76 6 11 6.89 11 7.98H9.99C9.44 8 9 8.44 9 8.99V13C9 13.55 9.45 14 10 14H10.99V34.06C10.24 34.84 9.83 35.97 10.07 37.2C10.33 38.56 11.45 39.68 12.81 39.94C14.03 40.18 15.17 39.77 15.95 39.01H22.13C21.96 39.52 21.96 40.07 22.16 40.54C22.51 41.37 23.29 41.89 24.18 41.89H36.82C37.72 41.89 38.49 41.37 38.84 40.54C39.11 39.89 39.03 39.11 38.61 38.45L38.62 38.44ZM11 12V10H12C12.55 10 13 9.55 13 9V8H27.66V9.01C27.68 9.56 28.12 10 28.67 10H32V12H11ZM13.5 38C12.67 38 12 37.33 12 36.5C12 35.67 12.67 35 13.5 35C14.33 35 15 35.67 15 36.5C15 37.33 14.33 38 13.5 38ZM29.66 24C30.53 24 31.39 23.84 32.15 23.53L32.54 23.37L31.25 25.99H29.91L29.3 24.01H29.66V24ZM36.96 39.8C36.94 39.86 36.89 39.93 36.81 39.93H24.17C24.09 39.93 24.05 39.86 24.02 39.8C23.99 39.72 24.02 39.58 24.1 39.45C25.04 37.97 25.54 36.83 25.64 35.99C25.67 35.71 25.7 35.57 25.72 35.45C25.76 35.26 25.79 35.1 25.82 34.71L25.88 33.97C25.97 32.71 26.11 30.8 26.44 30.08C26.63 29.65 27.83 28.98 28.47 28.62C28.88 28.39 29.24 28.19 29.51 27.99H31.38C31.38 27.99 31.48 28 31.52 28.03C31.8 28.24 32.17 28.44 32.59 28.68C33.21 29.03 34.36 29.67 34.54 30.07C34.87 30.79 35.01 32.71 35.1 33.97L35.15 34.7C35.18 35.09 35.21 35.25 35.25 35.44C35.27 35.56 35.3 35.7 35.33 35.98C35.43 36.83 35.93 37.96 36.87 39.44C36.96 39.59 36.97 39.72 36.95 39.79L36.96 39.8Z" fill="#223C61"/>
</svg>
