{
  "todo": {
    "form-field-error-message": {
      "icon": {
        "size": {
          "type": "sizing",
          "value": "{utrecht.icon.functional.size}"
        },
        "margin-inline-end": {
          "value": "{voorbeeld.space.text.mouse}",
          "type": "spacing"
        }
      },
      "color": {
        "type": "color",
        "value": "{utrecht.feedback.negative.color}"
      },
      "font-family": {
        "value": "{utrecht.document.font-family}",
        "type": "fontFamilies"
      },
      "font-size": {
        "value": "{utrecht.document.font-size}",
        "type": "fontSizes"
      },
      "font-weight": {
        "value": "{utrecht.document.font-weight}",
        "type": "fontWeights"
      },
      "line-height": {
        "value": "{utrecht.document.line-height}",
        "type": "lineHeights"
      }
    }
  }
}
