<svg width="48" height="48" viewBox="0 0 48 48" fill="none" xmlns="http://www.w3.org/2000/svg">
<path d="M41 21.9998C41.55 21.9998 42 21.5498 42 20.9998V14.9898C42 14.2898 41.62 13.6698 41.07 13.3198L39.94 7.51977C39.72 6.62977 38.92 6.00977 38 6.00977H27C26.08 6.00977 25.28 6.62977 25.06 7.51977L23.92 13.2998C23.37 13.6398 23 14.2498 23 14.9498V20.9998C23 21.5498 23.45 21.9998 24 21.9998C24.55 21.9998 25 21.5498 25 20.9998V18.9998H40V20.9998C40 21.5498 40.45 21.9998 41 21.9998ZM27 7.99977H38L39 12.9998H26L27 7.99977ZM36 14.9998V16.9998H29V14.9998H36ZM25 14.9998H27V16.9998H25V14.9998ZM38 16.9998V14.9998H40V16.9998H38ZM16 17.9998C16.83 17.9998 17.5 18.6698 17.5 19.4998C17.5 20.3298 16.83 20.9998 16 20.9998C15.17 20.9998 14.5 20.3298 14.5 19.4998C14.5 18.6698 15.17 17.9998 16 17.9998ZM16 15.9998C14.07 15.9998 12.5 17.5698 12.5 19.4998C12.5 21.4298 14.07 22.9998 16 22.9998C17.93 22.9998 19.5 21.4298 19.5 19.4998C19.5 17.5698 17.93 15.9998 16 15.9998ZM16.5 37.5198C16.67 37.1898 17.01 36.9998 17.38 36.9998C18.13 36.9998 18.62 37.7998 18.27 38.4698C17.03 40.8798 14.34 42.4098 11.36 41.8998C8.64 41.4398 6.47 39.1998 6.07 36.4698C5.64 33.5598 7.17 30.9398 9.53 29.7198C10.2 29.3798 11 29.8598 11 30.6098C11 30.9898 10.8 31.3298 10.48 31.4898C8.66 32.4098 7.54 34.5098 8.19 36.7998C8.62 38.3198 9.8 39.4498 11.33 39.8398C13.56 40.4098 15.6 39.2998 16.5 37.5098V37.5198ZM24 35.9898V40.9898C24 41.5398 23.55 41.9898 23 41.9898C22.45 41.9898 22 41.5398 22 40.9898V35.9898C22 35.4398 21.55 34.9898 21 34.9898H15.94C14.32 34.9898 13 33.6698 13 32.0498V26.9898C13 25.3398 14.35 23.9898 16 23.9898C17.65 23.9898 18.98 25.3198 19 26.9498C19 26.9598 19 26.9698 19 26.9898V30.9898C19 31.5398 18.55 31.9898 18 31.9898C17.45 31.9898 17 31.5398 17 30.9898V27.0098C17 27.0098 17 26.9998 17 26.9898C17 26.4398 16.55 25.9898 16 25.9898C15.45 25.9898 15 26.4398 15 26.9898V32.0498C15 32.5698 15.42 32.9898 15.94 32.9898H21C22.65 32.9898 24 34.3298 24 35.9898Z" fill="#223C61"/>
</svg>
