<svg width="24" height="24" viewBox="0 0 24 24" fill="none" xmlns="http://www.w3.org/2000/svg">
<path fill-rule="evenodd" clip-rule="evenodd" d="M6 2C6.55228 2 7 2.44772 7 3V5C7 5.55228 6.55228 6 6 6C5.44772 6 5 5.55228 5 5C4.44772 5 4 5.44772 4 6V9.5C4 11.9853 6.01472 14 8.5 14C10.9853 14 13 11.9853 13 9.5V6C13 5.44772 12.5523 5 12 5C12 5.55228 11.5523 6 11 6C10.4477 6 10 5.55228 10 5V3C10 2.44772 10.4477 2 11 2C11.5523 2 12 2.44772 12 3C13.6569 3 15 4.34315 15 6V9.5C15 12.8891 12.4062 15.6724 9.09549 15.9731C9.37275 17.3709 10.2391 18.6021 11.5 19.3301C13.047 20.2233 14.953 20.2233 16.5 19.3301C18.047 18.437 19 16.7863 19 15V12.8293C17.8348 12.4175 17 11.3062 17 10C17 8.34315 18.3431 7 20 7C21.6569 7 23 8.34315 23 10C23 11.3062 22.1652 12.4175 21 12.8293V15C21 17.5009 19.6658 19.8117 17.5 21.0622C15.3342 22.3126 12.6658 22.3126 10.5 21.0622C8.57847 19.9528 7.31155 18.0087 7.0502 15.8377C4.15824 15.1789 2 12.5915 2 9.5V6C2 4.34315 3.34315 3 5 3C5 2.44772 5.44772 2 6 2ZM20 9C19.4477 9 19 9.44772 19 10C19 10.5523 19.4477 11 20 11C20.5523 11 21 10.5523 21 10C21 9.44772 20.5523 9 20 9Z" fill="#223C61"/>
</svg>
