<svg width="24" height="24" viewBox="0 0 24 24" fill="none" xmlns="http://www.w3.org/2000/svg">
<path fill-rule="evenodd" clip-rule="evenodd" d="M9 5C8.44772 5 8 5.44772 8 6V18.2338L11.4855 16.1425C11.8022 15.9525 12.1978 15.9525 12.5145 16.1425L16 18.2338V6C16 5.44772 15.5523 5 15 5H9ZM6 6C6 4.34315 7.34315 3 9 3H15C16.6569 3 18 4.34315 18 6V20C18 20.3603 17.8062 20.6927 17.4927 20.8702C17.1792 21.0477 16.7944 21.0429 16.4855 20.8575L12 18.1662L7.5145 20.8575C7.20556 21.0429 6.82081 21.0477 6.5073 20.8702C6.19379 20.6927 6 20.3603 6 20V6Z" fill="#223C61"/>
</svg>
