<svg width="24" height="24" viewBox="0 0 24 24" fill="none" xmlns="http://www.w3.org/2000/svg">
<path fill-rule="evenodd" clip-rule="evenodd" d="M14.9285 2.62882C15.1336 3.1416 14.8842 3.72358 14.3714 3.92872L9.19341 6.00027H19C20.1046 6.00027 21 6.8957 21 8.00027V19.0003C21 20.1048 20.1046 21.0003 19 21.0003H5C3.89543 21.0003 3 20.1048 3 19.0003V7.67727C3.00052 6.85977 3.49851 6.12427 4.25756 5.82081C4.25741 5.82087 4.25771 5.82075 4.25756 5.82081L13.6286 2.07181C14.1413 1.86667 14.7233 2.11605 14.9285 2.62882ZM5 8.00027V11.0003H6V10.0003C6 9.44798 6.44772 9.00027 7 9.00027C7.55228 9.00027 8 9.44798 8 10.0003V11.0003H19V8.00027H5ZM19 13.0003H5V19.0003H19V13.0003ZM13 15.0003C13.5523 15.0003 14 15.448 14 16.0003V16.0103C14 16.5626 13.5523 17.0103 13 17.0103C12.4477 17.0103 12 16.5626 12 16.0103V16.0003C12 15.448 12.4477 15.0003 13 15.0003ZM17 15.0003C17.5523 15.0003 18 15.448 18 16.0003V16.0103C18 16.5626 17.5523 17.0103 17 17.0103C16.4477 17.0103 16 16.5626 16 16.0103V16.0003C16 15.448 16.4477 15.0003 17 15.0003Z" fill="#223C61"/>
</svg>
