{
  "pra": {
    "color": {
      "primary": {
        "600": {
          "value": "#ffffff"
        }
      }
    }
  },
  "voorbeeld": {
    "color": {
      "gray": {
        "900": {
          "value": "#ffffff"
        }
      }
    }
  },
  "utrecht": {
    "icon": {
      "color": {
        "value": "#ffffff"
      }
    }
  }
}
