{
    "onfas": "1.0",
    "language": "dutch"
    "need" : {
    },
    "name" : "Ieps Munskensfuns",
    "location" : "Friesland, Nederland",
    "date" : {
      "from" : "2022-04-01"
    },
    "life-event" : {
    },
    "domain" : "Subsidies uitkeringen en toeslagen",
    "organsiation" : "Provincie Friesland",
    "description" : "",
    "precondition" : [
    ]
}
