{
  "source" : {
          "citation": "Participatiewet - IIT PRA stub",
          "juriconnect": "jci1.3:c:BWBR0015703",
          "explanation" : ""
  },
  "acts" : [
    {
      "act" : "[Algemene wet bestuursrecht].<<verzoek indienen>>",
      "actor" : "[Algemene wet bestuursrecht].[belanghebbende]",
      "recipient" : "[college]",
      "precondition" : "[21 jaar of ouder] doch [jonger dan de pensioengerechtigde leeftijd], die langdurig een laag inkomen en geen in aanmerking te nemen vermogen als bedoeld in artikel 34 heeft en geen uitzicht heeft op inkomensverbetering, en niet in afgelopen 12 maanden al IIT verkregen",
      "create" : "<aanvraag behandelen>",
      "terminate" : "",
      "sources" : [
        {
          "citation" : "/Hoofdstuk4/Paragraaf4.1/Artikel36/Lid1",
          "juriconnect" : "jci1.3:c:BWBR0015703&hoofdstuk=4&paragraaf=4.1&artikel=36&lid=1&z=2022-04-01&g=2022-04-01",
          "text" : "Op een daartoe strekkend verzoek van een persoon van 21 jaar of ouder doch jonger dan de pensioengerechtigde leeftijd, die langdurig een laag inkomen en geen in aanmerking te nemen vermogen als bedoeld in artikel 34 heeft en geen uitzicht heeft op inkomensverbetering, kan het college, gelet op de omstandigheden van die persoon, een individuele inkomenstoeslag verlenen."
        },
        {
	    		"citation" : "/Hoofdstuk1/Titeldeel1.1/Artikel1:3/Lid3",
	    		"juriconnect" : "jci1.3:c:BWBR0005537&hoofdstuk=1&titeldeel=1.1&artikel=1:3&lid=3&z=2022-05-01&g=2022-05-01",
	    		"text" : "Onder aanvraag wordt verstaan: een verzoek van een belanghebbende, een besluit te nemen. "
	    	},
        {
	    		"citation" : "/Hoofdstuk1/Titeldeel1.1/Artikel1:2/Lid1",
	    		"juriconnect" : "jci1.3:c:BWBR0005537&hoofdstuk=1&titeldeel=1.1&artikel=1:2&lid=1&z=2022-05-01&g=2022-05-01",
	    		"text" : "Onder belanghebbende wordt verstaan: degene wiens belang rechtstreeks bij een besluit is betrokken. "
	    	},
        {
	    		"citation" : "/Hoofdstuk4/Paragraaf4.1/Artikel36/Lid3",
	    		"juriconnect" : "jci1.3:c:BWBR0015703&hoofdstuk=4&paragraaf=4.1&artikel=36&lid=3&z=2022-04-01&g=2022-04-01",
	    		"text" : "Indien aan de persoon, bedoeld in het eerste lid, in de periode van 12 maanden onmiddellijk voorafgaande aan zijn verzoek, een individuele inkomenstoeslag is verleend, wordt het verzoek afgewezen."
	    	},
      ],
      "explanation" : "Deze implementatie stopt na het indienen van verzoek."
    },
    {
      "act" : "[Algemene wet bestuursrecht].<<beroep instellen tegen besluit>>",
      "actor" : "[Algemene wet bestuursrecht].[belanghebbende]",
      "object" : "[beroepbaarbesluit]",
      "recipient" : "[Algemene wet bestuursrecht].[bestuursrechter]",
      "sources" : [
        {
                    "citation": "artikel 79",
                    "juriconnect": "",
                    "text": "Voor de toepassing van artikel 8:1 van de Algemene wet bestuursrecht wordt met een besluit gelijkgesteld het nalaten van een handeling die strekt tot uitvoering van het besluit inzake de verlening of terugvordering van [bijstand] of het verrichten van een handeling die afwijkt van dat besluit."
                  }
                ],
      "explanation" : ""
    }
  ],
  "facts" :
    {
      "fact" : "[Algemene wet bestuursrecht]",
      "function": "",
      "sources" : [
        "juriconnect" : "jci1.3:c:BWBR0005537",
      ],
      "explanation": "De Algemene wet bestuursrecht"
    },
    {
      "fact" : "[college]",
      "function": "[A1L-b],[college van woonplaats],[toegewezen college]",
      "sources" : [
                  {
          	    		"citation" : "/Hoofdstuk1/Paragraaf1.1/Artikel1/Onderdeelb",
          	    		"juriconnect" : "jci1.3:c:BWBR0015703&hoofdstuk=1&paragraaf=1.1&artikel=1&o=b&z=2022-04-01&g=2022-04-01",
          	    		"text" : "college: het college van burgemeester en wethouders, bedoeld in artikel 40, eerste lid;"
        	    	  },
      ],
     "explanation": "Gegeven die aangeeft welk college van toepassing is bij de aanvraag voor individuele inkomenstoeslag"
    },
    {
      "fact" : "[college van woonplaats]",
                "function": "",
                "sources" : [
                  {
                    "citation": "artikel 40, lid 1 (gedeeltelijk)",
                    "juriconnect": "",
                    "text": "Het recht op bijstand bestaat jegens het college van de gemeente waar de belanghebbende woonplaats heeft als bedoeld in de artikelen 10, eerste lid, en 11 van Boek 1 van het Burgerlijk Wetboek."
                  }
                ],
                "explanation": ""
    },
    {
      "fact" : "[toegewezen college]",
                "function": "",
                "sources" : [
                  {
                    "citation": "artikel 40, lid 1 (gedeeltelijk)",
                    "juriconnect": "",
                    "text": "Bij algemene maatregel van bestuur kan worden bepaald dat bijstand aan een belanghebbende die niet is ingeschreven als ingezetene met een woonadres of briefadres in de basisregistratie personen wordt verleend door het college van een bij die maatregel aan te wijzen gemeente."
                  }
                ],
                "explanation": ""
    },
    {
      "fact" : "[21 jaar of ouder]",
      "function": "",
      "sources" : [
        {
          "citation" : "/Hoofdstuk4/Paragraaf4.1/Artikel36/Lid1",
          "juriconnect" : "jci1.3:c:BWBR0015703&hoofdstuk=4&paragraaf=4.1&artikel=36&lid=1&z=2022-04-01&g=2022-04-01",
          "text" : "Op een daartoe strekkend verzoek van een persoon van 21 jaar of ouder doch jonger dan de pensioengerechtigde leeftijd, die langdurig een laag inkomen en geen in aanmerking te nemen vermogen als bedoeld in artikel 34 heeft en geen uitzicht heeft op inkomensverbetering, kan het college, gelet op de omstandigheden van die persoon, een individuele inkomenstoeslag verlenen."
        },
      ],
      "explanation": "Gegeven of de [Algemene wet bestuursrecht].[belanghebbende] als persoon die verzoek voor individuele inkomenstoeslag indient 21 jaar of ouder is."
    },
    {
      "fact" : "[jonger dan de pensioengerechtigde leeftijd]",
      "function": "",
      "sources" : [
        {
          "citation" : "/Hoofdstuk4/Paragraaf4.1/Artikel36/Lid1",
          "juriconnect" : "jci1.3:c:BWBR0015703&hoofdstuk=4&paragraaf=4.1&artikel=36&lid=1&z=2022-04-01&g=2022-04-01",
          "text" : "Op een daartoe strekkend verzoek van een persoon van 21 jaar of ouder doch jonger dan de pensioengerechtigde leeftijd, die langdurig een laag inkomen en geen in aanmerking te nemen vermogen als bedoeld in artikel 34 heeft en geen uitzicht heeft op inkomensverbetering, kan het college, gelet op de omstandigheden van die persoon, een individuele inkomenstoeslag verlenen."
        },
        {
	    		"citation" : "/Hoofdstuk1/Paragraaf1.1/Artikel1/Onderdeelm",
	    		"juriconnect" : "jci1.3:c:BWBR0015703&hoofdstuk=1&paragraaf=1.1&artikel=1&o=m&z=2022-04-01&g=2022-04-01",
	    		"text" : " pensioengerechtigde leeftijd: pensioengerechtigde leeftijd, bedoeld in artikel 7a, eerste lid, van de Algemene Ouderdomswet;"
	    	},
      ],
      "explanation": "Gegeven of de [Algemene wet bestuursrecht].[belanghebbende] als persoon die verzoek voor individuele inkomenstoeslag indient jonger dan de [pensioengerechtigde leeftijd] is"
    },
    {
      "fact" : "[niet in afgelopen 12 maanden al IIT verkregen]",
      "function": "",
      "sources" : [
        {
	    		"citation" : "/Hoofdstuk4/Paragraaf4.1/Artikel36/Lid3",
	    		"juriconnect" : "jci1.3:c:BWBR0015703&hoofdstuk=4&paragraaf=4.1&artikel=36&lid=3&z=2022-04-01&g=2022-04-01",
	    		"text" : "Indien aan de persoon, bedoeld in het eerste lid, in de periode van 12 maanden onmiddellijk voorafgaande aan zijn verzoek, een individuele inkomenstoeslag is verleend, wordt het verzoek afgewezen."
	    	}
      ],
      "explanation": "Gegeven of de [Algemene wet bestuursrecht].[belanghebbende] als persoon die verzoek voor individuele inkomenstoeslag indient niet in afgelopen maanden al individuele inkomenstoeslag verkreeg"
    },
    {
      "fact" : "[inkomen]",
      "function": "[A32L1]",
      "sources" : [
                  {
          	    		"citation" : "/Hoofdstuk3/Paragraaf3.4/Artikel32/Lid1",
          	    		"juriconnect" : "jci1.3:c:BWBR0015703&hoofdstuk=3&paragraaf=3.4&artikel=32&lid=1&z=2022-04-01&g=2022-04-01",
          	    		"text" : "Onder inkomen wordt verstaan de op grond van artikel 31 in aanmerking genomen middelen voorzover deze:"
          	    	},
      ],
      "explanation": "Gegeven die het inkomen van een persoon representeert in de context van de aanvraag van individuele inkomenstoeslag"
    },
    {
			"fact" : "[individuele inkomenstoeslag]",
      "function": "",
      "sources" : [
                  {
          	    		"citation" : "/Hoofdstuk4/Paragraaf4.1/Artikel36/Lid1",
          	    		"juriconnect" : "jci1.3:c:BWBR0015703&hoofdstuk=4&paragraaf=4.1&artikel=36&lid=1&z=2022-04-01&g=2022-04-01",
          	    		"text" : "Op een daartoe strekkend verzoek van een persoon van 21 jaar of ouder doch jonger dan de pensioengerechtigde leeftijd, die langdurig een laag inkomen en geen in aanmerking te nemen vermogen als bedoeld in artikel 34 heeft en geen uitzicht heeft op inkomensverbetering, kan het college, gelet op de omstandigheden van die persoon, een individuele inkomenstoeslag verlenen."
          	    	},
      ],
      "explanation": "Gegeven die de aangevraagde en mogelijk toegekende individuele inkomenstoeslag representeert"
		},
    {
      "fact" : "[langdurig laag inkomen]",
      "function" : "",
      "sources" : [
        {
	    		"citation" : "/Hoofdstuk1/Paragraaf1.2/Artikel8/Lid2",
	    		"juriconnect" : "jci1.3:c:BWBR0015703&hoofdstuk=1&paragraaf=1.2&artikel=8&lid=2&z=2022-04-01&g=2022-04-01",
	    		"text" : "De regels, bedoeld in het eerste lid, hebben voor zover het gaat om het eerste lid, onderdeel b, in ieder geval betrekking op de hoogte van de individuele inkomenstoeslag en de wijze waarop invulling wordt gegeven aan de begrippen langdurig en laag inkomen."
	    	},
        {
          "citation" : "/Hoofdstuk4/Paragraaf4.1/Artikel36/Lid1",
          "juriconnect" : "jci1.3:c:BWBR0015703&hoofdstuk=4&paragraaf=4.1&artikel=36&lid=1&z=2022-04-01&g=2022-04-01",
          "text" : "Op een daartoe strekkend verzoek van een persoon van 21 jaar of ouder doch jonger dan de pensioengerechtigde leeftijd, die langdurig een laag inkomen en geen in aanmerking te nemen vermogen als bedoeld in artikel 34 heeft en geen uitzicht heeft op inkomensverbetering, kan het college, gelet op de omstandigheden van die persoon, een individuele inkomenstoeslag verlenen."
        }
      ],
      "explanation" : "Gegeven of er sprake is van langdurig laag inkomen. Hier worden door het college via een verordening invulling aan gegeven."
    },
    {
			"fact" : "[zicht op inkomensverbetering]",
      "function": "",
      "sources" : [
                  {
          	    		"citation" : "/Hoofdstuk4/Paragraaf4.1/Artikel36/Lid1",
          	    		"juriconnect" : "jci1.3:c:BWBR0015703&hoofdstuk=4&paragraaf=4.1&artikel=36&lid=1&z=2022-04-01&g=2022-04-01",
          	    		"text" : "Op een daartoe strekkend verzoek van een persoon van 21 jaar of ouder doch jonger dan de pensioengerechtigde leeftijd, die langdurig een laag inkomen en geen in aanmerking te nemen vermogen als bedoeld in artikel 34 heeft en geen uitzicht heeft op inkomensverbetering, kan het college, gelet op de omstandigheden van die persoon, een individuele inkomenstoeslag verlenen."
          	    	}
      ],
      "explanation": "Gegeven of er sprake is van zicht op inkomensverbetering. Hier worden door het college via een verordening invulling aan gegeven."
		},
    {
			"fact" : "[recht op bijstand]",
      "function": "",
      "sources" : [
                  {
          	    		"citation" : "/Hoofdstuk2/Paragraaf2.2/Artikel11",
          	    		"juriconnect" : "1.0:c:BWBR0015703&artikel=11&g=2022-04-01",
          	    		"text" : ""
          	    	},
                  {
          	    		"citation" : "/Hoofdstuk2/Paragraaf2.2/Artikel13/Lid1",
          	    		"juriconnect" : "jci1.3:c:BWBR0015703&hoofdstuk=2&paragraaf=2.2&artikel=13&lid=1&z=2022-04-01&g=2022-04-01",
          	    		"text" : "Geen recht op bijstand heeft degene:"
          	    	}
      ],
      "explanation": "Gegeven die aangeeft of een persoon recht heeft op bijstand volgens artikel 11 en 13, eerste lid van de Participatiewet"
		},
    {
      "fact" : "[besluit]",
            		"function": "[awb].[besluit] = IF [RechtOpBijstand] THEN [toekenning] ELSE [afwijzing]",
            		"sources" : [
                  {
                              "citation": "artikel 43, lid 1",
                              "juriconnect": "",
                              "text": "Indien door het college is vastgesteld dat [recht op bijstand] bestaat, wordt de bijstand toegekend vanaf de dag waarop dit recht is ontstaan, voorzover deze dag niet ligt voor de dag waarop de belanghebbende zich heeft gemeld om bijstand aan te vragen."
                            }
            		],
            		"explanation": ""
    },
    {
			"fact" : "[rechthebbende]",
            		"function": "[awb].[belanghebbende] = [rechthebbende]",
            		"sources" : [
                  {
          	    		"citation" : "/Hoofdstuk2/Paragraaf2.2/Artikel11",
          	    		"juriconnect" : "1.0:c:BWBR0015703&artikel=11&g=2022-04-01",
          	    		"text" : ""
          	    	},
            		],
            		"explanation": ""
		},
    {
			"fact" : "[bijstand]",
            		"function": "[bijzondere bijstand]",
            		"sources" : [
            			{
            				"citation": "artikel 5, onderdeel a",
            				"juriconnect": "",
            				"text": "bijstand: algemene en bijzondere bijstand;"
            			}
            		],
            		"explanation": "NB dit model omvat enkel de individuele inkomenstoeslag als bijzondere bijstand"
		},
		{
			"fact" : "[bijstandsnorm]",
            		"function": "",
            		"sources" : [
            			{
            				"citation": "artikel 5, onderdeel c",
            				"juriconnect": "",
            				"text": "bijstandsnorm: de op grond van paragraaf 3.2, op de belanghebbende van toepassing zijnde norm, verminderd met de op grond van paragraaf 3.3, door het college vastgestelde verlaging;"
            			}
            		],
            		"explanation": ""
		},
		{
			"fact" : "[bijzondere bijstand]",
            		"function": "[individuele inkomenstoeslag]",
            		"sources" : [
            			{
            				"citation": "artikel 5, onderdeel d",
            				"juriconnect": "",
            				"text": "bijzondere bijstand: de bijstand, bedoeld in artikel 35 en de [individuele inkomenstoeslag], bedoeld in artikel 36;"
            			}
            		],
            		"explanation": ""
		},
    {
      "fact" : "[bijstandsnorm-3.2]",
      "function": "",
      "sources" : [
        {
          "citation" : "/Hoofdstuk3/Paragraaf3.2/Artikel21",
          "juriconnect" : "1.0:c:BWBR0015703&artikel=21&g=2022-04-01",
          "text" : "Voor belanghebbenden van 21 jaar of ouder doch jonger dan de pensioengerechtigde leeftijd is de norm per kalendermaand, indien het betreft:"
        },
      ],
      "explanation": "De bijstandsnorm gedefinieerd in artikel 21 van de Participatiewet"
    }
  ],
  "duties" : [
  ]
}
