{
	"source" : {
            	"validFrom": "[validFrom]",
            	"validTo": "",
            	"citation": "[citeertitel]",
            	"juriconnect": "https://lokaleregelgeving.overheid.nl/CVDR616379",
        },
	"acts" : [
		{
			"act" : "[wet].<<verzoek indienen>>",
			"object" : "[formulier]",
			"recipient" : "[college]",
			"sources" : [
				{
            				"citation": "artikel 2",
            				"juriconnect": "",
            				"text": "Een verzoek als bedoeld in artikel 36, eerste lid, van de wet, wordt ingediend middels een door het college vastgesteld formulier"
            			}
            		],
			"explanation" : "Een verzoek als bedoeld in artikel 36, lid 1 van de Participatiewet kan middels een door het college van de gemeente Utrecht, zijnde het bestuursorgaan volgens Awb in deze regeling, vastgesteld formulier ingediend worden. In deze verordening wordt niet meer dan dit mbt deze handeling (verwijzend naar deze handeling gedefinieerd in de participatiewet) gedefinieerd."
		}
	],
	"facts" : [
		{
			"fact" : "[wet]",
            		"function": "jci1.3:c:BWBR0015703",
            		"sources" : [
            			{
            				"citation": "artikel 1, onderdeel a",
            				"juriconnect": "",
            				"text": "wet: Participatiewet"
            			}
            		],
            		"explanation": ""
		},
		{
			"fact" : "[Gemeente Utrecht]",
            		"function": "did:discipl:oin:00000001002220647000",
            		"explanation": "Gemeente Utrecht geidenticeerd via OIN nummer"
		},
		{
			"fact" : "[college]",
            		"function": "[wet].[college] = [Gemeente Utrecht]",
            		"sources" : [
            			{
            				"citation": "artikel 1, onderdeel b",
            				"juriconnect": "",
            				"text": "college: het college van burgemeester en wethouders van de gemeente Utrecht;"
            			}
            		],
            		"explanation": ""
		},
		{
			"fact" : "[inkomen]",
            		"function": "[wet].[inkomen]",
            		"sources" : [
            			{
            				"citation": "artikel 1, onderdeel c",
            				"juriconnect": "",
            				"text": "inkomen: totaal van het inkomen, bedoeld in artikel 32 van de [wet], al dan niet aangevuld met algemene bijstand"
            			}
            		],
            		"explanation": ""
		},
		{
			"fact" : "[gezin]",
            		"function": "",
            		"sources" : [
            			{
            				"citation": "artikel 1, onderdeel d",
            				"juriconnect": "",
            				"text": "gezin: de gehuwden/samenwonenden tezamen en de alleenstaande met zijn of haar ten laste komende [kind] of kinderen"
            			}
            		],
            		"explanation": ""
		},
		{
			"fact" : "[individuele inkomenstoeslag]",
            		"function": "[wet].[individuele inkomenstoeslag]",
            		"sources" : [
            			{
            				"citation": "artikel 1, onderdeel e",
            				"juriconnect": "",
            				"text": "individuele inkomenstoeslag: toeslag zoals bedoeld in artikel 36 van de [wet]"
            			}
            		],
            		"explanation": ""
		},
		{
			"fact" : "[peildatum]",
            		"function": "",
            		"sources" : [
            			{
            				"citation": "artikel 1, onderdeel f",
            				"juriconnect": "",
            				"text": "peildatum: datum waarop een persoon [individuele inkomenstoeslag] aanvraagt"
            			}
            		],
            		"explanation": ""
		},
		{
			"fact" : "[referteperiode]",
            		"function": "",
            		"sources" : [
            			{
            				"citation": "artikel 1, onderdeel g",
            				"juriconnect": "",
            				"text": "referteperiode: periode van drie jaar voorafgaand aan de [peildatum];"
            			}
            		],
            		"explanation": ""
		},
		{
			"fact" : "[kind]",
            		"function": "",
            		"sources" : [
            			{
            				"citation": "artikel 1, onderdeel h",
            				"juriconnect": "",
            				"text": "kind: het ten laste van de aanvrager komend kind, jonger dan 18 jaar"
            			}
            		],
            		"explanation": ""
		},
		{
			"fact" : "[formulier]",
            		"function": "",
            		"sources" : [
            			{
            				"citation": "artikel 2",
            				"juriconnect": "",
            				"text": "een door het [college] vastgesteld formulier"
            			}
            		],
            		"explanation": "een door het [college] vastgesteld formulier voor het indienen van een verzoek tot besluit nemen om individuele inkomenstoeslag toe te kennen"
		},
		{
			"fact" : "[landurig laag inkomen]",
            		"function": "[wet].[langdurig laag inkomen] = [langdurig laag inkomen aleenstaande of gezin]",
            		"sources" : [
            			{
            				"citation": "artikel 3",
            				"juriconnect": "",
            				"text": ""
            			}
            		],
            		"explanation": ""
		},
		{
			"fact" : "[landurig laag inkomen aleenstaande of gezin]",
            		"function": "[langdurig laag inkomen alleenstaande] OR [langdurig laag inkomen gezin]",
            		"sources" : [
            			{
            				"citation": "artikel 3, lid 1 en 2",
            				"juriconnect": "",
            				"text": ""
            			}
            		],
            		"explanation": ""
		},
		{
			"fact" : "[langdurig laag inkomen alleenstaande]",
            		"function": "[wet].[bijstandsnorm-3.2]",
            		"sources" : [
            			{
            				"citation": "artikel 3, lid 1",
            				"juriconnect": "",
            				"text": "Een persoon heeft een langdurig laag inkomen als bedoeld in artikel 36, eerste lid, van de [wet] als hij aangewezen is op een inkomen dat gedurende referteperiode niet meer bedraagt dan 110% van de van toepassing zijnde bijstandsnorm, bedoeld in artikel 21 van de [wet], aangevuld, indien van toepassing, met de tegemoetkoming op grond van de Wet op de kindregelingen. Artikel 22a van de [wet] blijft hierbij buiten toepassing."
            			}
            		],
            		"explanation": "NB Wet op de kindregelingen is niet een bestaande wet, maar hier zal de set aan kinderbijslag, kindertoeslag etc bedoeld worden?"
		},
		{
			"fact" : "[langdurig laag inkomen gezin]",
            		"function": "[wet].[bijstandsnorm-3.2]",
            		"sources" : [
            			{
            				"citation": "artikel 3, lid 2",
            				"juriconnect": "",
            				"text": "In afwijking van het eerste lid is bestaat een langdurig laag inkomen ook indien een [gezin] met kinderen van 12 jaar en ouder aangewezen is op een inkomen dat gedurende [referteperiode] niet meer bedraagt dan 125% van de van toepassing zijnde bijstandsnorm, bedoeld in artikel 21 van de [wet], aangevuld, indien van toepassing, met de tegemoetkoming op grond van de Wet op de kindregelingen. Artikel 22a van de [wet] blijft hierbij buiten toepassing."
            			}
            		],
            		"explanation": "NB Wet op de kindregelingen is niet een bestaande wet, maar hier zal de set aan kinderbijslag, kindertoeslag etc bedoeld worden?"
		},
		{
			"fact" : "[nadere regels]",
            		"function": "[wet].[zicht op inkomensverbetering] = [wet].[zicht op inkomensverbetering] AND [nadere regels]",
            		"sources" : [
            			{
            				"citation": "artikel 3, lid 3",
            				"juriconnect": "",
            				"text": "Het college stelt nadere regels met betrekking tot de toepassing van het eerste lid ten aanzien van bepaalde categorieën personen."
            			}
            		],
            		"explanation": "hier lijkt te worden verwezen naar eerste lid van deze verordening maar het beleid refereert ook aan nadere regels rondom zicht op inkomensverbetering als bedoeld in artikel 36, eerste lid van de [wet], dus lijkt hier eerder deze verwijzing van toepassing. Wat de nadere regels zijn wordt buiten deze verordening in een apart beleid vastgesteld"
		},
		{
			"fact" : "[toeslag]",
            		"function": "[toeslag alleenstaande] + [toeslag alleenstaande ouder met uitsluitend kinderen jonger dan 12 jaar] + [toeslag alleenstaande ouder met ten minste 1 kind van 12 jaar of ouder] + [toeslag gehuwden/samenwonenden zonder kinderen of met uitsluitend kinderen jonger dan 12 jaar] + [toeslag gehuwden/samenwonenden met tenminste 1 kind van 12 jaar of ouder en een inkomen onder 110% van de bijstandsnorm voor gehuwden/samenwonenden] + [toeslag gehuwden/samenwonenden met tenminste 1 kind van 12 jaar of ouder en een inkomen tussen 110 en 125% van de bijstandsnorm voor gehuwden/samenwonenden], [effectivity]",
            		"sources" : [
            			{
            				"citation": "artikel 4, lid 1",
            				"juriconnect": "",
            				"text": "Een individuele inkomenstoeslag bedraagt per kalenderjaar:"
            			}
            		],
            		"explanation": "De hoogte van de ongeindexeerde individuele inkomenstoeslag in euro's"
		},
		{
			"fact" : "[toeslag alleenstaande]",
            		"function": "IF [alleenstaande] THEN 225",
            		"sources" : [
            			{
            				"citation": "artikel 4, lid 1, onderdeel a",
            				"juriconnect": "",
            				"text": "alleenstaande: € 225,00"
            			}
            		],
            		"explanation": ""
		},
		{
			"fact" : "[toeslag alleenstaande ouder met uitsluitend kinderen jonger dan 12 jaar]",
            		"function": "IF [alleenstaande ouder met uitsluitend kinderen jonger dan 12 jaar] THEN 50",
            		"sources" : [
            			{
            				"citation": "artikel 4, lid 1, onderdeel b",
            				"juriconnect": "",
            				"text": "alleenstaande ouder met uitsluitend kinderen jonger dan 12 jaar: € 50,00"
            			}
            		],
            		"explanation": ""
		},
		{
			"fact" : "[toeslag alleenstaande ouder met ten minste 1 kind van 12 jaar of ouder]",
            		"function": "IF [alleenstaande ouder met ten minste 1 kind van 12 jaar of ouder] THEN 612",
            		"sources" : [
            			{
            				"citation": "artikel 4, lid 1, onderdeel c",
            				"juriconnect": "",
            				"text": "alleenstaande ouder met ten minste 1 kind van 12 jaar of ouder: € 612,00"
            			}
            		],
            		"explanation": ""
		},
		{
			"fact" : "[toeslag gehuwden/samenwonenden zonder kinderen of met uitsluitend kinderen jonger dan 12 jaar]",
            		"function": "IF [gehuwden/samenwonenden zonder kinderen of met uitsluitend kinderen jonger dan 12 jaar] THEN 575",
            		"sources" : [
            			{
            				"citation": "artikel 4, lid 1, onderdeel d",
            				"juriconnect": "",
            				"text": "gehuwden/samenwonenden zonder kinderen of met uitsluitend kinderen jonger dan 12 jaar: € 575,00"
            			}
            		],
            		"explanation": ""
		},
		{
			"fact" : "[toeslag gehuwden/samenwonenden met tenminste 1 kind van 12 jaar of ouder en een inkomen onder 110% van de bijstandsnorm voor gehuwden/samenwonenden]",
            		"function": "IF [gehuwden/samenwonenden met tenminste 1 kind van 12 jaar of ouder en een inkomen onder 110% van de bijstandsnorm voor gehuwden/samenwonenden] THEN 815",
            		"sources" : [
            			{
            				"citation": "artikel 4, lid 1, onderdeel e",
            				"juriconnect": "",
            				"text": "gehuwden/samenwonenden met tenminste 1 kind van 12 jaar of ouder en een inkomen onder 110% van de bijstandsnorm voor gehuwden/samenwonenden: € 815,00"
            			}
            		],
            		"explanation": ""
		},
		{
			"fact" : "[toeslag gehuwden/samenwonenden met tenminste 1 kind van 12 jaar of ouder en een inkomen tussen 110 en 125% van de bijstandsnorm voor gehuwden/samenwonenden]",
            		"function": "IF [gehuwden/samenwonenden met tenminste 1 kind van 12 jaar of ouder en een inkomen tussen 110 en 125% van de bijstandsnorm voor gehuwden/samenwonenden] THEN 408",
            		"sources" : [
            			{
            				"citation": "artikel 4, lid 1, onderdeel f",
            				"juriconnect": "",
            				"text": "gehuwden/samenwonenden met tenminste 1 kind van 12 jaar of ouder en een inkomen tussen 110 en 125% van de bijstandsnorm voor gehuwden/samenwonenden: € 408,00"
            			}
            		],
            		"explanation": ""
		},
		{
			"fact" : "[SamenMetNietRechtHebbende]",
            		"function": "NOT [echtgenoot].[wet].[recht op bijstand]",
            		"sources" : [
            			{
            				"citation": "artikel 4, lid 2",
            				"juriconnect": "",
            				"text": "De individuele inkomenstoeslag komt alle personen van het huishouden gezamenlijk toe. Als één van de gehuwden/samenwonenden is uitgesloten van het recht op individuele inkomenstoeslag ingevolge de artikelen 11 of 13, eerste lid, van de [wet], komt de rechthebbende echtgenoot in aanmerking voor een individuele inkomenstoeslag naar de hoogte die voor hem als alleenstaande of alleenstaande ouder zou gelden."
            			}
            		],
            		"explanation": ""
		},
		{
			"fact" : "[aleenstaande]",
            		"function": "NOT [echtgenoot] OR [SamenMetNietRechtHebbende]",
            		"sources" : [
            			{
            				"citation": "artikel 4, lid 2; lid 1 onderdeel a",
            				"juriconnect": "",
            				"text": "De individuele inkomenstoeslag komt alle personen van het huishouden gezamenlijk toe. Als één van de gehuwden/samenwonenden is uitgesloten van het recht op individuele inkomenstoeslag ingevolge de artikelen 11 of 13, eerste lid, van de [wet], komt de rechthebbende echtgenoot in aanmerking voor een individuele inkomenstoeslag naar de hoogte die voor hem als alleenstaande of alleenstaande ouder zou gelden."
            			}
            		],
            		"explanation": ""
		},
		{
			"fact" : "[alleenstaande ouder met uitsluitend kinderen jonger dan 12 jaar]",
            		"function": "[alleenstaande] AND FOR EACH [kind] IN [kinderen] [kind].[leeftijd] < 12",
            		"sources" : [
            			{
            				"citation": "artikel 4, lid 1, onderdeel b",
            				"juriconnect": "",
            				"text": ""
            			}
            		],
            		"explanation": ""
		},
		{
			"fact" : "[alleenstaande ouder met ten minste 1 kind van 12 jaar of ouder]",
            		"function": "[alleenstaande] AND EXISTS [kind] IN [kinderen] HAVING [kind].[leeftijd] >= 12",
            		"sources" : [
            			{
            				"citation": "artikel 4, lid 1, onderdeel c",
            				"juriconnect": "",
            				"text": ""
            			}
            		],
            		"explanation": ""
		},
		{
			"fact" : "[effectivity]",
            		"function": "EFFECTIVE ON [peildatum]",
            		"sources" : [
            			{
            				"citation": "artikel 4, lid 3",
            				"juriconnect": "",
            				"text": "Voor toepassing van het eerste lid is de situatie op de peildatum bepalend."
            			}
            		],
            		"explanation": ""
		},
		{
			"fact" : "[indexation]",
            		"function": "FACTOR([did:discipl:cbs:nl:dataset:83131NED:table?dl=68F43][Jaarmutatie CPI]/100)",
            		"sources" : [
            			{
            				"citation": "artikel 4, lid 3",
            				"juriconnect": "",
            				"text": "De bedragen genoemd in het eerste lid worden jaarlijks geïndexeerd overeenkomstig de ontwikkelingen van de consumentenprijsindex volgens het Centraal Bureau voor de Statistiek. De bedragen worden naar boven afgerond op hele euro’s."
            			}
            		],
            		"explanation": "Vermenigvuldiging van de procentuele jaarmutaties sinds 2019 welke gebruikt moet worden om de toeslag mee te indexeren"
		},
		{
			"fact" : "[geindexeerde toeslag]",
            		"function": "CEILING([toeslag] * [indexation])",
            		"sources" : [
            			{
            				"citation": "artikel 4, lid 3",
            				"juriconnect": "",
            				"text": "De bedragen genoemd in het eerste lid worden jaarlijks geïndexeerd overeenkomstig de ontwikkelingen van de consumentenprijsindex volgens het Centraal Bureau voor de Statistiek. De bedragen worden naar boven afgerond op hele euro’s."
            			}
            		],
            		"explanation": "Vermenigvuldiging van de procentuele jaarmutaties sinds 2019 welke gebruikt moet worden om de toeslag mee te indexeren"
		},
		{
			"fact" : "[hardheidsclausule]",
            		"function": "",
            		"sources" : [
            			{
            				"citation": "artikel 5",
            				"juriconnect": "",
            				"text": "Het college kan, in afwijking van de verordening, besluiten tot toekenning van de individuele inkomenstoeslag als afwijzing daarvan naar het oordeel van het college kennelijk onredelijk is."
            			}
            		],
            		"explanation": ""
		},
		{
			"fact" : "[validFrom]",
            		"function": "2019-01-01",
            		"sources" : [
            			{
            				"citation": "artikel 7",
            				"juriconnect": "",
            				"text": "Deze verordening treedt in werking op 1 januari 2019."
            			}
            		],
            		"explanation": ""
		},
		{
			"fact" : "[citeertitel]",
            		"function": "Verordening individuele inkomenstoeslag gemeente Utrecht 2019",
            		"sources" : [
            			{
            				"citation": "artikel 8",
            				"juriconnect": "",
            				"text": "Deze verordening wordt aangehaald als: Verordening individuele inkomenstoeslag gemeente Utrecht 2019"
            			}
            		],
            		"explanation": ""
		}
	],
	"duties" : []
}
