{
	"source" : {
            	"validFrom": "",
            	"validTo": "",
            	"citation": "",
            	"juriconnect": ""
        },
	"acts" : [
		{
			"act" : "",
			"actor" : "",
			"object" : "",
			"recipient" : "",
			"precondition" : "",
			"create" : "",
			"terminate" : "",
			"sources" : [
				{
            				"validFrom": "",
            				"validTo": "",
            				"citation": "",
            				"juriconnect": "",
            				"text": ""
            			}
			],
			"explanation" : ""
		}
	],
	"facts" : [
		{
			"fact" : "",
            		"function": "",
            		"sources" : [
            			{
            				"validFrom": "",
            				"validTo": "",
            				"citation": "",
            				"juriconnect": "",
            				"text": ""
            			}
            		],
            		"explanation": ""
		}
	],
	"duties" : [
		{
			"duty": "",
			"enforce": "",
      			"duty-holder": "",
      			"claimant": "",
      			"create": "",
      			"terminate": "",
      			"sources" : [
            			{
            				"validFrom": "",
            				"validTo": "",
            				"citation": "",
            				"juriconnect": "",
            				"text": ""
            			}
            		],
      			"explanation": ""
		}
	]
}
