{
	"source" : {
            	"validFrom": "",
            	"validTo": "",
            	"citation": "Individuele inkomenstoeslag aanvragen",
            	"juriconnect": "https://pki.utrecht.nl/Loket/product/0c17f7cd409dc999eb351883a138ca3d",
        },
	"acts" : [
	],
	"facts" : [
	],
	"duties" : [
	]
}
