{
    "j2022_a8_17_oukor": [
        "€ 1.726"
    ],
    "j2022_a8_17_perc": [
        "15%"
    ],
    "j2022_a8_17_grnsbdrg": [
        "€ 38.464"
    ],
    "j2022_a8_17_laag": [
        "De ouderenkorting bedraagt € 1.726",
        "het verzamelinkomen voor zover dat meer bedraagt dan € 38.464"
    ],
    "j2022_a8_17_hoog": [
        "De ouderenkorting bedraagt € 1.726, verminderd, doch niet verder dan tot nihil, met 15% van het verzamelinkomen voor zover dat meer bedraagt dan € 38.464"
    ],
    "j2022_a8_17_pgl": [
        "de pensioengerechtigde leeftijd"
    ],
    "j2022_a8_17_eindkal": [
        "bij het einde van het kalenderjaar"
    ],
    "j2022_a8_17_eindkalhb": [
        "bij het einde van het kalenderjaar",
        "heeft bereikt"
    ],
    "j2022_a8_17_nvt": [
        "De ouderenkorting geldt"
    ],
    "j2022_a8_17_gj": [
        "van 01-04-2022 t/m 31-12-2022"
    ],
    "j2022_a8_17_gldg": [
        "Geldend van 01-04-2022 t/m 31-12-2022"
    ],
    "j2022_a8_17_grns": [
        "het verzamelinkomen voor zover dat meer bedraagt dan € 38.464"
    ],
    "j2022_a8_17_pbg": [
        "15% van het verzamelinkomen voor zover dat meer bedraagt dan € 38.464"
    ],
    "j2022_a8_17_verm": [
        "verminderd, doch niet verder dan tot nihil, met 15% van het verzamelinkomen voor zover dat meer bedraagt dan € 38.464"
    ]
}

