<svg viewBox="0 0 61 60" fill="none" xmlns="http://www.w3.org/2000/svg">
<path d="M43 5L53 15L43 25" stroke-width="4" stroke-linecap="round" stroke-linejoin="round"/>
<path d="M8 27.5V25C8 22.3478 9.05357 19.8043 10.9289 17.9289C12.8043 16.0536 15.3478 15 18 15H53" stroke-width="4" stroke-linecap="round" stroke-linejoin="round"/>
<path d="M18 55L8 45L18 35" stroke-width="4" stroke-linecap="round" stroke-linejoin="round"/>
<path d="M53 32.5V35C53 37.6522 51.9464 40.1957 50.0711 42.0711C48.1957 43.9464 45.6522 45 43 45H8" stroke-width="4" stroke-linecap="round" stroke-linejoin="round"/>
</svg>
