<svg viewBox="0 0 15 22" xmlns="http://www.w3.org/2000/svg">
<path fill-rule="evenodd" clip-rule="evenodd" d="M14.625 9.41675C14.625 14.5393 7.5 20.5001 7.5 20.5001C7.5 20.5001 0.375 14.5393 0.375 9.41675C0.375 5.48172 3.56497 2.29175 7.5 2.29175C11.4351 2.29175 14.625 5.48172 14.625 9.41675ZM10.0729 9.41675C10.0729 10.8377 8.92096 11.9897 7.5 11.9897C6.07904 11.9897 4.92708 10.8377 4.92708 9.41675C4.92708 7.99577 6.07904 6.84383 7.5 6.84383C8.92096 6.84383 10.0729 7.99577 10.0729 9.41675Z"/>
</svg>
