<svg width="65" height="64" viewBox="0 0 65 64" fill="none" xmlns="http://www.w3.org/2000/svg">
<rect width="64" height="64" rx="32" transform="matrix(-1 8.74228e-08 8.74228e-08 1 64.25 0)" fill="#65B0DC"/>
<path d="M26.5 19.1915L39.9902 32L26.5 44.8085L27.7549 46L42.5 32L27.7549 18L26.5 19.1915Z" fill="white"/>
</svg>
