<svg width="24" height="24" viewBox="0 0 24 24" fill="none" xmlns="http://www.w3.org/2000/svg">
<path d="M16 7H4C2.89543 7 2 7.89543 2 9V15C2 16.1046 2.89543 17 4 17H16C17.1046 17 18 16.1046 18 15V9C18 7.89543 17.1046 7 16 7Z" stroke-width="2" stroke-linecap="round" stroke-linejoin="round"/>
<path d="M22 11V13" stroke-width="2" stroke-linecap="round" stroke-linejoin="round"/>
<path d="M6 11V13"  stroke-width="2" stroke-linecap="round" stroke-linejoin="round"/>
<path d="M10 11V13" stroke-width="2" stroke-linecap="round" stroke-linejoin="round"/>
<path d="M14 11V13" stroke-width="2" stroke-linecap="round" stroke-linejoin="round"/>
</svg>
