<svg width="280" height="99" viewBox="0 0 280 99" fill="none" xmlns="http://www.w3.org/2000/svg">
<path d="M49.22 53.996H56.5V58H45.06V39.8H56.37V43.804H49.22V46.82H55.72V50.772H49.22V53.996ZM71.0671 58H66.5951L64.1771 54.568L61.7591 58H57.2871L61.9411 51.396L57.4431 45H61.9151L64.1771 48.224L66.4391 45H70.9111L66.4131 51.396L71.0671 58ZM77.8302 58.364C73.8782 58.364 70.9402 55.374 70.9402 51.5C70.9402 47.626 73.8782 44.636 77.8302 44.636C80.3522 44.636 82.5882 45.962 83.7062 47.964L80.3002 49.94C79.8582 49.03 78.9222 48.484 77.7782 48.484C76.0882 48.484 74.8402 49.706 74.8402 51.5C74.8402 53.294 76.0882 54.516 77.7782 54.516C78.9222 54.516 79.8842 53.97 80.3002 53.06L83.7062 55.01C82.5882 57.038 80.3782 58.364 77.8302 58.364ZM92.8937 44.636C95.5197 44.636 97.7557 46.508 97.7557 50.018V58H93.8557V50.59C93.8557 48.978 92.8417 48.224 91.5937 48.224C90.1637 48.224 89.1757 49.056 89.1757 50.902V58H85.2757V39.8H89.1757V46.222C89.8777 45.26 91.1777 44.636 92.8937 44.636ZM109.872 45H113.772V58H109.872V56.778C109.014 57.766 107.74 58.364 105.998 58.364C102.592 58.364 99.7839 55.374 99.7839 51.5C99.7839 47.626 102.592 44.636 105.998 44.636C107.74 44.636 109.014 45.234 109.872 46.222V45ZM106.778 54.672C108.572 54.672 109.872 53.45 109.872 51.5C109.872 49.55 108.572 48.328 106.778 48.328C104.984 48.328 103.684 49.55 103.684 51.5C103.684 53.45 104.984 54.672 106.778 54.672ZM124.251 44.636C126.877 44.636 129.113 46.508 129.113 50.018V58H125.213V50.59C125.213 48.978 124.199 48.224 122.951 48.224C121.521 48.224 120.533 49.056 120.533 50.902V58H116.633V45H120.533V46.222C121.235 45.26 122.535 44.636 124.251 44.636ZM141.333 45H145.129V57.35C145.129 61.718 141.723 63.564 138.265 63.564C135.561 63.564 133.299 62.55 132.103 60.418L135.431 58.494C135.925 59.404 136.679 60.132 138.395 60.132C140.215 60.132 141.333 59.196 141.333 57.35V56.154C140.475 57.22 139.227 57.844 137.537 57.844C133.845 57.844 131.141 54.828 131.141 51.24C131.141 47.652 133.845 44.636 137.537 44.636C139.227 44.636 140.475 45.26 141.333 46.326V45ZM138.187 54.256C140.033 54.256 141.333 53.034 141.333 51.24C141.333 49.446 140.033 48.224 138.187 48.224C136.341 48.224 135.041 49.446 135.041 51.24C135.041 53.034 136.341 54.256 138.187 54.256ZM151.475 53.06C151.969 54.412 153.165 54.88 154.595 54.88C155.661 54.88 156.571 54.464 157.091 53.892L160.211 55.686C158.937 57.454 157.013 58.364 154.543 58.364C150.097 58.364 147.341 55.374 147.341 51.5C147.341 47.626 150.149 44.636 154.257 44.636C158.053 44.636 160.861 47.574 160.861 51.5C160.861 52.046 160.809 52.566 160.705 53.06H151.475ZM151.397 50.148H156.987C156.571 48.64 155.401 48.094 154.231 48.094C152.749 48.094 151.761 48.822 151.397 50.148ZM166.973 47.314C167.493 45.572 169.235 44.74 170.873 44.74V49.16C169.261 48.9 166.973 49.55 166.973 52.124V58H163.073V45H166.973V47.314ZM181.51 58.364C176.024 58.364 172.046 54.256 172.046 48.9C172.046 43.544 176.024 39.436 181.51 39.436C184.812 39.436 187.724 41.074 189.31 43.648L185.722 45.728C184.916 44.324 183.356 43.492 181.51 43.492C178.286 43.492 176.206 45.65 176.206 48.9C176.206 52.15 178.286 54.308 181.51 54.308C183.356 54.308 184.942 53.476 185.722 52.072L189.31 54.152C187.75 56.726 184.838 58.364 181.51 58.364ZM197.496 58.364C193.674 58.364 190.606 55.374 190.606 51.5C190.606 47.626 193.674 44.636 197.496 44.636C201.318 44.636 204.386 47.626 204.386 51.5C204.386 55.374 201.318 58.364 197.496 58.364ZM197.496 54.568C199.186 54.568 200.486 53.346 200.486 51.5C200.486 49.654 199.186 48.432 197.496 48.432C195.806 48.432 194.506 49.654 194.506 51.5C194.506 53.346 195.806 54.568 197.496 54.568ZM216.03 39.8H219.93V58H216.03V56.778C215.172 57.766 213.898 58.364 212.156 58.364C208.75 58.364 205.942 55.374 205.942 51.5C205.942 47.626 208.75 44.636 212.156 44.636C213.898 44.636 215.172 45.234 216.03 46.222V39.8ZM212.936 54.672C214.73 54.672 216.03 53.45 216.03 51.5C216.03 49.55 214.73 48.328 212.936 48.328C211.142 48.328 209.842 49.55 209.842 51.5C209.842 53.45 211.142 54.672 212.936 54.672ZM226.275 53.06C226.769 54.412 227.965 54.88 229.395 54.88C230.461 54.88 231.371 54.464 231.891 53.892L235.011 55.686C233.737 57.454 231.813 58.364 229.343 58.364C224.897 58.364 222.141 55.374 222.141 51.5C222.141 47.626 224.949 44.636 229.057 44.636C232.853 44.636 235.661 47.574 235.661 51.5C235.661 52.046 235.609 52.566 235.505 53.06H226.275ZM226.197 50.148H231.787C231.371 48.64 230.201 48.094 229.031 48.094C227.549 48.094 226.561 48.822 226.197 50.148Z" fill="white"/>
</svg>
