<svg width="48" height="48" viewBox="0 0 48 48" fill="none" xmlns="http://www.w3.org/2000/svg">
<g clip-path="url(#clip0_1535_225)">
<path d="M24 36.52L9.89395 44.416L13.044 28.56L1.17395 17.584L17.228 15.68L24 1L30.7719 15.68L46.826 17.584L34.956 28.56L38.1059 44.416L24 36.52Z" fill="white"/>
</g>
<defs>
<clipPath id="clip0_1535_225">
<rect width="48" height="48" fill="white"/>
</clipPath>
</defs>
</svg>
