<svg width="10" height="15" viewBox="0 0 10 15" fill="none" xmlns="http://www.w3.org/2000/svg">
<path fill-rule="evenodd" clip-rule="evenodd" d="M9.94975 12.5L7.44975 15L1.75791e-07 7.55025L7.44975 0.100505L9.94975 2.60051L5 7.55025L9.94975 12.5Z" fill="white"/>
</svg>
