<svg width="322" height="237" viewBox="0 0 322 237" fill="none" xmlns="http://www.w3.org/2000/svg">
<path fill-rule="evenodd" clip-rule="evenodd" d="M201.672 1C145.828 1 100.623 19.4583 67.7521 45.3537V4.94256H1V236H67.7521V109.42C88.5564 85.1078 136.852 59.063 181.76 59.063C236.802 59.063 253.089 84.5702 253.089 133.733V236H320.227L321 108.076C320.346 22.9827 262.956 1 201.672 1Z" stroke="black"/>
</svg>
