<svg width="482" height="391" viewBox="0 0 482 391" fill="none" xmlns="http://www.w3.org/2000/svg">
<path opacity="0.94" fill-rule="evenodd" clip-rule="evenodd" d="M243.037 155.728C134.011 149.463 110.571 144.015 110.571 114.867C110.571 85.7192 133.194 77.8194 228.591 77.8194C329.167 77.8194 370.596 88.1709 370.596 129.577H467.357C467.357 36.4132 381.227 1 239.221 1C97.2154 1 13.8106 28.2409 13.8106 109.963C13.8106 191.686 78.9534 218.927 243.037 227.644C365.146 233.637 386.678 238.813 386.678 270.14C386.678 301.467 354.788 311.819 252.849 311.819C130.195 311.819 98.0327 293.567 98.0327 253.796H1C1 362.759 93.1267 390 246.307 390C385.587 390 480.985 369.297 480.985 268.778C482.348 172.073 390.221 163.901 243.037 155.728Z" fill="black" fill-opacity="0.2"/>
<path opacity="0.94" fill-rule="evenodd" clip-rule="evenodd" d="M243.037 155.728C134.011 149.463 110.571 144.015 110.571 114.867C110.571 85.7192 133.194 77.8194 228.591 77.8194C329.167 77.8194 370.596 88.1709 370.596 129.577H467.357C467.357 36.4132 381.227 1 239.221 1C97.2154 1 13.8106 28.2409 13.8106 109.963C13.8106 191.686 78.9535 218.927 243.037 227.644C365.146 233.637 386.678 238.813 386.678 270.14C386.678 301.467 354.788 311.819 252.849 311.819C130.195 311.819 98.0327 293.567 98.0327 253.796H1C1 362.759 93.1267 390 246.307 390C385.587 390 480.985 369.297 480.985 268.778C482.348 172.073 390.221 163.901 243.037 155.728Z" stroke="black"/>
</svg>
