<svg width="240" height="240" viewBox="0 0 240 240" fill="none" xmlns="http://www.w3.org/2000/svg">
<path fill-rule="evenodd" clip-rule="evenodd" d="M151.959 118.921L157.897 127.266H160.452V114.473H157.8V122.507L152.034 114.473H149.307V127.266H151.956V118.921H151.959ZM174.991 126.803C175.766 126.522 176.479 126.082 177.087 125.512C177.673 124.947 178.136 124.259 178.445 123.494C178.773 122.664 178.937 121.773 178.925 120.877C178.936 119.977 178.773 119.083 178.445 118.249C178.138 117.482 177.675 116.791 177.087 116.224C176.479 115.654 175.766 115.214 174.991 114.933C174.129 114.619 173.221 114.464 172.307 114.475H167.39V127.266H172.307C173.221 127.277 174.13 127.12 174.991 126.803ZM170.048 124.866V116.867H172.3C172.877 116.856 173.45 116.961 173.988 117.176C174.451 117.36 174.87 117.647 175.212 118.018C175.541 118.385 175.792 118.819 175.948 119.292C176.119 119.802 176.205 120.337 176.203 120.877C176.205 121.4 176.116 121.919 175.942 122.41C175.774 122.884 175.513 123.317 175.176 123.683C174.827 124.056 174.407 124.351 173.942 124.548C173.421 124.766 172.862 124.873 172.3 124.864H170.048V124.866ZM190.712 124.668C190.228 124.992 189.653 125.143 189.077 125.098C188.285 125.113 187.5 124.939 186.783 124.589C186.164 124.289 185.601 123.877 185.123 123.371L183.688 125.442C184.303 126.087 185.04 126.594 185.852 126.933C186.838 127.331 187.89 127.523 188.948 127.498C189.691 127.511 190.432 127.402 191.142 127.175C191.712 126.999 192.242 126.708 192.702 126.318C193.102 125.967 193.419 125.525 193.626 125.027C193.836 124.51 193.942 123.954 193.939 123.394C193.969 122.713 193.782 122.041 193.407 121.481C193.054 120.999 192.601 120.603 192.082 120.324C191.542 120.03 190.968 119.805 190.375 119.654C189.757 119.492 189.187 119.345 188.655 119.212C188.199 119.104 187.756 118.944 187.335 118.735C187.181 118.674 187.049 118.567 186.955 118.429C186.861 118.29 186.809 118.125 186.805 117.956C186.802 117.774 186.841 117.595 186.921 117.433C187.001 117.272 187.118 117.133 187.263 117.03C187.653 116.77 188.113 116.646 188.576 116.676C189.224 116.678 189.867 116.791 190.479 117.011C191.118 117.238 191.704 117.601 192.199 118.077L193.672 116.077C192.344 114.849 190.605 114.204 188.824 114.279C188.153 114.268 187.485 114.372 186.848 114.586C186.301 114.765 185.793 115.05 185.351 115.427C184.958 115.767 184.639 116.188 184.413 116.663C184.193 117.132 184.08 117.647 184.084 118.168C184.051 118.852 184.237 119.528 184.615 120.09C184.969 120.568 185.422 120.957 185.941 121.23C186.49 121.518 187.071 121.736 187.672 121.88C188.285 122.036 188.867 122.178 189.392 122.321C189.853 122.436 190.299 122.605 190.721 122.827C190.88 122.902 191.016 123.022 191.11 123.174C191.205 123.326 191.254 123.502 191.253 123.683C191.245 123.88 191.192 124.071 191.098 124.243C191.004 124.414 190.872 124.56 190.712 124.668V124.668ZM134.554 125.098H139.887L140.649 127.265H143.678L138.878 114.471H135.559L130.746 127.265H133.767L134.554 125.098ZM137.219 117.195L139.157 122.699H135.275L137.219 117.195ZM67.1688 125.341L65.6457 127.42L67.767 129.058L69.3081 126.941C69.6064 127.071 69.9131 127.179 70.226 127.264C70.8264 127.419 71.443 127.496 72.0618 127.494C72.955 127.502 73.8415 127.336 74.6749 127.004C75.4454 126.695 76.1473 126.229 76.7383 125.632C77.3245 125.036 77.7855 124.322 78.0925 123.534C78.4213 122.69 78.5863 121.788 78.578 120.878C78.5897 119.919 78.4048 118.967 78.0354 118.086C77.7656 117.481 77.4066 116.921 76.9713 116.429L78.5014 114.337L76.3833 112.702L74.8305 114.831C74.4885 114.679 74.1352 114.556 73.7742 114.463C73.2145 114.323 72.6406 114.254 72.065 114.257C71.1782 114.249 70.2982 114.416 69.4723 114.749C68.7017 115.053 68.0004 115.518 67.4128 116.115C66.8251 116.712 66.3637 117.429 66.0578 118.22C65.4127 119.936 65.4127 121.839 66.0578 123.555C66.3256 124.212 66.7015 124.817 67.1688 125.341ZM75.352 118.659C75.6994 119.342 75.8727 120.106 75.8555 120.877C75.8604 121.445 75.7694 122.009 75.5866 122.545C75.4187 123.035 75.1585 123.485 74.8211 123.871C74.4843 124.245 74.0777 124.546 73.6256 124.754C73.1328 124.976 72.5995 125.086 72.0618 125.077C71.71 125.081 71.3592 125.036 71.0188 124.944C70.9484 124.925 70.8945 124.884 70.8249 124.863L75.352 118.659ZM68.5668 119.208C68.7342 118.719 68.99 118.267 69.3206 117.876C69.6473 117.494 70.0522 117.193 70.5059 116.993C70.9977 116.777 71.5276 116.67 72.0618 116.677C72.3695 116.675 72.6762 116.71 72.9759 116.782C73.0905 116.817 73.2031 116.859 73.3129 116.907L68.7967 123.099C68.6658 122.846 68.561 122.579 68.484 122.304C68.3545 121.84 68.2913 121.36 68.2963 120.877C68.291 120.309 68.3826 119.743 68.5668 119.208V119.208ZM56.2631 126.803C57.0387 126.523 57.7513 126.084 58.3578 125.512C58.9443 124.947 59.4064 124.259 59.7128 123.494C60.0463 122.665 60.2125 121.774 60.2015 120.877C60.2119 119.976 60.0457 119.082 59.7128 118.249C59.4078 117.482 58.9456 116.791 58.3578 116.224C57.7517 115.651 57.0391 115.211 56.2631 114.93C55.4025 114.616 54.4949 114.46 53.5821 114.471H48.6648V127.266H53.5805C54.4942 127.277 55.4026 127.12 56.2631 126.803ZM51.317 124.866V116.867H53.5743C54.1512 116.857 54.7247 116.962 55.2631 117.176C55.7258 117.36 56.1433 117.648 56.486 118.018C56.8148 118.385 57.0654 118.819 57.2217 119.292C57.3951 119.801 57.4811 120.337 57.4758 120.877C57.4765 121.4 57.3884 121.919 57.2155 122.41C57.0476 122.884 56.7871 123.317 56.45 123.683C56.1011 124.056 55.6817 124.35 55.2178 124.548C54.6963 124.765 54.138 124.873 53.5758 124.864H51.3146L51.317 124.866ZM85.4938 125.664C86.0987 126.257 86.8136 126.718 87.5955 127.019C88.4294 127.343 89.3142 127.506 90.2054 127.498C90.8316 127.506 91.4554 127.415 92.0546 127.227C92.5708 127.065 93.0612 126.826 93.5096 126.517C93.9198 126.236 94.2901 125.898 94.6098 125.512C94.9109 125.151 95.1799 124.762 95.4135 124.351L93.1367 123.221C92.8694 123.767 92.4641 124.227 91.9639 124.555C91.4421 124.904 90.8315 125.087 90.2093 125.078C89.6749 125.084 89.1449 124.977 88.6518 124.764C88.1811 124.562 87.7559 124.262 87.4027 123.882C87.0496 123.503 86.7761 123.052 86.5994 122.559C86.4033 122.023 86.305 121.454 86.3093 120.881C86.3046 120.311 86.4029 119.745 86.5994 119.212C86.7824 118.717 87.0588 118.264 87.4125 117.879C87.7616 117.499 88.1837 117.198 88.6518 116.996C89.1448 116.783 89.6748 116.675 90.2093 116.68C90.833 116.673 91.4444 116.859 91.9639 117.216C92.46 117.543 92.8644 117.999 93.1367 118.538L95.4135 117.387C95.179 116.977 94.9101 116.589 94.6098 116.228C94.2913 115.843 93.9208 115.507 93.5096 115.232C93.0586 114.93 92.5688 114.694 92.0546 114.532C91.4555 114.343 90.8317 114.251 90.2054 114.259C89.314 114.254 88.4293 114.418 87.5955 114.743C86.8149 115.041 86.1015 115.5 85.4992 116.093C84.8969 116.685 84.4185 117.399 84.0934 118.19C83.4117 119.917 83.4117 121.852 84.0934 123.58C84.4193 124.365 84.8956 125.074 85.4938 125.664ZM104.128 123.336L105.099 122.147L108.867 127.269H112.135L106.851 120.476L111.796 114.473H108.534L104.128 120.188V114.473H101.477V127.266H104.128V123.333V123.336ZM125.738 124.869H120.476V114.473H117.828V127.266H125.738V124.867V124.869ZM200.286 106.455H174.725C171.656 94.2971 164.766 83.5335 155.135 75.8507C145.504 68.1679 133.676 64 121.505 64C109.333 64 97.5051 68.1679 87.8742 75.8507C78.2432 83.5335 71.3533 94.2971 68.2838 106.455H40V134.542H68.283C71.3523 146.701 78.2422 157.465 87.8734 165.149C97.5046 172.832 109.333 177 121.505 177C133.677 177 145.505 172.832 155.136 165.149C164.768 157.465 171.658 146.701 174.727 134.542H200.286V106.455ZM121.502 74.494C130.964 74.4947 140.183 77.5874 147.838 83.3289C155.493 89.0703 161.19 97.1659 164.114 106.455H78.8892C81.813 97.1658 87.5106 89.0702 95.1655 83.3287C102.82 77.5872 112.04 74.4946 121.502 74.494ZM121.502 166.504C112.04 166.503 102.821 163.41 95.1668 157.668C87.5124 151.927 81.8152 143.832 78.8916 134.542H164.117C161.193 143.832 155.495 151.928 147.84 157.67C140.184 163.412 130.964 166.504 121.502 166.504ZM197.163 131.328H43.1221V109.667H197.163V131.331V131.328Z" fill="white"/>
</svg>
