<svg width="802" height="658" viewBox="0 0 802 658" fill="none" xmlns="http://www.w3.org/2000/svg">
<path opacity="0.94" d="M401 0.5C261.013 0.5 160.874 29.358 95.7277 84.7995C30.5649 140.255 0.5 222.231 0.5 328.259H1.5C1.5 222.422 31.5041 140.769 96.3758 85.5611C161.264 30.3393 261.124 1.5 401 1.5V0.5ZM0.5 328.259C0.5 434.286 30.5647 516.723 95.7261 572.64C160.872 628.544 261.012 657.864 401 657.864V656.864C261.126 656.864 161.266 627.564 96.3773 571.881C31.5043 516.211 1.5 434.096 1.5 328.259H0.5ZM401 657.864C540.988 657.864 641.128 628.428 706.274 572.467C771.435 516.492 801.5 434.056 801.5 328.259H800.5C800.5 433.865 770.496 515.981 705.622 571.708C640.734 627.448 540.873 656.864 401 656.864V657.864ZM801.5 328.259C801.5 222.461 771.32 140.486 706.1 84.9727C640.896 29.4737 540.757 0.5 401 0.5V1.5C540.645 1.5 640.506 30.4544 705.452 85.7342C770.381 141 800.5 222.654 800.5 328.259H801.5ZM400.314 517.772C315.265 517.772 256.263 502.77 218.524 471.486C180.808 440.221 164.227 392.608 164.227 327.125H163.227C163.227 392.768 179.852 440.728 217.886 472.256C255.896 503.764 315.187 518.772 400.314 518.772V517.772ZM164.227 327.125C164.227 261.641 180.578 214.376 218.176 183.459C255.799 152.521 314.801 137.863 400.314 137.863V136.863C314.729 136.863 255.437 151.524 217.541 182.686C179.621 213.869 163.227 261.484 163.227 327.125H164.227ZM400.314 137.863C485.826 137.863 544.944 152.866 582.683 183.978C620.399 215.069 636.864 262.336 636.864 327.125H637.864C637.864 262.175 621.354 214.56 583.319 183.206C545.309 151.871 485.902 136.863 400.314 136.863V137.863ZM636.864 327.125C636.864 391.914 620.284 439.529 582.509 470.967C544.711 502.424 485.593 517.772 400.314 517.772V518.772C485.674 518.772 545.081 503.417 583.148 471.736C621.238 440.036 637.864 392.077 637.864 327.125H636.864Z" fill="#E93537"/>
</svg>
