<svg width="320" height="320" viewBox="0 0 320 320" fill="none" xmlns="http://www.w3.org/2000/svg">
<path fill-rule="evenodd" clip-rule="evenodd" d="M112.618 320H207.382V215.465H320V104.475H207.382V0H112.618V104.475H0V215.465H112.618V320Z" fill="#E93537"/>
</svg>
