<svg width="696" height="600" viewBox="0 0 696 600" fill="none" xmlns="http://www.w3.org/2000/svg">
<path opacity="0.3" d="M228.132 190.411V0.5H467.868V190.529V191.029H468.368H695.5V409.089H468.368H467.868V409.589V599.5H228.132V409.471V408.971H227.632H0.5V190.911H227.632H228.132V190.411Z" stroke="white"/>
</svg>
