<svg  viewBox="0 0 25 25" fill="none" xmlns="http://www.w3.org/2000/svg">
<path d="M16.4918 4.50599C15.0405 4.56981 13.7389 5.14334 12.611 6.19952L12.494 6.313L12.3723 6.19501C11.1626 5.07606 9.7746 4.5 8.23438 4.5C5.07716 4.5 2.5 7.06027 2.5 10.2172C2.5 13.3046 3.62733 14.7688 8.68242 18.763L11.3704 20.8607C12.0345 21.3783 12.9655 21.3783 13.6296 20.8607L15.9937 19.0182L16.9269 18.2784C21.4647 14.644 22.5 13.176 22.5 10.2172C22.5 7.06027 19.9228 4.5 16.7656 4.5L16.4918 4.50599ZM16.7656 6.3C18.9314 6.3 20.7 8.05704 20.7 10.2172L20.6951 10.5108C20.6192 12.6674 19.6332 13.852 15.186 17.3631L12.5231 19.441C12.5095 19.4515 12.4905 19.4515 12.4769 19.441L10.1128 17.5984L9.23899 16.9066C5.09678 13.5977 4.3 12.4668 4.3 10.2172C4.3 8.05704 6.06863 6.3 8.23438 6.3C9.56729 6.3 10.7408 6.91758 11.8038 8.21525C12.1662 8.65771 12.8441 8.65426 13.202 8.20812C14.2389 6.91565 15.4087 6.3 16.7656 6.3Z" fill="white"/>
<path d="M16.7656 6.3C18.9314 6.3 20.7 8.05704 20.7 10.2172L20.6951 10.5108C20.6192 12.6674 19.6332 13.852 15.186 17.3631L12.5231 19.441C12.5095 19.4515 12.4905 19.4515 12.4769 19.441L10.1128 17.5984L9.23899 16.9066C5.09678 13.5977 4.3 12.4668 4.3 10.2172C4.3 8.05704 6.06863 6.3 8.23438 6.3C9.56729 6.3 10.7408 6.91758 11.8038 8.21525C12.1662 8.65771 12.8441 8.65426 13.202 8.20812C14.2389 6.91565 15.4087 6.3 16.7656 6.3Z" fill="white"/>
</svg>
