<svg viewBox="0 0 24 25" fill="none" xmlns="http://www.w3.org/2000/svg">
<path d="M4 21.6055V14.6055M4 10.6055V3.60547M12 21.6055V12.6055M12 8.60547V3.60547M20 21.6055V16.6055M20 12.6055V3.60547M1 14.6055H7M9 8.60547H15M17 16.6055H23" stroke-width="1.8" stroke-linecap="round" stroke-linejoin="round"/>
</svg>
