<svg width="30" height="30" viewBox="0 0 30 30" fill="none" xmlns="http://www.w3.org/2000/svg">
<path opacity="0.3" d="M13.9229 18.2754C13.9229 17.2829 14.0876 16.5136 14.417 15.9677C14.7465 15.4094 15.2604 14.9007 15.9588 14.4417C16.5518 14.0446 17.0064 13.66 17.3227 13.2878C17.6389 12.9156 17.8036 12.469 17.8168 11.9479C17.83 11.2655 17.573 10.701 17.0459 10.2543C16.5188 9.79527 15.8666 9.56574 15.0891 9.56574C14.2062 9.56574 13.5012 9.8511 12.9741 10.4218C12.447 10.9801 12.1967 11.7059 12.223 12.5992H10.3848C10.3979 11.2841 10.8394 10.2047 11.7091 9.36102C12.592 8.50494 13.7252 8.0769 15.1089 8.0769C16.4002 8.0769 17.4742 8.44291 18.3307 9.17492C19.1873 9.90693 19.6155 10.8188 19.6155 11.9107C19.6155 13.2134 18.7985 14.3858 17.1645 15.428C16.5847 15.7878 16.1762 16.1724 15.939 16.5819C15.7018 16.9913 15.5832 17.5558 15.5832 18.2754H13.9229ZM15.5832 21.6439C15.3856 21.83 15.1286 21.9231 14.8124 21.9231C14.4961 21.9231 14.2326 21.83 14.0217 21.6439C13.8241 21.4454 13.7252 21.1911 13.7252 20.8809C13.7252 20.5955 13.8241 20.3598 14.0217 20.1737C14.2326 19.9752 14.4961 19.8759 14.8124 19.8759C15.1286 19.8759 15.3856 19.9752 15.5832 20.1737C15.7941 20.3598 15.8995 20.5955 15.8995 20.8809C15.8995 21.1911 15.7941 21.4454 15.5832 21.6439Z" fill="white"/>
<rect x="1" y="1" width="28" height="28" rx="14" stroke="white" stroke-opacity="0.3" stroke-width="2"/>
</svg>
