<svg width="80" height="80" viewBox="0 0 80 80" fill="none" xmlns="http://www.w3.org/2000/svg">
<path d="M40 6.6665C25.2967 6.6665 13.3333 18.6298 13.3333 33.3165C13.2367 54.7998 38.9867 72.6132 40 73.3332C40 73.3332 66.7634 54.7998 66.6667 33.3332C66.6667 18.6298 54.7033 6.6665 40 6.6665ZM40 46.6665C32.6333 46.6665 26.6667 40.6998 26.6667 33.3332C26.6667 25.9665 32.6333 19.9998 40 19.9998C47.3667 19.9998 53.3333 25.9665 53.3333 33.3332C53.3333 40.6998 47.3667 46.6665 40 46.6665Z" fill="#358CFF"/>
</svg>
