<svg width="24" height="25" viewBox="0 0 24 25" xmlns="http://www.w3.org/2000/svg">
    <path d="M20.1202 18.3969C19.6781 17.3496 19.0365 16.3984 18.2311 15.5961C17.4282 14.7915 16.4771 14.15 15.4303 13.707C15.421 13.7023 15.4116 13.7 15.4022 13.6953C16.8624 12.6406 17.8116 10.9227 17.8116 8.98438C17.8116 5.77344 15.21 3.17188 11.9991 3.17188C8.78815 3.17188 6.18658 5.77344 6.18658 8.98438C6.18658 10.9227 7.1358 12.6406 8.59596 13.6977C8.58658 13.7023 8.57721 13.7047 8.56783 13.7094C7.51783 14.1523 6.57565 14.7875 5.76705 15.5984C4.96246 16.4013 4.32097 17.3524 3.87799 18.3992C3.44281 19.424 3.2081 20.5228 3.18658 21.6359C3.18596 21.661 3.19034 21.6858 3.19949 21.7091C3.20863 21.7324 3.22234 21.7537 3.23981 21.7716C3.25729 21.7895 3.27817 21.8037 3.30123 21.8134C3.32429 21.8231 3.34906 21.8281 3.37408 21.8281H4.78033C4.88346 21.8281 4.96549 21.7461 4.96783 21.6453C5.01471 19.8359 5.74127 18.1414 7.02564 16.857C8.35455 15.5281 10.1194 14.7969 11.9991 14.7969C13.8788 14.7969 15.6436 15.5281 16.9725 16.857C18.2569 18.1414 18.9835 19.8359 19.0303 21.6453C19.0327 21.7484 19.1147 21.8281 19.2178 21.8281H20.6241C20.6491 21.8281 20.6739 21.8231 20.6969 21.8134C20.72 21.8037 20.7409 21.7895 20.7584 21.7716C20.7758 21.7537 20.7895 21.7324 20.7987 21.7091C20.8078 21.6858 20.8122 21.661 20.8116 21.6359C20.7881 20.5156 20.5561 19.4258 20.1202 18.3969V18.3969ZM11.9991 13.0156C10.9233 13.0156 9.9108 12.5961 9.14908 11.8344C8.38736 11.0727 7.96783 10.0602 7.96783 8.98438C7.96783 7.90859 8.38736 6.89609 9.14908 6.13437C9.9108 5.37266 10.9233 4.95312 11.9991 4.95312C13.0749 4.95312 14.0874 5.37266 14.8491 6.13437C15.6108 6.89609 16.0303 7.90859 16.0303 8.98438C16.0303 10.0602 15.6108 11.0727 14.8491 11.8344C14.0874 12.5961 13.0749 13.0156 11.9991 13.0156Z" fill="#040E31"/>
</svg>
