<svg width="74" height="74" viewBox="0 0 74 74" fill="none" xmlns="http://www.w3.org/2000/svg">
<ellipse cx="36.8521" cy="36.8117" rx="36.7047" ry="36.8117" fill="#F2F2F2" fill-opacity="0.5"/>
<path fill-rule="evenodd" clip-rule="evenodd" d="M45.9984 27.1569C43.5197 24.6872 40.2233 23.3265 36.7115 23.3251C29.4751 23.3251 23.5857 29.1861 23.5828 36.3899C23.5818 38.6927 24.1863 40.9406 25.3352 42.922L23.4727 49.6925L30.4324 47.8756C32.3501 48.9166 34.5091 49.4653 36.7062 49.4659H36.7117C43.9473 49.4659 49.8373 43.6044 49.8401 36.4003C49.8415 32.909 48.4772 29.6264 45.9984 27.1569ZM36.7115 47.2593H36.707C34.749 47.2585 32.8287 46.7349 31.1531 45.7456L30.7548 45.5102L26.6248 46.5884L27.7272 42.581L27.4676 42.1701C26.3753 40.4411 25.7985 38.4426 25.7995 36.3907C25.8017 30.4031 30.697 25.5318 36.7159 25.5318C39.6305 25.5328 42.3703 26.6638 44.4305 28.7165C46.4906 30.7692 47.6245 33.4977 47.6236 36.3995C47.621 42.3876 42.7261 47.2593 36.7115 47.2593ZM42.697 39.1259C42.369 38.9624 40.7562 38.1729 40.4554 38.0637C40.1549 37.9548 39.936 37.9006 39.7175 38.2272C39.4987 38.5539 38.8702 39.2894 38.6787 39.5072C38.4872 39.7251 38.2961 39.7524 37.968 39.5889C37.6399 39.4256 36.583 39.0807 35.3299 37.9685C34.3548 37.1028 33.6965 36.0337 33.505 35.707C33.3139 35.38 33.5034 35.2204 33.6489 35.0408C34.004 34.6019 34.3596 34.1418 34.469 33.924C34.5784 33.7061 34.5236 33.5154 34.4415 33.3521C34.3596 33.1887 33.7036 31.5818 33.4303 30.9279C33.1638 30.2916 32.8936 30.3775 32.6921 30.3675C32.501 30.3581 32.2822 30.3561 32.0634 30.3561C31.8448 30.3561 31.4893 30.4377 31.1885 30.7647C30.8879 31.0916 30.0406 31.8813 30.0406 33.4882C30.0406 35.0951 31.216 36.6475 31.38 36.8654C31.544 37.0833 33.6932 40.3809 36.9838 41.7948C37.7665 42.1315 38.3774 42.3322 38.854 42.4827C39.6399 42.7311 40.3548 42.6961 40.9201 42.6121C41.5505 42.5182 42.8608 41.8222 43.1344 41.0597C43.4077 40.297 43.4077 39.6435 43.3255 39.5072C43.2437 39.371 43.0249 39.2894 42.697 39.1259Z" fill="#900B7B"/>
</svg>
