<svg width="952" height="390" viewBox="0 0 952 390" fill="none" xmlns="http://www.w3.org/2000/svg">
<path opacity="0.7" d="M755.91 99.2185C755.91 105.529 753.169 113.579 747.686 123.371C742.204 133.162 734.875 143.878 725.7 155.519C716.526 167.159 705.84 179.29 693.645 191.91C681.449 204.53 668.638 216.769 655.211 228.628C641.785 240.486 628.246 251.583 614.596 261.919C600.946 272.253 587.855 281.011 575.324 288.192C572.191 302.335 570.625 315.825 570.625 328.663C570.625 331.709 570.233 333.83 569.45 335.027C568.667 336.224 567.044 336.822 564.583 336.822L561.562 336.496C559.772 336.278 558.597 335.354 558.037 333.722C557.478 332.09 557.198 330.186 557.198 328.01C557.198 317.348 558.317 306.686 560.555 296.025C554.065 299.071 547.967 301.464 542.261 303.205C536.555 304.946 531.464 305.816 526.989 305.816C522.513 305.816 519.045 304.946 516.583 303.205C514.122 301.464 512.331 299.506 511.212 297.33C510.152 295.439 509.44 293.344 509.078 291.046L497.115 295.698C494.877 296.569 492.024 297.711 488.556 299.125C485.087 300.539 481.339 301.899 477.311 303.205C473.283 304.511 469.367 305.653 465.563 306.632C461.759 307.611 458.402 308.101 455.493 308.101C452.584 308.101 450.29 307.502 448.612 306.306C446.934 305.109 445.591 303.749 444.584 302.226C443.577 300.703 442.905 299.179 442.57 297.657C442.234 296.133 442.066 294.937 442.066 294.066C442.066 291.238 442.626 288.681 443.745 286.396C444.864 284.112 445.758 282.426 446.43 281.338C442.85 283.514 439.437 285.418 436.192 287.049C432.948 288.681 430.654 289.714 429.311 290.15C427.745 290.802 426.01 291.455 424.109 292.108C422.206 292.761 420.248 293.522 418.234 294.393C417.787 294.393 417.395 294.121 417.059 293.577C416.724 293.033 416.556 292.543 416.556 292.108C416.556 291.238 416.779 290.694 417.227 290.476C419.017 289.824 420.752 289.17 422.43 288.518C424.109 287.865 425.619 287.212 426.962 286.56C432.109 284.166 436.584 281.773 440.388 279.379C444.864 276.768 448.164 274.429 450.29 272.362C452.416 270.295 453.815 268.391 454.486 266.651C455.157 264.91 455.829 263.55 456.5 262.571C457.171 261.592 458.066 261.103 459.185 261.103C460.752 261.103 462.15 261.483 463.381 262.245C464.612 263.006 465.227 264.257 465.227 265.998C465.227 266.651 464.891 267.521 464.22 268.609C463.772 269.262 462.989 270.404 461.87 272.036C460.752 273.668 459.689 275.517 458.682 277.584C457.675 279.651 456.78 281.882 455.996 284.275C455.213 286.668 454.822 288.953 454.822 291.129C454.822 293.522 455.717 295.589 457.507 297.33C459.297 299.071 462.094 299.941 465.899 299.941C468.36 299.941 471.101 299.561 474.122 298.799C477.143 298.037 480.164 297.167 483.185 296.188C486.206 295.209 489.003 294.23 491.577 293.25C494.15 292.271 496.108 291.564 497.451 291.129C501.926 289.388 505.283 288.083 507.521 287.212C508.017 286.971 508.519 286.742 509.027 286.526C509.61 281.925 511.736 277.748 515.408 273.994C519.771 269.534 525.086 265.781 531.352 262.734C537.617 259.688 544.163 257.349 550.988 255.717C557.813 254.085 563.688 253.269 568.611 253.269C570.401 253.269 571.296 254.031 571.296 255.554C571.296 257.077 570.513 257.839 568.946 257.839L566.988 257.512C562.289 257.512 557.31 258.274 551.939 259.797C546.625 261.32 541.702 263.387 537.114 265.998C532.583 268.609 528.834 271.655 525.926 275.137C523.072 278.618 521.618 282.317 521.618 286.233C521.618 289.062 522.401 291.292 523.967 292.924C525.534 294.556 527.212 295.698 529.002 296.351C531.24 297.221 533.702 297.657 536.387 297.657C543.492 297.657 552.219 295.045 562.513 289.824C566.541 273.722 572.526 257.349 580.47 240.704C588.359 224.058 597.477 207.903 607.771 192.237C618.064 176.57 629.142 161.829 641.114 148.012C653.085 134.196 664.945 122.174 676.806 111.947C688.666 101.721 700.078 93.6156 711.155 87.6323C722.232 81.6487 732.134 78.6567 740.805 78.6567C746.176 78.6567 750.036 80.3434 752.385 83.7159C754.735 87.0883 755.91 92.2563 755.91 99.2185ZM741.141 99.8716C741.141 95.7376 739.91 92.6912 737.448 90.7328C734.987 88.7747 731.742 87.7955 727.714 87.7955C721.896 87.7955 714.735 90.3523 706.232 95.4656C697.728 100.578 688.61 107.65 678.875 116.68C669.141 125.71 659.127 136.372 648.834 148.665C638.54 160.959 628.806 174.286 619.631 188.647C610.457 203.007 602.121 218.075 594.624 233.85C587.128 249.625 581.254 265.563 577.002 281.664C587.743 275.354 599.268 267.63 611.576 258.491C623.883 249.353 636.078 239.398 648.162 228.628C660.246 217.857 671.938 206.597 683.239 194.848C694.539 183.098 704.442 171.566 712.945 160.251C721.448 148.937 728.274 138.058 733.421 127.614C738.568 117.17 741.141 107.922 741.141 99.8716ZM492.08 223.569C492.08 225.092 491.632 226.778 490.738 228.628C489.842 230.477 488.723 232.218 487.381 233.85C486.038 235.482 484.528 236.841 482.849 237.929C481.171 239.017 479.437 239.561 477.647 239.561C473.618 239.561 471.605 237.82 471.605 234.339C471.605 232.816 472.052 231.13 472.947 229.28C473.843 227.431 474.961 225.69 476.304 224.058C477.647 222.426 479.213 221.067 481.003 219.979C482.793 218.891 484.471 218.347 486.038 218.347C490.066 218.347 492.08 220.087 492.08 223.569ZM473.619 152.745C473.619 157.967 471.997 163.679 468.752 169.879C465.507 176.081 461.423 182.554 456.5 189.299C451.577 196.044 446.15 202.79 440.221 209.535C434.291 216.28 428.752 222.698 423.606 228.791C417.787 235.536 411.802 242.934 405.647 250.985C399.493 259.035 393.619 267.303 388.025 275.789C382.431 284.275 377.284 292.706 372.585 301.083C367.885 309.461 363.969 317.348 360.837 324.746C359.046 329.098 357.816 333.341 357.145 337.475C356.473 341.609 356.137 345.525 356.137 349.224C356.137 356.622 357.032 363.204 358.822 368.97C360.613 374.736 362.179 379.142 363.522 382.189C363.969 383.059 364.193 384.147 364.193 385.452C364.193 386.976 363.633 388.009 362.515 388.553C361.396 389.097 360.053 389.369 358.487 389.369C356.026 389.369 353.676 388.498 351.438 386.758C349.2 385.017 347.242 382.678 345.564 379.741C343.885 376.803 342.543 373.322 341.536 369.297C340.529 365.271 340.025 361.083 340.025 356.731C340.025 353.249 340.193 349.605 340.529 345.797C340.865 341.99 341.927 337.42 343.718 332.09C345.508 326.759 348.361 320.449 352.277 313.16C356.193 305.87 361.62 297.058 368.557 286.723C375.494 276.388 384.333 264.366 395.074 250.658C405.815 236.95 418.906 221.067 434.347 203.007C435.018 201.919 436.64 199.689 439.214 196.316C441.787 192.944 444.528 189.082 447.438 184.73C450.346 180.378 452.92 175.809 455.158 171.022C457.395 166.235 458.514 161.992 458.514 158.293C458.514 153.942 456.557 150.841 452.64 148.992C448.724 147.142 444.976 146.217 441.396 146.217C435.577 146.217 428.696 147.849 420.752 151.113C412.808 154.377 404.305 158.619 395.242 163.841C386.179 169.063 376.836 175.102 367.214 181.956C357.592 188.81 348.137 195.827 338.851 203.007C329.564 210.187 320.669 217.313 312.165 224.385C303.662 231.456 296.054 237.82 289.341 243.478C287.998 244.566 285.592 246.905 282.124 250.495C278.655 254.085 274.571 258.219 269.872 262.897C265.173 267.575 260.306 272.525 255.271 277.747C250.236 282.97 245.481 287.865 241.005 292.434C236.53 297.004 232.782 300.92 229.761 304.184C226.74 307.448 224.893 309.406 224.222 310.059C222.88 311.365 221.761 312.67 220.865 313.976C219.971 315.281 218.74 315.934 217.173 315.934C216.054 315.934 215.048 315.499 214.152 314.629C213.257 313.758 212.81 312.888 212.81 312.017C212.81 310.929 213.257 309.896 214.152 308.917C215.048 307.938 216.054 306.904 217.173 305.816C220.978 302.335 225.844 297.113 231.774 290.15C237.705 283.187 244.082 275.409 250.907 266.814C257.733 258.219 264.725 249.244 271.886 239.888C279.047 230.532 285.76 221.665 292.026 213.288C298.291 204.911 303.774 197.459 308.473 190.931C313.172 184.403 316.417 179.725 318.207 176.897C321.117 172.545 323.41 168.085 325.089 163.515C326.767 158.946 327.606 154.812 327.606 151.113C327.606 147.196 326.543 143.987 324.417 141.485C322.292 138.983 318.991 137.732 314.515 137.732C307.802 137.732 299.746 140.125 290.347 144.912C280.949 149.698 271.103 155.682 260.809 162.863C250.515 170.043 240.39 177.712 230.432 185.872C220.474 194.032 211.691 201.484 204.083 208.229C199.607 212.145 194.069 217.367 187.467 223.895C180.866 230.423 173.985 237.44 166.824 244.947C159.663 252.454 152.502 260.015 145.341 267.63C138.181 275.245 131.691 282.262 125.873 288.681C120.055 295.1 115.188 300.431 111.272 304.674C107.356 308.917 105.062 311.365 104.391 312.017C102.153 314.846 100.139 316.261 98.349 316.261C97.23 316.261 96.223 315.879 95.3282 315.118C94.4327 314.357 93.9855 313.432 93.9855 312.344C93.9855 311.038 94.9922 309.406 97.0066 307.448C100.139 304.402 104.167 299.833 109.09 293.74C114.013 287.648 119.384 280.739 125.202 273.015C131.02 265.291 137.118 257.023 143.496 248.21C149.873 239.398 155.971 230.64 161.789 221.937C167.16 213.886 172.363 206.053 177.397 198.438C182.432 190.822 186.908 183.533 190.824 176.57C194.74 169.607 197.817 162.971 200.054 156.661C202.292 150.351 203.411 144.586 203.411 139.364C203.411 130.225 200.502 122.555 194.684 116.354C188.865 110.153 181.201 104.93 171.691 100.687C162.181 96.4444 151.328 92.9088 139.132 90.0803C126.936 87.2515 114.46 84.5316 101.705 81.9207C88.9502 79.3099 76.475 76.5355 64.2792 73.5979C52.0838 70.6606 41.2303 66.9618 31.72 62.5013C22.2093 58.0409 14.5452 52.5468 8.72742 46.0192C2.90891 39.4916 0 31.3323 0 21.5406C0 17.8418 0.503179 14.741 1.51023 12.2389C2.51762 9.73689 3.58028 7.61563 4.69922 5.87484C6.04161 3.91611 7.72003 2.28479 9.73413 0.97886C10.6293 0.326063 11.5241 0 12.4196 0C13.9858 0 14.7694 0.652797 14.7694 1.95806C14.7694 2.61085 14.4333 3.26365 13.762 3.91611C11.3006 6.7449 9.62223 9.41049 8.72742 11.9129C7.83192 14.4149 7.38434 16.7538 7.38434 18.9298C7.38434 25.6747 10.3495 31.3323 16.2796 35.9015C22.2093 40.4711 29.986 44.496 39.6082 47.9772C49.2304 51.4588 60.1954 54.5049 72.5028 57.1161C84.8105 59.7269 97.4535 62.4469 110.433 65.2757C123.412 68.1042 136.055 71.2046 148.362 74.5771C160.67 77.9499 171.635 82.0295 181.258 86.8163C190.88 91.6035 198.656 97.3692 204.586 104.114C210.516 110.859 213.481 119.019 213.481 128.593C213.481 135.991 211.859 144.15 208.614 153.071C205.369 161.992 201.285 171.076 196.362 180.324C191.439 189.571 186.181 198.546 180.586 207.25C174.992 215.953 169.733 223.786 164.81 230.749C159.887 237.712 155.803 243.423 152.558 247.884C149.314 252.344 147.691 255.01 147.691 255.88C148.362 255.445 150.376 253.65 153.733 250.495C157.09 247.34 161.565 242.988 167.16 237.44C172.754 231.892 179.579 225.309 187.635 217.694C195.691 210.079 204.754 201.702 214.823 192.563C238.32 171.675 259.691 155.628 278.935 144.422C298.18 133.217 313.956 127.614 326.263 127.614C330.739 127.614 334.487 128.865 337.508 131.367C340.529 133.869 342.04 138.384 342.04 144.912C342.04 149.264 341.256 153.561 339.69 157.804C338.123 162.047 336.221 166.126 333.983 170.043C331.746 173.959 329.34 177.604 326.767 180.976C324.194 184.349 322.012 187.341 320.221 189.952C319.326 191.258 317.76 193.379 315.522 196.316C313.284 199.254 310.655 202.626 307.634 206.434C304.613 210.242 301.368 214.321 297.9 218.673C294.431 223.025 291.019 227.376 287.662 231.728C279.606 241.955 270.656 253.052 260.809 265.019C260.809 265.019 261.033 264.91 261.48 264.693C267.522 258.6 275.355 251.148 284.977 242.335C294.599 233.523 305.061 224.385 316.361 214.92C327.662 205.455 339.634 196.044 352.277 186.688C364.921 177.332 377.34 168.955 389.536 161.557C401.731 154.159 413.424 148.176 424.612 143.606C435.801 139.037 445.759 136.752 454.487 136.752C459.633 136.752 464.109 138.004 467.913 140.506C471.717 143.008 473.619 147.088 473.619 152.745ZM951.022 287.865C951.022 288.736 950.686 289.388 950.014 289.824L934.91 295.698C932.672 296.569 929.819 297.711 926.351 299.125C922.882 300.539 919.134 301.899 915.106 303.205C911.078 304.511 907.162 305.653 903.358 306.632C899.554 307.611 896.197 308.101 893.288 308.101C889.036 308.101 886.127 307.285 884.561 305.653C882.995 304.021 882.211 302.008 882.211 299.615C882.211 297.221 882.715 294.665 883.721 291.945C884.729 289.225 885.847 286.614 887.078 284.112C888.309 281.61 889.428 279.434 890.434 277.584C891.442 275.735 891.945 274.484 891.945 273.831C891.945 273.613 891.722 273.505 891.274 273.505C890.379 273.505 888.365 274.375 885.232 276.116C882.099 277.856 878.519 279.978 874.491 282.48C870.463 284.982 866.099 287.756 861.4 290.802C856.701 293.849 852.225 296.623 847.974 299.125C843.722 301.627 839.862 303.749 836.393 305.49C832.925 307.23 830.407 308.101 828.841 308.101C827.498 308.101 826.323 307.666 825.316 306.795C824.309 305.925 823.806 304.837 823.806 303.531C823.806 301.791 824.589 299.778 826.156 297.493C827.722 295.209 829.512 292.924 831.526 290.639C833.54 288.355 835.61 286.124 837.736 283.949C839.862 281.773 841.484 280.032 842.603 278.727C842.826 278.509 842.938 278.183 842.938 277.747C842.938 277.095 842.491 276.768 841.596 276.768C841.372 276.768 840.197 277.312 838.072 278.4C820.438 287.423 798.31 299.289 778.247 299.289C772.429 299.289 767.953 297.548 764.82 294.066C759.002 299.723 752.457 304.511 745.184 308.427C737.911 312.344 730.695 314.302 723.534 314.302C720.401 314.302 717.94 313.595 716.15 312.181C714.359 310.766 713.464 308.318 713.464 304.837C713.464 301.224 714.891 296.938 717.743 291.975C702.765 297.823 688.05 302.424 672.498 306.578C664.554 308.699 657.896 309.733 652.526 309.733C648.05 309.733 644.414 308.699 641.617 306.632C638.82 304.565 637.421 301.899 637.421 298.636C637.421 295.589 638.428 292.761 640.442 290.15C642.456 287.539 644.638 285.254 646.988 283.296C649.338 281.338 651.463 279.706 653.365 278.4C655.267 277.095 656.218 276.333 656.218 276.116C656.218 275.681 655.38 275.354 653.701 275.137C652.023 274.919 649.169 274.484 645.141 273.831C642.68 273.396 641.058 272.689 640.274 271.709C639.491 270.731 639.1 269.697 639.1 268.609C639.1 267.086 639.603 265.726 640.61 264.529C641.617 263.333 642.344 262.517 642.792 262.081C647.268 259.253 652.526 256.424 658.568 253.596C664.61 250.767 670.596 248.265 676.525 246.089C682.456 243.913 687.882 242.173 692.805 240.867C697.728 239.561 701.197 238.908 703.211 238.908C705.449 238.908 707.519 239.398 709.421 240.377C711.323 241.357 712.274 243.043 712.274 245.436C712.274 246.524 711.714 247.666 710.595 248.863C709.476 250.06 708.134 251.148 706.568 252.127C705.001 253.106 703.323 253.922 701.533 254.575C699.742 255.228 698.176 255.554 696.834 255.554C695.715 255.554 694.651 255.336 693.645 254.901C692.638 254.466 692.134 253.704 692.134 252.616C692.134 251.311 692.694 249.897 693.812 248.374C694.26 247.938 694.484 247.503 694.484 247.068C694.484 246.633 693.924 246.415 692.805 246.415C692.358 246.415 691.686 246.47 690.792 246.579C689.896 246.687 688.889 246.851 687.771 247.068C685.981 247.503 683.407 248.319 680.05 249.516C676.694 250.713 673.337 252.072 669.98 253.596C666.624 255.119 663.603 256.533 660.918 257.839C658.232 259.144 656.554 260.069 655.883 260.504C654.988 261.157 654.54 261.809 654.54 262.462C654.54 263.55 655.211 264.312 656.554 264.747C660.897 265.445 666.106 265.4 670.987 265.4C673.449 265.617 674.903 266.053 675.351 266.705C675.799 267.412 676.022 268.5 676.022 270.023C676.022 271.111 675.799 272.199 675.351 273.287C674.903 274.429 673.449 275.191 670.987 275.626C666.288 276.714 661.757 278.564 657.393 281.174C653.03 283.84 650.848 287.321 650.848 291.727C650.848 294.774 652.582 297.058 656.051 298.473C659.519 299.887 662.819 300.594 665.953 300.594C671.771 300.594 677.924 299.778 684.414 298.146C697.464 294.864 709.264 291.077 721.672 285.907C725.387 280.639 729.701 275.526 734.611 270.567C740.429 264.693 746.415 259.688 752.568 255.554C758.723 251.42 763.814 249.353 767.841 249.353C768.96 249.353 770.023 249.734 771.03 250.495C772.037 251.257 772.541 251.964 772.541 252.616C772.541 253.052 772.205 253.324 771.534 253.432C770.862 253.541 770.191 253.596 769.52 253.596C766.835 253.596 763.086 255.282 758.275 258.655C753.464 262.027 748.709 265.998 744.01 270.567C739.31 275.137 735.282 279.923 731.926 284.928C728.569 289.932 726.891 294.066 726.891 297.33C726.891 302.117 729.352 304.511 734.275 304.511C738.303 304.511 742.834 303.151 747.87 300.431C752.904 297.711 757.66 294.393 762.135 290.476C760.569 287.648 759.786 284.058 759.786 279.706C759.786 276.66 760.289 273.559 761.296 270.404C762.303 267.249 763.701 264.475 765.492 262.081C767.282 259.688 769.463 257.73 772.037 256.207C774.611 254.684 777.464 253.922 780.596 253.922C784.848 253.922 786.974 255.88 786.974 259.851C786.974 263.333 785.464 267.739 782.443 273.015C779.422 278.292 775.338 283.622 770.191 289.116C772.652 292.217 776.233 293.74 780.932 293.74C784.065 293.74 787.31 293.414 790.666 292.761C812.39 288.534 836.884 275.801 855.022 263.061C856.23 262.25 858.143 261.755 859.722 261.755C861.512 261.755 862.407 262.952 862.407 265.345C862.407 267.086 861.4 269.262 859.386 271.873C857.372 274.484 855.078 277.149 852.505 279.869C849.931 282.589 847.638 285.2 845.624 287.702C843.61 290.204 842.603 292.108 842.603 293.414C842.603 295.154 843.498 296.025 845.288 296.025C846.631 296.025 849.316 294.774 853.344 292.271C869.535 282.214 889.253 267.409 906.211 259.797C907.666 259.144 908.952 258.818 910.071 258.818C911.19 258.818 911.861 259.199 912.085 259.96C912.309 260.722 912.42 261.32 912.42 261.755C912.42 262.625 912.197 263.496 911.749 264.366C911.301 265.237 910.854 266.107 910.407 266.977C909.736 267.847 908.617 269.371 907.05 271.547C905.484 273.722 903.973 276.116 902.518 278.727C901.064 281.338 899.72 284.005 898.491 286.723C897.26 289.442 896.644 291.89 896.644 294.066C896.644 297.983 898.994 299.941 903.694 299.941C906.155 299.941 908.896 299.561 911.917 298.799C914.938 298.037 917.959 297.167 920.98 296.188C924.001 295.209 926.798 294.23 929.372 293.25C931.945 292.271 933.903 291.564 935.246 291.129C939.721 289.388 943.078 288.083 945.316 287.212C946.658 286.56 948.001 286.016 949.343 285.58C949.791 285.58 950.183 285.852 950.518 286.396C950.854 286.94 951.022 287.43 951.022 287.865ZM780.932 265.019C780.932 261.973 778.919 260.45 774.89 260.45C772.429 260.45 770.359 262.027 768.681 265.182C767.002 268.337 766.163 271.873 766.163 275.789C766.163 277.53 766.275 279.162 766.499 280.685C766.722 282.208 767.17 283.731 767.841 285.254C771.646 281.555 774.778 277.856 777.24 274.157C779.701 270.459 780.932 267.412 780.932 265.019Z" fill="#F4F4F4"/>
</svg>
