<svg width="1077" height="453" viewBox="0 0 1077 453" fill="none" xmlns="http://www.w3.org/2000/svg">
<path opacity="0.7" d="M856.042 115.331C856.042 122.665 852.938 132.024 846.729 143.405C840.521 154.786 832.221 167.243 821.831 180.774C811.441 194.305 799.34 208.405 785.529 223.074C771.718 237.744 757.21 251.971 742.005 265.754C726.8 279.539 711.468 292.438 696.01 304.452C680.551 316.465 665.726 326.645 651.535 334.991C647.987 351.431 646.213 367.112 646.213 382.034C646.213 385.575 645.77 388.041 644.883 389.432C643.995 390.823 642.158 391.519 639.371 391.519L635.949 391.139C633.922 390.887 632.592 389.812 631.958 387.915C631.325 386.018 631.008 383.805 631.008 381.276C631.008 368.882 632.275 356.489 634.809 344.096C627.46 347.637 620.554 350.419 614.092 352.443C607.63 354.466 601.865 355.478 596.797 355.478C591.728 355.478 587.801 354.466 585.013 352.443C582.225 350.419 580.198 348.143 578.931 345.614C577.729 343.416 576.923 340.98 576.513 338.309L562.966 343.717C560.432 344.729 557.2 346.056 553.273 347.7C549.345 349.344 545.1 350.925 540.539 352.443C535.977 353.961 531.542 355.288 527.234 356.426C522.926 357.564 519.124 358.134 515.83 358.134C512.536 358.134 509.938 357.438 508.038 356.047C506.137 354.656 504.617 353.075 503.476 351.305C502.336 349.534 501.575 347.763 501.196 345.993C500.815 344.223 500.625 342.832 500.625 341.82C500.625 338.532 501.259 335.56 502.526 332.904C503.793 330.249 504.806 328.289 505.567 327.024C501.512 329.553 497.647 331.767 493.973 333.663C490.299 335.56 487.701 336.761 486.18 337.268C484.407 338.026 482.442 338.785 480.289 339.544C478.134 340.303 475.917 341.188 473.636 342.199C473.129 342.199 472.686 341.883 472.305 341.251C471.926 340.619 471.736 340.049 471.736 339.544C471.736 338.532 471.989 337.9 472.496 337.647C474.523 336.888 476.487 336.129 478.388 335.371C480.289 334.612 481.999 333.853 483.519 333.094C489.348 330.312 494.416 327.53 498.725 324.748C503.793 321.713 507.531 318.994 509.938 316.591C512.346 314.189 513.93 311.976 514.69 309.952C515.45 307.929 516.21 306.348 516.971 305.21C517.731 304.072 518.745 303.503 520.012 303.503C521.785 303.503 523.369 303.945 524.763 304.831C526.157 305.716 526.854 307.17 526.854 309.193C526.854 309.952 526.474 310.964 525.714 312.229C525.206 312.987 524.32 314.315 523.053 316.212C521.785 318.109 520.582 320.259 519.441 322.661C518.301 325.064 517.287 327.656 516.4 330.439C515.514 333.221 515.07 335.876 515.07 338.406C515.07 341.188 516.084 343.59 518.111 345.614C520.139 347.637 523.306 348.649 527.615 348.649C530.402 348.649 533.506 348.207 536.927 347.321C540.348 346.436 543.77 345.424 547.191 344.286C550.612 343.148 553.779 342.01 556.694 340.872C559.608 339.733 561.826 338.912 563.346 338.406C568.414 336.382 572.216 334.865 574.75 333.853C575.312 333.573 575.881 333.306 576.456 333.055C577.116 327.707 579.524 322.852 583.682 318.488C588.623 313.304 594.643 308.941 601.738 305.4C608.834 301.859 616.247 299.14 623.975 297.243C631.705 295.346 638.357 294.397 643.932 294.397C645.96 294.397 646.973 295.283 646.973 297.053C646.973 298.824 646.086 299.709 644.312 299.709L642.095 299.33C636.773 299.33 631.135 300.215 625.053 301.986C619.034 303.756 613.459 306.159 608.264 309.193C603.132 312.229 598.887 315.77 595.593 319.816C592.362 323.863 590.715 328.163 590.715 332.715C590.715 336.003 591.601 338.596 593.375 340.492C595.149 342.389 597.05 343.717 599.077 344.476C601.612 345.487 604.399 345.993 607.44 345.993C615.486 345.993 625.369 342.958 637.026 336.888C641.588 318.172 648.367 299.14 657.363 279.792C666.296 260.443 676.623 241.664 688.28 223.454C699.937 205.244 712.482 188.108 726.039 172.048C739.597 155.988 753.028 142.014 766.46 130.127C779.891 118.24 792.815 108.818 805.359 101.863C817.903 94.9077 829.117 91.4298 838.937 91.4298C845.019 91.4298 849.39 93.3905 852.051 97.3106C854.712 101.231 856.042 107.238 856.042 115.331ZM839.317 116.09C839.317 111.284 837.923 107.743 835.135 105.467C832.348 103.191 828.673 102.053 824.112 102.053C817.523 102.053 809.413 105.025 799.783 110.968C790.154 116.911 779.828 125.131 768.803 135.628C757.78 146.124 746.439 158.517 734.782 172.807C723.125 187.097 712.101 202.588 701.711 219.281C691.321 235.973 681.881 253.488 673.392 271.825C664.903 290.162 658.25 308.688 653.435 327.404C665.599 320.069 678.65 311.09 692.589 300.467C706.526 289.845 720.337 278.274 734.022 265.754C747.706 253.235 760.948 240.147 773.745 226.489C786.542 212.831 797.756 199.427 807.386 186.275C817.016 173.123 824.745 160.477 830.574 148.337C836.403 136.197 839.317 125.448 839.317 116.09ZM557.264 259.875C557.264 261.645 556.757 263.605 555.744 265.754C554.729 267.904 553.462 269.928 551.942 271.825C550.422 273.722 548.711 275.302 546.81 276.567C544.91 277.831 542.946 278.464 540.919 278.464C536.357 278.464 534.076 276.44 534.076 272.394C534.076 270.623 534.583 268.663 535.596 266.513C536.611 264.364 537.878 262.34 539.398 260.443C540.919 258.546 542.693 256.966 544.72 255.701C546.747 254.436 548.647 253.804 550.422 253.804C554.983 253.804 557.264 255.828 557.264 259.875ZM536.357 177.549C536.357 183.619 534.52 190.258 530.846 197.466C527.171 204.675 522.546 212.199 516.971 220.04C511.396 227.88 505.25 235.721 498.535 243.561C491.819 251.402 485.547 258.862 479.719 265.945C473.13 273.785 466.351 282.384 459.382 291.742C452.413 301.1 445.761 310.711 439.426 320.575C433.09 330.439 427.262 340.239 421.939 349.976C416.618 359.714 412.183 368.882 408.635 377.482C406.608 382.54 405.214 387.472 404.454 392.277C403.694 397.083 403.313 401.635 403.313 405.935C403.313 414.534 404.327 422.185 406.354 428.888C408.382 435.59 410.156 440.711 411.676 444.253C412.183 445.264 412.436 446.529 412.436 448.046C412.436 449.817 411.802 451.018 410.536 451.65C409.269 452.282 407.748 452.599 405.974 452.599C403.187 452.599 400.526 451.587 397.992 449.563C395.458 447.54 393.24 444.821 391.339 441.407C389.439 437.992 387.918 433.946 386.778 429.267C385.638 424.588 385.067 419.719 385.067 414.661C385.067 410.614 385.257 406.378 385.638 401.952C386.018 397.526 387.221 392.214 389.249 386.018C391.276 379.821 394.507 372.486 398.942 364.014C403.377 355.541 409.522 345.298 417.378 333.284C425.234 321.27 435.244 307.296 447.408 291.363C459.572 275.429 474.397 256.966 491.883 235.973C492.643 234.709 494.48 232.116 497.395 228.196C500.309 224.276 503.413 219.787 506.708 214.728C510.002 209.67 512.917 204.359 515.451 198.795C517.984 193.23 519.252 188.298 519.252 183.999C519.252 178.94 517.035 175.336 512.6 173.186C508.165 171.036 503.92 169.961 499.865 169.961C493.276 169.961 485.484 171.858 476.487 175.652C467.491 179.446 457.861 184.378 447.598 190.448C437.335 196.518 426.754 203.537 415.857 211.504C404.961 219.47 394.253 227.627 383.737 235.973C373.22 244.32 363.146 252.603 353.517 260.823C343.887 269.043 335.271 276.44 327.668 283.017C326.147 284.281 323.424 287 319.496 291.173C315.567 295.346 310.943 300.151 305.621 305.589C300.3 311.027 294.788 316.781 289.086 322.851C283.383 328.921 277.999 334.612 272.93 339.923C267.862 345.235 263.618 349.787 260.196 353.581C256.775 357.375 254.684 359.651 253.924 360.41C252.404 361.927 251.136 363.444 250.123 364.962C249.109 366.48 247.715 367.238 245.941 367.238C244.674 367.238 243.534 366.733 242.52 365.721C241.507 364.709 241 363.698 241 362.686C241 361.421 241.507 360.22 242.52 359.082C243.534 357.944 244.674 356.742 245.941 355.478C250.25 351.431 255.761 345.361 262.477 337.268C269.193 329.174 276.415 320.132 284.144 310.142C291.873 300.151 299.792 289.719 307.902 278.843C316.011 267.968 323.614 257.661 330.709 247.924C337.805 238.187 344.013 229.524 349.335 221.936C354.657 214.349 358.332 208.911 360.359 205.623C363.654 200.565 366.251 195.38 368.152 190.069C370.052 184.757 371.003 179.952 371.003 175.652C371.003 171.1 369.799 167.369 367.391 164.461C364.984 161.552 361.246 160.098 356.178 160.098C348.575 160.098 339.452 162.88 328.809 168.444C318.166 174.008 307.014 180.963 295.357 189.31C283.7 197.656 272.233 206.571 260.957 216.056C249.679 225.541 239.733 234.203 231.117 242.044C226.048 246.596 219.776 252.666 212.3 260.254C204.825 267.842 197.032 275.998 188.922 284.724C180.813 293.45 172.703 302.238 164.594 311.09C156.485 319.943 149.136 328.099 142.547 335.56C135.958 343.021 130.446 349.218 126.012 354.15C121.577 359.082 118.979 361.927 118.219 362.686C115.685 365.974 113.404 367.618 111.377 367.618C110.11 367.618 108.969 367.175 107.956 366.29C106.942 365.405 106.435 364.33 106.435 363.065C106.435 361.548 107.575 359.651 109.857 357.375C113.404 353.834 117.965 348.523 123.541 341.441C129.116 334.359 135.198 326.329 141.787 317.351C148.376 308.371 155.281 298.761 162.504 288.517C169.726 278.274 176.632 268.094 183.221 257.978C189.303 248.619 195.195 239.514 200.896 230.662C206.598 221.81 211.667 213.337 216.101 205.244C220.536 197.15 224.021 189.436 226.555 182.102C229.089 174.767 230.356 168.065 230.356 161.995C230.356 151.372 227.062 142.457 220.473 135.249C213.884 128.04 205.204 121.97 194.435 117.038C183.664 112.106 171.373 107.996 157.562 104.709C143.751 101.42 129.623 98.2587 115.178 95.2239C100.733 92.189 86.6054 88.9641 72.794 85.5495C58.9831 82.1352 46.692 77.8357 35.9218 72.6509C25.1513 67.4662 16.472 61.0799 9.88351 53.4923C3.29424 45.9046 0 36.4203 0 25.0386C0 20.7391 0.569834 17.1348 1.71028 14.2264C2.85112 11.3181 4.05454 8.85234 5.32171 6.82886C6.84192 4.55205 8.74267 2.65582 11.0236 1.13782C12.0373 0.379012 13.0506 0 14.0648 0C15.8384 0 16.7258 0.758806 16.7258 2.27603C16.7258 3.03483 16.3453 3.79364 15.585 4.55205C12.7976 7.84021 10.8968 10.9387 9.88351 13.8474C8.86938 16.7558 8.36252 19.4744 8.36252 22.0038C8.36252 29.844 11.7205 36.4203 18.4361 41.7316C25.1513 47.0432 33.9581 51.7217 44.855 55.7683C55.7518 59.8153 68.1693 63.356 82.1069 66.3912C96.045 69.426 110.363 72.5877 125.062 75.8759C139.759 79.1636 154.078 82.7676 168.015 86.6877C181.954 90.6082 194.371 95.3503 205.268 100.914C216.165 106.479 224.971 113.181 231.687 121.022C238.402 128.862 241.76 138.347 241.76 149.475C241.76 158.074 239.923 167.559 236.248 177.929C232.574 188.298 227.949 198.857 222.374 209.607C216.799 220.356 210.843 230.789 204.508 240.905C198.172 251.022 192.217 260.127 186.642 268.221C181.066 276.314 176.442 282.953 172.767 288.138C169.093 293.322 167.255 296.421 167.255 297.433C168.015 296.927 170.296 294.84 174.097 291.173C177.899 287.506 182.967 282.447 189.303 275.998C195.638 269.548 203.367 261.898 212.49 253.046C221.613 244.193 231.877 234.456 243.28 223.833C269.889 199.553 294.091 180.9 315.884 167.875C337.678 154.85 355.544 148.337 369.482 148.337C374.551 148.337 378.796 149.791 382.216 152.7C385.638 155.608 387.348 160.856 387.348 168.444C387.348 173.503 386.461 178.497 384.687 183.43C382.913 188.361 380.759 193.104 378.225 197.656C375.691 202.209 372.967 206.445 370.052 210.365C367.138 214.286 364.667 217.763 362.64 220.798C361.626 222.316 359.853 224.782 357.318 228.196C354.784 231.611 351.806 235.531 348.385 239.957C344.964 244.383 341.289 249.125 337.362 254.184C333.433 259.242 329.569 264.3 325.768 269.359C316.645 281.246 306.508 294.145 295.357 308.055C295.357 308.055 295.611 307.929 296.118 307.676C302.96 300.594 311.83 291.932 322.727 281.688C333.623 271.445 345.471 260.823 358.269 249.821C371.066 238.819 384.624 227.88 398.942 217.004C413.26 206.129 427.325 196.392 441.136 187.792C454.947 179.193 468.188 172.238 480.859 166.927C493.53 161.615 504.807 158.959 514.691 158.959C520.519 158.959 525.587 160.414 529.895 163.322C534.203 166.231 536.357 170.973 536.357 177.549ZM1077 334.612C1077 335.624 1076.62 336.382 1075.86 336.888L1058.75 343.717C1056.22 344.729 1052.99 346.056 1049.06 347.7C1045.13 349.344 1040.89 350.925 1036.33 352.443C1031.76 353.961 1027.33 355.288 1023.02 356.426C1018.71 357.564 1014.91 358.134 1011.62 358.134C1006.8 358.134 1003.51 357.185 1001.73 355.288C999.961 353.391 999.074 351.051 999.074 348.27C999.074 345.487 999.645 342.516 1000.78 339.354C1001.93 336.193 1003.19 333.158 1004.59 330.249C1005.98 327.34 1007.25 324.811 1008.39 322.661C1009.53 320.511 1010.1 319.057 1010.1 318.298C1010.1 318.046 1009.84 317.919 1009.34 317.919C1008.32 317.919 1006.04 318.931 1002.49 320.954C998.947 322.978 994.893 325.443 990.331 328.352C985.77 331.261 980.828 334.485 975.506 338.026C970.185 341.567 965.116 344.792 960.301 347.7C955.487 350.609 951.115 353.075 947.187 355.098C943.259 357.121 940.408 358.134 938.634 358.134C937.114 358.134 935.783 357.628 934.643 356.616C933.502 355.604 932.932 354.34 932.932 352.822C932.932 350.799 933.819 348.459 935.593 345.803C937.367 343.148 939.394 340.492 941.675 337.836C943.956 335.181 946.3 332.588 948.707 330.06C951.115 327.53 952.952 325.507 954.219 323.989C954.472 323.736 954.599 323.357 954.599 322.851C954.599 322.092 954.093 321.713 953.079 321.713C952.825 321.713 951.495 322.345 949.088 323.61C929.119 334.098 904.06 347.891 881.338 347.891C874.75 347.891 869.681 345.867 866.133 341.82C859.544 348.396 852.132 353.961 843.896 358.513C835.659 363.065 827.487 365.341 819.378 365.341C815.83 365.341 813.043 364.52 811.015 362.876C808.988 361.232 807.974 358.386 807.974 354.34C807.974 350.14 809.589 345.157 812.82 339.389C795.858 346.187 779.193 351.535 761.581 356.363C752.585 358.829 745.045 360.03 738.963 360.03C733.895 360.03 729.777 358.829 726.61 356.426C723.442 354.023 721.858 350.925 721.858 347.132C721.858 343.59 722.998 340.303 725.279 337.268C727.56 334.233 730.031 331.577 732.692 329.3C735.353 327.024 737.76 325.127 739.914 323.61C742.068 322.092 743.145 321.207 743.145 320.954C743.145 320.449 742.195 320.069 740.294 319.816C738.394 319.563 735.162 319.057 730.601 318.298C727.813 317.793 725.976 316.971 725.089 315.833C724.202 314.695 723.759 313.493 723.759 312.229C723.759 310.458 724.328 308.877 725.469 307.486C726.61 306.095 727.433 305.147 727.94 304.641C733.008 301.353 738.963 298.065 745.806 294.777C752.648 291.489 759.427 288.581 766.142 286.051C772.858 283.522 779.003 281.499 784.579 279.981C790.154 278.464 794.082 277.705 796.362 277.705C798.897 277.705 801.241 278.274 803.395 279.412C805.549 280.551 806.626 282.511 806.626 285.293C806.626 286.557 805.992 287.885 804.725 289.276C803.458 290.667 801.938 291.932 800.164 293.07C798.39 294.208 796.489 295.157 794.462 295.915C792.434 296.674 790.661 297.053 789.14 297.053C787.873 297.053 786.669 296.8 785.529 296.294C784.389 295.789 783.818 294.903 783.818 293.639C783.818 292.121 784.452 290.478 785.719 288.707C786.226 288.201 786.479 287.695 786.479 287.19C786.479 286.684 785.846 286.431 784.579 286.431C784.072 286.431 783.311 286.494 782.298 286.621C781.284 286.747 780.144 286.937 778.877 287.19C776.85 287.695 773.935 288.644 770.134 290.035C766.333 291.426 762.531 293.006 758.73 294.777C754.929 296.548 751.508 298.191 748.467 299.709C745.426 301.226 743.525 302.301 742.765 302.807C741.751 303.566 741.245 304.325 741.245 305.084C741.245 306.348 742.005 307.234 743.525 307.739C748.444 308.551 754.343 308.498 759.87 308.498C762.658 308.751 764.305 309.257 764.812 310.016C765.319 310.837 765.572 312.102 765.572 313.873C765.572 315.137 765.319 316.402 764.812 317.666C764.305 318.994 762.658 319.879 759.87 320.385C754.549 321.65 749.417 323.8 744.475 326.834C739.534 329.932 737.063 333.979 737.063 339.101C737.063 342.642 739.027 345.298 742.955 346.942C746.883 348.586 750.621 349.408 754.169 349.408C760.757 349.408 767.726 348.459 775.076 346.562C789.855 342.747 803.218 338.346 817.27 332.336C821.477 326.212 826.361 320.269 831.922 314.505C838.511 307.676 845.29 301.859 852.258 297.053C859.228 292.248 864.993 289.845 869.554 289.845C870.821 289.845 872.025 290.288 873.166 291.173C874.306 292.059 874.876 292.88 874.876 293.639C874.876 294.145 874.496 294.461 873.736 294.587C872.975 294.714 872.215 294.777 871.455 294.777C868.414 294.777 864.169 296.737 858.721 300.658C853.272 304.578 847.887 309.193 842.566 314.505C837.243 319.816 832.682 325.38 828.881 331.197C825.079 337.015 823.179 341.82 823.179 345.614C823.179 351.178 825.967 353.961 831.542 353.961C836.103 353.961 841.235 352.38 846.937 349.218C852.639 346.056 858.024 342.199 863.092 337.647C861.318 334.359 860.431 330.186 860.431 325.127C860.431 321.586 861.001 317.982 862.142 314.315C863.283 310.648 864.866 307.423 866.893 304.641C868.921 301.859 871.391 299.583 874.306 297.812C877.22 296.042 880.451 295.157 883.999 295.157C888.814 295.157 891.222 297.433 891.222 302.048C891.222 306.095 889.511 311.217 886.09 317.351C882.669 323.483 878.044 329.68 872.215 336.066C875.003 339.671 879.057 341.441 884.379 341.441C887.927 341.441 891.601 341.062 895.403 340.303C920.004 335.39 947.742 320.588 968.284 305.779C969.651 304.837 971.817 304.262 973.605 304.262C975.633 304.262 976.647 305.653 976.647 308.435C976.647 310.458 975.506 312.987 973.226 316.022C970.945 319.057 968.347 322.156 965.433 325.317C962.518 328.479 959.921 331.513 957.64 334.422C955.359 337.331 954.219 339.544 954.219 341.062C954.219 343.085 955.233 344.096 957.26 344.096C958.78 344.096 961.822 342.642 966.383 339.733C984.719 328.043 1007.05 310.834 1026.25 301.986C1027.9 301.226 1029.36 300.847 1030.62 300.847C1031.89 300.847 1032.65 301.29 1032.91 302.175C1033.16 303.06 1033.29 303.756 1033.29 304.262C1033.29 305.273 1033.03 306.285 1032.53 307.296C1032.02 308.309 1031.51 309.32 1031 310.332C1030.24 311.343 1028.98 313.114 1027.2 315.643C1025.43 318.172 1023.72 320.954 1022.07 323.989C1020.42 327.024 1018.9 330.125 1017.51 333.284C1016.12 336.445 1015.42 339.291 1015.42 341.82C1015.42 346.372 1018.08 348.649 1023.4 348.649C1026.19 348.649 1029.29 348.207 1032.72 347.321C1036.14 346.436 1039.56 345.424 1042.98 344.286C1046.4 343.148 1049.57 342.01 1052.48 340.872C1055.4 339.733 1057.61 338.912 1059.13 338.406C1064.2 336.382 1068 334.865 1070.54 333.853C1072.06 333.094 1073.58 332.462 1075.1 331.956C1075.61 331.956 1076.05 332.272 1076.43 332.904C1076.81 333.537 1077 334.106 1077 334.612ZM884.379 308.055C884.379 304.514 882.099 302.744 877.537 302.744C874.75 302.744 872.405 304.578 870.505 308.245C868.604 311.913 867.654 316.022 867.654 320.575C867.654 322.599 867.781 324.495 868.034 326.266C868.287 328.036 868.794 329.806 869.554 331.577C873.863 327.277 877.41 322.978 880.198 318.678C882.985 314.379 884.379 310.837 884.379 308.055Z" fill="#F4F4F4"/>
</svg>
